iamtodor

DownloadSources --stacktrace

May 31st, 2020
137
Never
Not a member of Pastebin yet? Sign Up, it unlocks many cool features!
  1. 21:18:26: Executing task 'DownloadSources --stacktrace'...
  2.  
  3. :DownloadSources FAILED
  4.  
  5. FAILURE: Build failed with an exception.
  6.  
  7. * Where:
  8. Initialization script '/private/var/folders/06/97bzw1l51r59l65thfzs7hd80000gn/T/ijmiscinit1.gradle' line: 14
  9.  
  10. * What went wrong:
  11. Execution failed for task ':DownloadSources'.
  12. > Could not resolve all dependencies for configuration ':downloadSourcesFrom_MavenRepo_83e32f83-781f-462e-bbad-f2dc9592fb96'.
  13. > java.lang.NullPointerException (no error message)
  14.  
  15. * Try:
  16. Run with --info or --debug option to get more log output.
  17.  
  18. * Exception is:
  19. org.gradle.api.tasks.TaskExecutionException: Execution failed for task ':DownloadSources'.
  20. at org.gradle.api.internal.tasks.execution.ExecuteActionsTaskExecuter.executeActions(ExecuteActionsTaskExecuter.java:84)
  21. at org.gradle.api.internal.tasks.execution.ExecuteActionsTaskExecuter.execute(ExecuteActionsTaskExecuter.java:55)
  22. at org.gradle.api.internal.tasks.execution.SkipUpToDateTaskExecuter.execute(SkipUpToDateTaskExecuter.java:61)
  23. at org.gradle.api.internal.tasks.execution.ValidatingTaskExecuter.execute(ValidatingTaskExecuter.java:58)
  24. at org.gradle.api.internal.tasks.execution.SkipEmptySourceFilesTaskExecuter.execute(SkipEmptySourceFilesTaskExecuter.java:88)
  25. at org.gradle.api.internal.tasks.execution.ResolveTaskArtifactStateTaskExecuter.execute(ResolveTaskArtifactStateTaskExecuter.java:45)
  26. at org.gradle.api.internal.tasks.execution.SkipTaskWithNoActionsExecuter.execute(SkipTaskWithNoActionsExecuter.java:51)
  27. at org.gradle.api.internal.tasks.execution.SkipOnlyIfTaskExecuter.execute(SkipOnlyIfTaskExecuter.java:54)
  28. at org.gradle.api.internal.tasks.execution.ExecuteAtMostOnceTaskExecuter.execute(ExecuteAtMostOnceTaskExecuter.java:43)
  29. at org.gradle.api.internal.tasks.execution.CatchExceptionTaskExecuter.execute(CatchExceptionTaskExecuter.java:34)
  30. at org.gradle.execution.taskgraph.DefaultTaskGraphExecuter$EventFiringTaskWorker.execute(DefaultTaskGraphExecuter.java:233)
  31. at org.gradle.execution.taskgraph.DefaultTaskGraphExecuter$EventFiringTaskWorker.execute(DefaultTaskGraphExecuter.java:215)
  32. at org.gradle.execution.taskgraph.AbstractTaskPlanExecutor$TaskExecutorWorker.processTask(AbstractTaskPlanExecutor.java:74)
  33. at org.gradle.execution.taskgraph.AbstractTaskPlanExecutor$TaskExecutorWorker.run(AbstractTaskPlanExecutor.java:55)
  34. at org.gradle.execution.taskgraph.DefaultTaskPlanExecutor.process(DefaultTaskPlanExecutor.java:32)
  35. at org.gradle.execution.taskgraph.DefaultTaskGraphExecuter.execute(DefaultTaskGraphExecuter.java:113)
  36. at org.gradle.execution.SelectedTaskExecutionAction.execute(SelectedTaskExecutionAction.java:37)
  37. at org.gradle.execution.DefaultBuildExecuter.execute(DefaultBuildExecuter.java:37)
  38. at org.gradle.execution.DefaultBuildExecuter.access$000(DefaultBuildExecuter.java:23)
  39. at org.gradle.execution.DefaultBuildExecuter$1.proceed(DefaultBuildExecuter.java:43)
  40. at org.gradle.execution.DryRunBuildExecutionAction.execute(DryRunBuildExecutionAction.java:32)
  41. at org.gradle.execution.DefaultBuildExecuter.execute(DefaultBuildExecuter.java:37)
  42. at org.gradle.execution.DefaultBuildExecuter.execute(DefaultBuildExecuter.java:30)
  43. at org.gradle.initialization.DefaultGradleLauncher$4.run(DefaultGradleLauncher.java:197)
  44. at org.gradle.internal.Factories$1.create(Factories.java:25)
  45. at org.gradle.internal.progress.DefaultBuildOperationExecutor.run(DefaultBuildOperationExecutor.java:91)
  46. at org.gradle.internal.progress.DefaultBuildOperationExecutor.run(DefaultBuildOperationExecutor.java:53)
  47. at org.gradle.initialization.DefaultGradleLauncher.doBuildStages(DefaultGradleLauncher.java:194)
  48. at org.gradle.initialization.DefaultGradleLauncher.access$200(DefaultGradleLauncher.java:36)
  49. at org.gradle.initialization.DefaultGradleLauncher$1.create(DefaultGradleLauncher.java:118)
  50. at org.gradle.initialization.DefaultGradleLauncher$1.create(DefaultGradleLauncher.java:112)
  51. at org.gradle.internal.progress.DefaultBuildOperationExecutor.run(DefaultBuildOperationExecutor.java:91)
  52. at org.gradle.internal.progress.DefaultBuildOperationExecutor.run(DefaultBuildOperationExecutor.java:63)
  53. at org.gradle.initialization.DefaultGradleLauncher.doBuild(DefaultGradleLauncher.java:112)
  54. at org.gradle.initialization.DefaultGradleLauncher.run(DefaultGradleLauncher.java:98)
  55. at org.gradle.launcher.exec.GradleBuildController.run(GradleBuildController.java:66)
  56. at org.gradle.tooling.internal.provider.runner.BuildModelActionRunner.run(BuildModelActionRunner.java:52)
  57. at org.gradle.launcher.exec.ChainingBuildActionRunner.run(ChainingBuildActionRunner.java:35)
  58. at org.gradle.tooling.internal.provider.runner.SubscribableBuildActionRunner.run(SubscribableBuildActionRunner.java:58)
  59. at org.gradle.launcher.exec.ChainingBuildActionRunner.run(ChainingBuildActionRunner.java:35)
  60. at org.gradle.launcher.exec.InProcessBuildActionExecuter.execute(InProcessBuildActionExecuter.java:41)
  61. at org.gradle.launcher.exec.InProcessBuildActionExecuter.execute(InProcessBuildActionExecuter.java:26)
  62. at org.gradle.tooling.internal.provider.ContinuousBuildActionExecuter.execute(ContinuousBuildActionExecuter.java:75)
  63. at org.gradle.tooling.internal.provider.ContinuousBuildActionExecuter.execute(ContinuousBuildActionExecuter.java:49)
  64. at org.gradle.tooling.internal.provider.ServicesSetupBuildActionExecuter.execute(ServicesSetupBuildActionExecuter.java:44)
  65. at org.gradle.tooling.internal.provider.ServicesSetupBuildActionExecuter.execute(ServicesSetupBuildActionExecuter.java:29)
  66. at org.gradle.launcher.daemon.server.exec.ExecuteBuild.doBuild(ExecuteBuild.java:67)
  67. at org.gradle.launcher.daemon.server.exec.BuildCommandOnly.execute(BuildCommandOnly.java:36)
  68. at org.gradle.launcher.daemon.server.api.DaemonCommandExecution.proceed(DaemonCommandExecution.java:120)
  69. at org.gradle.launcher.daemon.server.exec.WatchForDisconnection.execute(WatchForDisconnection.java:47)
  70. at org.gradle.launcher.daemon.server.api.DaemonCommandExecution.proceed(DaemonCommandExecution.java:120)
  71. at org.gradle.launcher.daemon.server.exec.ResetDeprecationLogger.execute(ResetDeprecationLogger.java:26)
  72. at org.gradle.launcher.daemon.server.api.DaemonCommandExecution.proceed(DaemonCommandExecution.java:120)
  73. at org.gradle.launcher.daemon.server.exec.RequestStopIfSingleUsedDaemon.execute(RequestStopIfSingleUsedDaemon.java:34)
  74. at org.gradle.launcher.daemon.server.api.DaemonCommandExecution.proceed(DaemonCommandExecution.java:120)
  75. at org.gradle.launcher.daemon.server.exec.ForwardClientInput$2.call(ForwardClientInput.java:74)
  76. at org.gradle.launcher.daemon.server.exec.ForwardClientInput$2.call(ForwardClientInput.java:72)
  77. at org.gradle.util.Swapper.swap(Swapper.java:38)
  78. at org.gradle.launcher.daemon.server.exec.ForwardClientInput.execute(ForwardClientInput.java:72)
  79. at org.gradle.launcher.daemon.server.api.DaemonCommandExecution.proceed(DaemonCommandExecution.java:120)
  80. at org.gradle.launcher.daemon.server.exec.LogAndCheckHealth.execute(LogAndCheckHealth.java:55)
  81. at org.gradle.launcher.daemon.server.api.DaemonCommandExecution.proceed(DaemonCommandExecution.java:120)
  82. at org.gradle.launcher.daemon.server.exec.LogToClient.doBuild(LogToClient.java:60)
  83. at org.gradle.launcher.daemon.server.exec.BuildCommandOnly.execute(BuildCommandOnly.java:36)
  84. at org.gradle.launcher.daemon.server.api.DaemonCommandExecution.proceed(DaemonCommandExecution.java:120)
  85. at org.gradle.launcher.daemon.server.exec.EstablishBuildEnvironment.doBuild(EstablishBuildEnvironment.java:72)
  86. at org.gradle.launcher.daemon.server.exec.BuildCommandOnly.execute(BuildCommandOnly.java:36)
  87. at org.gradle.launcher.daemon.server.api.DaemonCommandExecution.proceed(DaemonCommandExecution.java:120)
  88. at org.gradle.launcher.daemon.server.exec.StartBuildOrRespondWithBusy$1.run(StartBuildOrRespondWithBusy.java:50)
  89. at org.gradle.launcher.daemon.server.DaemonStateCoordinator$1.run(DaemonStateCoordinator.java:293)
  90. at org.gradle.internal.concurrent.ExecutorPolicy$CatchAndRecordFailures.onExecute(ExecutorPolicy.java:54)
  91. at org.gradle.internal.concurrent.StoppableExecutorImpl$1.run(StoppableExecutorImpl.java:40)
  92. Caused by: org.gradle.api.artifacts.ResolveException: Could not resolve all dependencies for configuration ':downloadSourcesFrom_MavenRepo_83e32f83-781f-462e-bbad-f2dc9592fb96'.
  93. at org.gradle.api.internal.artifacts.ivyservice.ErrorHandlingConfigurationResolver.wrapException(ErrorHandlingConfigurationResolver.java:70)
  94. at org.gradle.api.internal.artifacts.ivyservice.ErrorHandlingConfigurationResolver.access$000(ErrorHandlingConfigurationResolver.java:33)
  95. at org.gradle.api.internal.artifacts.ivyservice.ErrorHandlingConfigurationResolver$ErrorHandlingLenientConfiguration.getFiles(ErrorHandlingConfigurationResolver.java:119)
  96. at ijmiscinit1_dwpz0eqwduzlxhbmi7o2b3msl$_run_closure1$_closure2$_closure3$_closure4$_closure5.doCall(/private/var/folders/06/97bzw1l51r59l65thfzs7hd80000gn/T/ijmiscinit1.gradle:14)
  97. at ijmiscinit1_dwpz0eqwduzlxhbmi7o2b3msl$_run_closure1$_closure2$_closure3$_closure4.doCall(/private/var/folders/06/97bzw1l51r59l65thfzs7hd80000gn/T/ijmiscinit1.gradle:8)
  98. at org.gradle.api.internal.AbstractTask$ClosureTaskAction.execute(AbstractTask.java:588)
  99. at org.gradle.api.internal.AbstractTask$ClosureTaskAction.execute(AbstractTask.java:569)
  100. at org.gradle.api.internal.tasks.execution.ExecuteActionsTaskExecuter.executeAction(ExecuteActionsTaskExecuter.java:95)
  101. at org.gradle.api.internal.tasks.execution.ExecuteActionsTaskExecuter.executeActions(ExecuteActionsTaskExecuter.java:76)
  102. ... 71 more
  103. Caused by: java.lang.NullPointerException
  104. at org.gradle.api.internal.artifacts.ivyservice.DefaultLenientConfiguration.getFirstLevelModuleDependencies(DefaultLenientConfiguration.java:91)
  105. at org.gradle.api.internal.artifacts.ivyservice.DefaultLenientConfiguration.getAllArtifacts(DefaultLenientConfiguration.java:177)
  106. at org.gradle.api.internal.artifacts.ivyservice.DefaultLenientConfiguration.getArtifacts(DefaultLenientConfiguration.java:130)
  107. at org.gradle.api.internal.artifacts.ivyservice.DefaultLenientConfiguration.getFiles(DefaultLenientConfiguration.java:115)
  108. at org.gradle.api.internal.artifacts.ivyservice.ErrorHandlingConfigurationResolver$ErrorHandlingLenientConfiguration.getFiles(ErrorHandlingConfigurationResolver.java:117)
  109. ... 77 more
  110.  
  111.  
  112. BUILD FAILED
  113.  
  114. Total time: 0.099 secs
  115. 21:18:27: Task execution finished 'DownloadSources --stacktrace'.
RAW Paste Data Copied