Not a member of Pastebin yet?
Sign Up,
it unlocks many cool features!
- [...]
- gconf-2.5.1/openwrt-build/..
- The Meson build system
- Version: 1.6.1
- Source dir: /home/kevin/Code/openwrt/build_dir/host/pkgconf-2.5.1
- Build dir: /home/kevin/Code/openwrt/build_dir/host/pkgconf-2.5.1/openwrt-build
- Build type: native build
- Project name: pkgconf
- Project version: 2.5.1
- C compiler for the host machine: /home/kevin/Code/openwrt/staging_dir/host/bin/gcc (gcc 14.3.0 "gcc (GCC) 14.3.0")
- C linker for the host machine: /home/kevin/Code/openwrt/staging_dir/host/bin/gcc ld.bfd 2.44
- Host machine cpu family: x86_64
- Host machine cpu: x86_64
- Compiler for C supports arguments -Wimplicit-function-declaration: YES
- Compiler for C supports arguments -Wmisleading-indentation: YES
- Checking for function "strlcat" : YES
- Header "string.h" has symbol "strlcat" : YES
- Checking for function "strlcpy" : YES
- Header "string.h" has symbol "strlcpy" : YES
- Checking for function "strndup" : YES
- Header "string.h" has symbol "strndup" : YES
- Checking for function "strdup" : YES
- Header "string.h" has symbol "strdup" : YES
- Checking for function "strncasecmp" : YES
- Header "strings.h" has symbol "strncasecmp" : YES
- Checking for function "strcasecmp" : YES
- Header "strings.h" has symbol "strcasecmp" : YES
- Checking for function "reallocarray" : YES
- Header "stdlib.h" has symbol "reallocarray" : YES
- Checking for function "pledge" : NO
- Checking for function "unveil" : NO
- Configuring config.h using configuration
- WARNING: We thought we found pkg-config '/home/kevin/Code/openwrt/staging_dir/host/bin/pkg-config' but now it's not there. How odd!
- Found pkg-config: NO
- Program kyua skipped: feature tests disabled
- Program atf-sh skipped: feature tests disabled
- Configuring Kyuafile using configuration
- Configuring Kyuafile using configuration
- Configuring test_env.sh using configuration
- ../../build_dir/host/pkgconf-2.5.1/tests/meson.build:2: WARNING: The variable(s) 'datarootdir', 'exec_prefix', 'prefix' in the input file 'tests/test_env.sh.in' are not present in the given configuration data.
- Build targets in project: 3
- [...]
- /home/kevin/Code/openwrt/staging_dir/host/bin/gcc -O2 -I/home/kevin/Code/openwrt/staging_dir/host/include -L/home/kevin/Code/openwrt/staging_dir/host/lib -o src/bison src/bison-AnnotationList.o src/bison-InadequacyList.o src/bison-Sbitset.o src/bison-assoc.o src/bison-closure.o src/bison-complain.o src/bison-conflicts.o src/bison-counterexample.o src/bison-derivation.o src/bison-derives.o src/bison-files.o src/bison-fixits.o src/bison-getargs.o src/bison-glyphs.o src/bison-gram.o src/bison-graphviz.o src/bison-ielr.o src/bison-lalr.o src/bison-location.o src/bison-lr0.o src/bison-lssi.o src/bison-main.o src/bison-muscle-tab.o src/bison-named-ref.o src/bison-nullable.o src/bison-output.o src/bison-parse-gram.o src/bison-parse-simulation.o src/bison-print-graph.o src/bison-print-xml.o src/bison-print.o src/bison-reader.o src/bison-reduce.o src/bison-relation.o src/bison-scan-code-c.o src/bison-scan-gram-c.o src/bison-scan-skel-c.o src/bison-state.o src/bison-state-item.o src/bison-strversion.o src/bison-symlist.o src/bison-symtab.o src/bison-tables.o src/bison-uniqstr.o lib/libbison.a -ltextstyle
- /bin/mkdir -p doc
- LC_ALL=C tests/bison --version >doc/bison.help.tmp
- /home/kevin/Code/openwrt/build_dir/host/bison-3.8.2/src/bison: error while loading shared libraries: libtextstyle.so.0: cannot open shared object file: No such file or directory
- make[6]: *** [Makefile:11838: doc/bison.help] Error 127
- make[6]: Leaving directory '/home/kevin/Code/openwrt/build_dir/host/bison-3.8.2'
- make[5]: *** [Makefile:10377: all-recursive] Error 1
- make[5]: Leaving directory '/home/kevin/Code/openwrt/build_dir/host/bison-3.8.2'
- make[4]: *** [Makefile:3866: all] Error 2
- make[4]: Leaving directory '/home/kevin/Code/openwrt/build_dir/host/bison-3.8.2'
- make[3]: *** [Makefile:34: /home/kevin/Code/openwrt/build_dir/host/bison-3.8.2/.built] Error 2
- make[3]: Leaving directory '/home/kevin/Code/openwrt/tools/bison'
- time: tools/bison/compile#22.97#6.22#30.72
- ERROR: tools/bison failed to build.
- make[2]: *** [tools/Makefile:243: tools/bison/compile] Error 1
- make[2]: Leaving directory '/home/kevin/Code/openwrt'
- make[1]: *** [tools/Makefile:239: /home/kevin/Code/openwrt/staging_dir/host/stamp/.tools_compile_nyyynyynnnynyynynyyyyyyyynyyynynyynnynnyyyyyynyyyyyyyyyyynynnyyyyynyyy] Error 2
- make[1]: Leaving directory '/home/kevin/Code/openwrt'
- make: *** [/home/kevin/Code/openwrt/include/toplevel.mk:233: world] Error 2
Advertisement
Add Comment
Please, Sign In to add comment