SHARE
TWEET

epson generic driver compile on raspberry pi error

a guest Apr 21st, 2016 174 Never
Not a member of Pastebin yet? Sign Up, it unlocks many cool features!
  1. $ make
  2. make  all-recursive
  3. make[1]: Entering directory '/home/pi/printer_epson/epson-inkjet-printer-escpr-1.6.5'
  4. Making all in lib
  5. make[2]: Entering directory '/home/pi/printer_epson/epson-inkjet-printer-escpr-1.6.5/lib'
  6. make[2]: Nothing to be done for 'all'.
  7. make[2]: Leaving directory '/home/pi/printer_epson/epson-inkjet-printer-escpr-1.6.5/lib'
  8. Making all in ppd
  9. make[2]: Entering directory '/home/pi/printer_epson/epson-inkjet-printer-escpr-1.6.5/ppd'
  10. make[2]: Nothing to be done for 'all'.
  11. make[2]: Leaving directory '/home/pi/printer_epson/epson-inkjet-printer-escpr-1.6.5/ppd'
  12. Making all in src
  13. make[2]: Entering directory '/home/pi/printer_epson/epson-inkjet-printer-escpr-1.6.5/src'
  14. gcc -DHAVE_CONFIG_H -I. -I..    -Wall -DCUPS_FILTER_NAME=\"epson-escpr\" -DCUPS_FILTER_PATH=\"/usr/lib/cups/filter\"  -g -O2 -MT epson_escpr_wrapper-wrapper.o -MD -MP -MF .deps/epson_escpr_wrapper-wrapper.Tpo -c -o epson_escpr_wrapper-wrapper.o `test -f 'wrapper.c' || echo './'`wrapper.c
  15. wrapper.c:25:23: fatal error: cups/cups.h: No such file or directory
  16. compilation terminated.
  17. Makefile:481: recipe for target 'epson_escpr_wrapper-wrapper.o' failed
  18. make[2]: *** [epson_escpr_wrapper-wrapper.o] Error 1
  19. make[2]: Leaving directory '/home/pi/printer_epson/epson-inkjet-printer-escpr-1.6.5/src'
  20. Makefile:366: recipe for target 'all-recursive' failed
  21. make[1]: *** [all-recursive] Error 1
  22. make[1]: Leaving directory '/home/pi/printer_epson/epson-inkjet-printer-escpr-1.6.5'
  23. Makefile:292: recipe for target 'all' failed
  24. make: *** [all] Error 2
RAW Paste Data
We use cookies for various purposes including analytics. By continuing to use Pastebin, you agree to our use of cookies as described in the Cookies Policy. OK, I Understand
 
Top