SHARE
TWEET

MCreator 1.8.9 Error

a guest Apr 4th, 2016 91 Never
Not a member of Pastebin yet? Sign Up, it unlocks many cool features!
  1. Executing gradle command: clean runClient
  2. Microsoft Windows [Version 6.1.7601]
  3. (c) Љ®аЇ®а жЁп Њ ©Єа®б®дв (Microsoft Corp.), 2009. ‚ᥠЇа ў  § йЁйҐ­л.
  4. C:\Pylo\MCreator>cd forge
  5. C:\Pylo\MCreator\forge>SET "JAVA_HOME=C:\Pylo\MCreator\jdk32\"
  6. C:\Pylo\MCreator\forge>SET JAVA_EXE=%JAVA_HOME%\bin\java.exe
  7. C:\Pylo\MCreator\forge>SET PATH=%JAVA_HOME%\bin\;%PATH%
  8. C:\Pylo\MCreator\forge>SET "JAVA_OPTS=-Xmx1024m -Xms512m"
  9. C:\Pylo\MCreator\forge>gradlew clean runClient
  10. java.net.ConnectException: Connection timed out: connect
  11.     at java.net.DualStackPlainSocketImpl.connect0(Native Method)
  12.     at java.net.DualStackPlainSocketImpl.socketConnect(DualStackPlainSocketImpl.java:79)
  13.     at java.net.AbstractPlainSocketImpl.doConnect(AbstractPlainSocketImpl.java:339)
  14.     at java.net.AbstractPlainSocketImpl.connectToAddress(AbstractPlainSocketImpl.java:200)
  15.     at java.net.AbstractPlainSocketImpl.connect(AbstractPlainSocketImpl.java:182)
  16.     at java.net.PlainSocketImpl.connect(PlainSocketImpl.java:172)
  17.     at java.net.SocksSocketImpl.connect(SocksSocketImpl.java:392)
  18.     at java.net.Socket.connect(Socket.java:579)
  19.     at java.net.Socket.connect(Socket.java:528)
  20.     at sun.net.NetworkClient.doConnect(NetworkClient.java:180)
  21.     at sun.net.www.http.HttpClient.openServer(HttpClient.java:432)
  22.     at sun.net.www.http.HttpClient.openServer(HttpClient.java:527)
  23.     at sun.net.www.http.HttpClient.<init>(HttpClient.java:211)
  24.     at sun.net.www.http.HttpClient.New(HttpClient.java:308)
  25.     at sun.net.www.http.HttpClient.New(HttpClient.java:326)
  26.     at sun.net.www.protocol.http.HttpURLConnection.getNewHttpClient(HttpURLConnection.java:996)
  27.     at sun.net.www.protocol.http.HttpURLConnection.plainConnect(HttpURLConnection.java:932)
  28.     at sun.net.www.protocol.http.HttpURLConnection.connect(HttpURLConnection.java:850)
  29.     at net.minecraftforge.gradle.common.BasePlugin.getWithEtag(BasePlugin.java:658)
  30.     at net.minecraftforge.gradle.common.BasePlugin.getRemoteJsons(BasePlugin.java:213)
  31.     at net.minecraftforge.gradle.common.BasePlugin.apply(BasePlugin.java:172)
  32.     at net.minecraftforge.gradle.common.BasePlugin.apply(BasePlugin.java:89)
  33.     at org.gradle.api.internal.plugins.ImperativeOnlyPluginApplicator.applyImperative(ImperativeOnlyPluginApplicator.java:35)
  34.     at org.gradle.api.internal.plugins.RuleBasedPluginApplicator.applyImperative(RuleBasedPluginApplicator.java:43)
  35.     at org.gradle.api.internal.plugins.DefaultPluginManager.doApply(DefaultPluginManager.java:144)
  36.     at org.gradle.api.internal.plugins.DefaultPluginManager.apply(DefaultPluginManager.java:112)
  37.     at org.gradle.api.internal.plugins.DefaultObjectConfigurationAction.applyType(DefaultObjectConfigurationAction.java:112)
  38.     at org.gradle.api.internal.plugins.DefaultObjectConfigurationAction.access$200(DefaultObjectConfigurationAction.java:35)
  39.     at org.gradle.api.internal.plugins.DefaultObjectConfigurationAction$3.run(DefaultObjectConfigurationAction.java:79)
  40.     at org.gradle.api.internal.plugins.DefaultObjectConfigurationAction.execute(DefaultObjectConfigurationAction.java:135)
  41.     at org.gradle.api.internal.project.AbstractPluginAware.apply(AbstractPluginAware.java:46)
  42.     at org.gradle.api.plugins.PluginAware$apply.call(Unknown Source)
  43.     at org.codehaus.groovy.runtime.callsite.CallSiteArray.defaultCall(CallSiteArray.java:45)
  44.     at org.codehaus.groovy.runtime.callsite.AbstractCallSite.call(AbstractCallSite.java:108)
  45.     at org.codehaus.groovy.runtime.callsite.AbstractCallSite.call(AbstractCallSite.java:116)
  46.     at org.gradle.api.internal.project.ProjectScript.apply(ProjectScript.groovy:34)
  47.     at org.gradle.api.Script$apply$0.callCurrent(Unknown Source)
  48.     at org.codehaus.groovy.runtime.callsite.CallSiteArray.defaultCallCurrent(CallSiteArray.java:49)
  49.     at org.codehaus.groovy.runtime.callsite.AbstractCallSite.callCurrent(AbstractCallSite.java:133)
  50.     at org.codehaus.groovy.runtime.callsite.AbstractCallSite.callCurrent(AbstractCallSite.java:141)
  51.     at build_3sdy4lbxnwx2hlrepdroevnz9.run(C:\Pylo\MCreator\forge\build.gradle:15)
  52.     at org.gradle.groovy.scripts.internal.DefaultScriptRunnerFactory$ScriptRunnerImpl.run(DefaultScriptRunnerFactory.java:91)
  53.     at org.gradle.configuration.DefaultScriptPluginFactory$ScriptPluginImpl$1.run(DefaultScriptPluginFactory.java:148)
  54.     at org.gradle.configuration.ProjectScriptTarget.addConfiguration(ProjectScriptTarget.java:72)
  55.     at org.gradle.configuration.DefaultScriptPluginFactory$ScriptPluginImpl.apply(DefaultScriptPluginFactory.java:153)
  56.     at org.gradle.configuration.project.BuildScriptProcessor.execute(BuildScriptProcessor.java:38)
  57.     at org.gradle.configuration.project.BuildScriptProcessor.execute(BuildScriptProcessor.java:25)
  58.     at org.gradle.configuration.project.ConfigureActionsProjectEvaluator.evaluate(ConfigureActionsProjectEvaluator.java:34)
  59.     at org.gradle.configuration.project.LifecycleProjectEvaluator.evaluate(LifecycleProjectEvaluator.java:55)
  60.     at org.gradle.api.internal.project.AbstractProject.evaluate(AbstractProject.java:491)
  61.     at org.gradle.api.internal.project.AbstractProject.evaluate(AbstractProject.java:89)
  62.     at org.gradle.execution.TaskPathProjectEvaluator.configureHierarchy(TaskPathProjectEvaluator.java:42)
  63.     at org.gradle.configuration.DefaultBuildConfigurer.configure(DefaultBuildConfigurer.java:35)
  64.     at org.gradle.initialization.DefaultGradleLauncher$2.run(DefaultGradleLauncher.java:126)
  65.     at org.gradle.internal.Factories$1.create(Factories.java:22)
  66.     at org.gradle.internal.progress.DefaultBuildOperationExecutor.run(DefaultBuildOperationExecutor.java:90)
  67.     at org.gradle.internal.progress.DefaultBuildOperationExecutor.run(DefaultBuildOperationExecutor.java:52)
  68.     at org.gradle.initialization.DefaultGradleLauncher.doBuildStages(DefaultGradleLauncher.java:123)
  69.     at org.gradle.initialization.DefaultGradleLauncher.access$200(DefaultGradleLauncher.java:33)
  70.     at org.gradle.initialization.DefaultGradleLauncher$1.create(DefaultGradleLauncher.java:100)
  71.     at org.gradle.initialization.DefaultGradleLauncher$1.create(DefaultGradleLauncher.java:94)
  72.     at org.gradle.internal.progress.DefaultBuildOperationExecutor.run(DefaultBuildOperationExecutor.java:90)
  73.     at org.gradle.internal.progress.DefaultBuildOperationExecutor.run(DefaultBuildOperationExecutor.java:62)
  74.     at org.gradle.initialization.DefaultGradleLauncher.doBuild(DefaultGradleLauncher.java:94)
  75.     at org.gradle.initialization.DefaultGradleLauncher.run(DefaultGradleLauncher.java:83)
  76.     at org.gradle.launcher.exec.InProcessBuildActionExecuter$DefaultBuildController.run(InProcessBuildActionExecuter.java:94)
  77.     at org.gradle.tooling.internal.provider.ExecuteBuildActionRunner.run(ExecuteBuildActionRunner.java:28)
  78.     at org.gradle.launcher.exec.ChainingBuildActionRunner.run(ChainingBuildActionRunner.java:35)
  79.     at org.gradle.launcher.exec.InProcessBuildActionExecuter.execute(InProcessBuildActionExecuter.java:43)
  80.     at org.gradle.launcher.exec.InProcessBuildActionExecuter.execute(InProcessBuildActionExecuter.java:28)
  81.     at org.gradle.launcher.exec.ContinuousBuildActionExecuter.execute(ContinuousBuildActionExecuter.java:77)
  82.     at org.gradle.launcher.exec.ContinuousBuildActionExecuter.execute(ContinuousBuildActionExecuter.java:47)
  83.     at org.gradle.launcher.exec.DaemonUsageSuggestingBuildActionExecuter.execute(DaemonUsageSuggestingBuildActionExecuter.java:51)
  84.     at org.gradle.launcher.exec.DaemonUsageSuggestingBuildActionExecuter.execute(DaemonUsageSuggestingBuildActionExecuter.java:28)
  85.     at org.gradle.launcher.cli.RunBuildAction.run(RunBuildAction.java:43)
  86.     at org.gradle.internal.Actions$RunnableActionAdapter.execute(Actions.java:170)
  87.     at org.gradle.launcher.cli.CommandLineActionFactory$ParseAndBuildAction.execute(CommandLineActionFactory.java:237)
  88.     at org.gradle.launcher.cli.CommandLineActionFactory$ParseAndBuildAction.execute(CommandLineActionFactory.java:210)
  89.     at org.gradle.launcher.cli.JavaRuntimeValidationAction.execute(JavaRuntimeValidationAction.java:35)
  90.     at org.gradle.launcher.cli.JavaRuntimeValidationAction.execute(JavaRuntimeValidationAction.java:24)
  91.     at org.gradle.launcher.cli.CommandLineActionFactory$WithLogging.execute(CommandLineActionFactory.java:206)
  92.     at org.gradle.launcher.cli.CommandLineActionFactory$WithLogging.execute(CommandLineActionFactory.java:169)
  93.     at org.gradle.launcher.cli.ExceptionReportingAction.execute(ExceptionReportingAction.java:33)
  94.     at org.gradle.launcher.cli.ExceptionReportingAction.execute(ExceptionReportingAction.java:22)
  95.     at org.gradle.launcher.Main.doAction(Main.java:33)
  96.     at org.gradle.launcher.bootstrap.EntryPoint.run(EntryPoint.java:45)
  97.     at sun.reflect.NativeMethodAccessorImpl.invoke0(Native Method)
  98.     at sun.reflect.NativeMethodAccessorImpl.invoke(NativeMethodAccessorImpl.java:57)
  99.     at sun.reflect.DelegatingMethodAccessorImpl.invoke(DelegatingMethodAccessorImpl.java:43)
  100.     at java.lang.reflect.Method.invoke(Method.java:606)
  101.     at org.gradle.launcher.bootstrap.ProcessBootstrap.runNoExit(ProcessBootstrap.java:54)
  102.     at org.gradle.launcher.bootstrap.ProcessBootstrap.run(ProcessBootstrap.java:35)
  103.     at org.gradle.launcher.GradleMain.main(GradleMain.java:23)
  104.     at sun.reflect.NativeMethodAccessorImpl.invoke0(Native Method)
  105.     at sun.reflect.NativeMethodAccessorImpl.invoke(NativeMethodAccessorImpl.java:57)
  106.     at sun.reflect.DelegatingMethodAccessorImpl.invoke(DelegatingMethodAccessorImpl.java:43)
  107.     at java.lang.reflect.Method.invoke(Method.java:606)
  108.     at org.gradle.wrapper.BootstrapMainStarter.start(BootstrapMainStarter.java:30)
  109.     at org.gradle.wrapper.WrapperExecutor.execute(WrapperExecutor.java:127)
  110.     at org.gradle.wrapper.GradleWrapperMain.main(GradleWrapperMain.java:61)
  111. FAILURE: Build failed with an exception.
  112. * Where:
  113. Build file 'C:\Pylo\MCreator\forge\build.gradle' line: 15
  114. * What went wrong:
  115. A problem occurred evaluating root project 'forge'.
  116. > Failed to apply plugin [id 'net.minecraftforge.gradle.forge']
  117.    > Unable to obtain url (http://export.mcpbot.bspk.rs/versions.json) with etag!
  118. * Try:
  119. Run with --stacktrace option to get the stack trace. Run with --info or --debug option to get more log output.
  120. BUILD FAILED
  121. Total time: 26.027 secs
  122. C:\Pylo\MCreator\forge>
RAW Paste Data
We use cookies for various purposes including analytics. By continuing to use Pastebin, you agree to our use of cookies as described in the Cookies Policy. OK, I Understand
 
Top