Guest User

Untitled

a guest
Nov 6th, 2018
138
Never
Not a member of Pastebin yet? Sign Up, it unlocks many cool features!
  1. jos@DESKTOP-02A0SKE /c/gstreamer/cerbero/build/sources/windows_x86_64/gdk-pixbuf-2.38.0/_builddir
  2. $ ninja -v
  3. [1/8] "c:/gstreamer/cerbero/build/build-tools/Scripts/meson" "--internal" "exe" "c:/gstreamer/cerbero/build/sources/windows_x86_64/gdk-pixbuf-2.38.0/_builddir/meson-private/meson_exe_python.exe_6da81e65469632b0cb9288a9c0115fad0f9f2377.dat"
  4. failed to load "c:/gstreamer/cerbero/build/sources/windows_x86_64/gdk-pixbuf-2.38.0/tests/icc-profile.png": Image file ôc:/gstreamer/cerbero/build/sources/windows_x86_64/gdk-pixbuf-2.38.0/tests/icc-profile.pngö contains no data
  5. ../tests/resources.gresource.xml: Child process exited with code 1.
  6. [2/8] "c:/gstreamer/cerbero/build/build-tools/Scripts/meson" "--internal" "exe" "c:/gstreamer/cerbero/build/sources/windows_x86_64/gdk-pixbuf-2.38.0/_builddir/meson-private/meson_exe_python.exe_134cbe533ae46a253364eda013ca5ef1afd32b14.dat"
  7. failed to load "c:/gstreamer/cerbero/build/sources/windows_x86_64/gdk-pixbuf-2.38.0/tests/icc-profile.png": Image file ôc:/gstreamer/cerbero/build/sources/windows_x86_64/gdk-pixbuf-2.38.0/tests/icc-profile.pngö contains no data
  8. ../tests/resources.gresource.xml: Child process exited with code 1.
  9. [3/8] x86_64-w64-mingw32-gcc @tests/tests@@pixbuf-pixdata@exe/meson-generated_.._resources.c.obj.rsp
  10. FAILED: tests/tests@@pixbuf-pixdata@exe/meson-generated_.._resources.c.obj
  11. x86_64-w64-mingw32-gcc @tests/tests@@pixbuf-pixdata@exe/meson-generated_.._resources.c.obj.rsp
  12. x86_64-w64-mingw32-gcc: error: tests/resources.c: No such file or directory
  13. x86_64-w64-mingw32-gcc: fatal error: no input files
  14. compilation terminated.
  15. [4/8] x86_64-w64-mingw32-gcc @tests/tests@@cve-2015-4491@exe/meson-generated_.._resources.c.obj.rsp
  16. FAILED: tests/tests@@cve-2015-4491@exe/meson-generated_.._resources.c.obj
  17. x86_64-w64-mingw32-gcc @tests/tests@@cve-2015-4491@exe/meson-generated_.._resources.c.obj.rsp
  18. x86_64-w64-mingw32-gcc: error: tests/resources.c: No such file or directory
  19. x86_64-w64-mingw32-gcc: fatal error: no input files
  20. compilation terminated.
  21. [5/8] x86_64-w64-mingw32-gcc @tests/tests@@pixbuf-resource@exe/meson-generated_.._resources.c.obj.rsp
  22. FAILED: tests/tests@@pixbuf-resource@exe/meson-generated_.._resources.c.obj
  23. x86_64-w64-mingw32-gcc @tests/tests@@pixbuf-resource@exe/meson-generated_.._resources.c.obj.rsp
  24. x86_64-w64-mingw32-gcc: error: tests/resources.c: No such file or directory
  25. x86_64-w64-mingw32-gcc: fatal error: no input files
  26. compilation terminated.
  27. ninja: build stopped: subcommand failed.
RAW Paste Data