daily pastebin goal
68%
SHARE
TWEET

Untitled

a guest Aug 12th, 2017 53 Never
Not a member of Pastebin yet? Sign Up, it unlocks many cool features!
  1. In file included from /home/server/source/trinity-core/src/server/wardenserver/Daemon/WardenDaemon.cpp:20:
  2. /home/server/source/trinity-core/src/server/wardenserver/Daemon/WardenDaemon.h:53: error: expected â)â before â*â token
  3. /home/server/source/trinity-core/src/server/wardenserver/Daemon/WardenDaemon.h:54: error: expected â)â before â*â token
  4. /home/server/source/trinity-core/src/server/wardenserver/Daemon/WardenDaemon.h:55: error: expected â)â before â*â token
  5. /home/server/source/trinity-core/src/server/wardenserver/Daemon/WardenDaemon.h:55: error: expected initializer before â*â token
  6. /home/server/source/trinity-core/src/server/wardenserver/Daemon/WardenDaemon.h:56: error: expected â)â before â*â token
  7. /home/server/source/trinity-core/src/server/wardenserver/Daemon/WardenDaemon.h:57: error: expected â)â before â*â token
  8. /home/server/source/trinity-core/src/server/wardenserver/Daemon/WardenDaemon.h:58: error: expected â)â before â*â token
  9. /home/server/source/trinity-core/src/server/wardenserver/Daemon/WardenDaemon.h:59: error: expected â)â before â*â token
  10. /home/server/source/trinity-core/src/server/wardenserver/Daemon/WardenDaemon.h:72: error: expected â)â before â*â token
  11. /home/server/source/trinity-core/src/server/wardenserver/Daemon/WardenDaemon.h:73: error: expected â)â before â*â token
  12. /home/server/source/trinity-core/src/server/wardenserver/Daemon/WardenDaemon.h:74: error: expected â)â before â*â token
  13. /home/server/source/trinity-core/src/server/wardenserver/Daemon/WardenDaemon.h:75: error: expected â)â before â*â token
  14. /home/server/source/trinity-core/src/server/wardenserver/Daemon/WardenDaemon.h:78: error: ISO C++ forbids declaration of âfnGenerateRC4Keysâ with no type
  15. /home/server/source/trinity-core/src/server/wardenserver/Daemon/WardenDaemon.h:78: error: expected â;â before â*â token
  16. /home/server/source/trinity-core/src/server/wardenserver/Daemon/WardenDaemon.h:79: error: ISO C++ forbids declaration of âfnUnloadModuleâ with no type
  17. /home/server/source/trinity-core/src/server/wardenserver/Daemon/WardenDaemon.h:79: error: expected â;â before â*â token
  18. In file included from /home/server/source/trinity-core/src/server/wardenserver/Daemon/WardenDaemon.cpp:20:
  19. /home/server/source/trinity-core/src/server/wardenserver/Daemon/WardenDaemon.h:80: error: ISO C++ forbids declaration of âfnPacketHandlerâ with no type
  20. /home/server/source/trinity-core/src/server/wardenserver/Daemon/WardenDaemon.h:80: error: expected â;â before â*â token
  21. /home/server/source/trinity-core/src/server/wardenserver/Daemon/WardenDaemon.h:81: error: ISO C++ forbids declaration of âfnTickâ with no type
  22. /home/server/source/trinity-core/src/server/wardenserver/Daemon/WardenDaemon.h:81: error: expected â;â before â*â token
  23. /home/server/source/trinity-core/src/server/wardenserver/Daemon/WardenDaemon.h:108: error: expected â)â before â*â token
  24. /home/server/source/trinity-core/src/server/wardenserver/Daemon/WardenDaemon.h:108: error: expected initializer before â*â token
  25. /home/server/source/trinity-core/src/server/wardenserver/Daemon/WardenDaemon.h:142: error: explicit specialization in non-namespace scope âclass CWardenLoaderâ
  26. /home/server/source/trinity-core/src/server/wardenserver/Daemon/WardenDaemon.h:143: error: template-id âGetAddress<DWORD>â in declaration of primary template
  27. /home/server/source/trinity-core/src/server/wardenserver/Daemon/WardenDaemon.h:158: error: too many template-parameter-lists
  28. /home/server/source/trinity-core/src/server/wardenserver/Daemon/WardenDaemon.cpp: In member function âvoid CWardenLoader::UnloadWarden()â:
  29. /home/server/source/trinity-core/src/server/wardenserver/Daemon/WardenDaemon.cpp:37: error: âGetModuleHandleAâ was not declared in this scope
  30. /home/server/source/trinity-core/src/server/wardenserver/Daemon/WardenDaemon.cpp:37: error: âFreeLibraryâ was not declared in this scope
  31. /home/server/source/trinity-core/src/server/wardenserver/Daemon/WardenDaemon.cpp:39: error: âMEM_RELEASEâ was not declared in this scope
  32. /home/server/source/trinity-core/src/server/wardenserver/Daemon/WardenDaemon.cpp:39: error: âVirtualFreeâ was not declared in this scope
  33. /home/server/source/trinity-core/src/server/wardenserver/Daemon/WardenDaemon.cpp: In member function âbool CWardenLoader::LoadWarden(DWORD*, DWORD)â:
  34. /home/server/source/trinity-core/src/server/wardenserver/Daemon/WardenDaemon.cpp:53: error: âMEM_COMMITâ was not declared in this scope
  35. /home/server/source/trinity-core/src/server/wardenserver/Daemon/WardenDaemon.cpp:53: error: âPAGE_EXECUTE_READWRITEâ was not declared in this scope
  36. /home/server/source/trinity-core/src/server/wardenserver/Daemon/WardenDaemon.cpp:53: error: âVirtualAllocâ was not declared in this scope
  37. /home/server/source/trinity-core/src/server/wardenserver/Daemon/WardenDaemon.cpp:66: error: âWORDâ was not declared in this scope
  38. /home/server/source/trinity-core/src/server/wardenserver/Daemon/WardenDaemon.cpp:66: error: expected primary-expression before â)â token
  39. /home/server/source/trinity-core/src/server/wardenserver/Daemon/WardenDaemon.cpp:66: error: expected â)â before âpdwChunkâ
  40. /home/server/source/trinity-core/src/server/wardenserver/Daemon/WardenDaemon.cpp:80: error: âPBYTEâ was not declared in this scope
  41. /home/server/source/trinity-core/src/server/wardenserver/Daemon/WardenDaemon.cpp:80: error: expected â;â before âpbRelocationTableâ
  42. /home/server/source/trinity-core/src/server/wardenserver/Daemon/WardenDaemon.cpp:85: error: âpbRelocationTableâ was not declared in this scope
  43. /home/server/source/trinity-core/src/server/wardenserver/Daemon/WardenDaemon.cpp:115: error: âHMODULEâ was not declared in this scope
  44. /home/server/source/trinity-core/src/server/wardenserver/Daemon/WardenDaemon.cpp:115: error: expected â;â before âhModuleâ
  45. /home/server/source/trinity-core/src/server/wardenserver/Daemon/WardenDaemon.cpp:116: error: âhModuleâ was not declared in this scope
  46. /home/server/source/trinity-core/src/server/wardenserver/Daemon/WardenDaemon.cpp:124: error: âGetProcAddressâ was not declared in this scope
  47. /home/server/source/trinity-core/src/server/wardenserver/Daemon/WardenDaemon.cpp:126: error: âGetProcAddressâ was not declared in this scope
  48. [ 15%] /home/server/source/trinity-core/src/server/wardenserver/Daemon/WardenDaemon.cpp:142: error: âVirtualProtectâ was not declared in this scope
  49. /home/server/source/trinity-core/src/server/wardenserver/Daemon/WardenDaemon.cpp:145: error: âGetCurrentProcessâ was not declared in this scope
  50. /home/server/source/trinity-core/src/server/wardenserver/Daemon/WardenDaemon.cpp:145: error: âFlushInstructionCacheâ was not declared in this scope
  51. /home/server/source/trinity-core/src/server/wardenserver/Daemon/WardenDaemon.cpp:155: error: âMEM_DECOMMITâ was not declared in this scope
  52. /home/server/source/trinity-core/src/server/wardenserver/Daemon/WardenDaemon.cpp:155: error: âVirtualFreeâ was not declared in this scope
  53. /home/server/source/trinity-core/src/server/wardenserver/Daemon/WardenDaemon.cpp: At global scope:
  54. /home/server/source/trinity-core/src/server/wardenserver/Daemon/WardenDaemon.cpp:174: error: expected initializer before âcSendPacketâ
  55. /home/server/source/trinity-core/src/server/wardenserver/Daemon/WardenDaemon.cpp:179: error: expected initializer before âcCheckModuleâ
  56. /home/server/source/trinity-core/src/server/wardenserver/Daemon/WardenDaemon.cpp:185: error: expected initializer before âcLoadModuleâ
  57. /home/server/source/trinity-core/src/server/wardenserver/Daemon/WardenDaemon.cpp:191: error: expected initializer before âcAllocateMemoryâ
  58. /home/server/source/trinity-core/src/server/wardenserver/Daemon/WardenDaemon.cpp:198: error: expected initializer before âcReleaseMemoryâ
  59. /home/server/source/trinity-core/src/server/wardenserver/Daemon/WardenDaemon.cpp:204: error: expected initializer before âcSetRC4Dataâ
  60. /home/server/source/trinity-core/src/server/wardenserver/Daemon/WardenDaemon.cpp:209: error: expected initializer before âcGetRC4Dataâ
  61. /home/server/source/trinity-core/src/server/wardenserver/Daemon/WardenDaemon.cpp: In member function âWardenFuncList** CWardenLoader::InitializeWarden(InstanceS*)â:
  62. /home/server/source/trinity-core/src/server/wardenserver/Daemon/WardenDaemon.cpp:226: error: âFALSEâ was not declared in this scope
  63. /home/server/source/trinity-core/src/server/wardenserver/Daemon/WardenDaemon.cpp:232: error: âfnInitializeModuleâ was not declared in this scope
  64. /home/server/source/trinity-core/src/server/wardenserver/Daemon/WardenDaemon.cpp:232: error: expected â;â before âfpInitializeModuleâ
  65. /home/server/source/trinity-core/src/server/wardenserver/Daemon/WardenDaemon.cpp:233: error: âfpInitializeModuleâ was not declared in this scope
  66. /home/server/source/trinity-core/src/server/wardenserver/Daemon/WardenDaemon.cpp:233: error: expected â;â before âAâ
  67. /home/server/source/trinity-core/src/server/wardenserver/Daemon/WardenDaemon.cpp:238: error: âcSendPacketâ was not declared in this scope
  68. /home/server/source/trinity-core/src/server/wardenserver/Daemon/WardenDaemon.cpp:239: error: âcCheckModuleâ was not declared in this scope
  69. /home/server/source/trinity-core/src/server/wardenserver/Daemon/WardenDaemon.cpp:240: error: âcLoadModuleâ was not declared in this scope
  70. /home/server/source/trinity-core/src/server/wardenserver/Daemon/WardenDaemon.cpp:241: error: âcAllocateMemoryâ was not declared in this scope
  71. /home/server/source/trinity-core/src/server/wardenserver/Daemon/WardenDaemon.cpp:242: error: âcReleaseMemoryâ was not declared in this scope
  72. /home/server/source/trinity-core/src/server/wardenserver/Daemon/WardenDaemon.cpp:243: error: âcSetRC4Dataâ was not declared in this scope
  73. /home/server/source/trinity-core/src/server/wardenserver/Daemon/WardenDaemon.cpp:244: error: âcGetRC4Dataâ was not declared in this scope
  74. /home/server/source/trinity-core/src/server/wardenserver/Daemon/WardenDaemon.cpp: In function âvoid GenerateRC4Keys(void*, DWORD, InstanceS*)â:
  75. /home/server/source/trinity-core/src/server/wardenserver/Daemon/WardenDaemon.cpp:305: error: âfnGenerateRC4Keysâ was not declared in this scope
  76. /home/server/source/trinity-core/src/server/wardenserver/Daemon/WardenDaemon.cpp:305: error: expected â)â before âinstanceâ
  77. /home/server/source/trinity-core/src/server/wardenserver/Daemon/WardenDaemon.cpp: In function âvoid UnloadModule(InstanceS*)â:
  78. /home/server/source/trinity-core/src/server/wardenserver/Daemon/WardenDaemon.cpp:311: error: âfnUnloadModuleâ was not declared in this scope
  79. /home/server/source/trinity-core/src/server/wardenserver/Daemon/WardenDaemon.cpp:311: error: expected â)â before âinstanceâ
  80. /home/server/source/trinity-core/src/server/wardenserver/Daemon/WardenDaemon.cpp: In function âvoid PacketHandler(BYTE*, DWORD, DWORD*, InstanceS*)â:
  81. /home/server/source/trinity-core/src/server/wardenserver/Daemon/WardenDaemon.cpp:317: error: âfnPacketHandlerâ was not declared in this scope
  82. /home/server/source/trinity-core/src/server/wardenserver/Daemon/WardenDaemon.cpp:317: error: expected â)â before âinstanceâ
  83. Building CXX object src/server/authserver/CMakeFiles/authserver.dir/Server/AuthSocket.cpp.o
  84. /home/server/source/trinity-core/src/server/wardenserver/Daemon/WardenDaemon.cpp: In function âvoid Tick(DWORD, InstanceS*)â:
  85. /home/server/source/trinity-core/src/server/wardenserver/Daemon/WardenDaemon.cpp:324: error: âfnTickâ was not declared in this scope
  86. /home/server/source/trinity-core/src/server/wardenserver/Daemon/WardenDaemon.cpp:324: error: expected â)â before âinstanceâ
  87. /home/server/source/trinity-core/src/server/wardenserver/Daemon/WardenDaemon.cpp: In member function âbool Wardend::LoadModuleAndExecute(uint32, uint32, uint8*, uint8*, uint8*, ByteBuffer*)â:
  88. /home/server/source/trinity-core/src/server/wardenserver/Daemon/WardenDaemon.cpp:366: error: âstruct _WardenFuncListâ has no member named âfpGenerateRC4Keysâ
  89. /home/server/source/trinity-core/src/server/wardenserver/Daemon/WardenDaemon.cpp:367: error: âstruct _WardenFuncListâ has no member named âfpUnloadâ
  90. /home/server/source/trinity-core/src/server/wardenserver/Daemon/WardenDaemon.cpp:368: error: âstruct _WardenFuncListâ has no member named âfpPacketHandlerâ
  91. /home/server/source/trinity-core/src/server/wardenserver/Daemon/WardenDaemon.cpp:369: error: âstruct _WardenFuncListâ has no member named âfpTickâ
  92. In file included from /home/server/source/trinity-core/src/server/wardenserver/Daemon/WardenDaemon.cpp:20:
  93. /home/server/source/trinity-core/src/server/wardenserver/Daemon/WardenDaemon.h: In member function âT CWardenLoader::GetAddress(DWORD) [with T = long unsigned int]â:
  94. /home/server/source/trinity-core/src/server/wardenserver/Daemon/WardenDaemon.cpp:60:   instantiated from here
  95. /home/server/source/trinity-core/src/server/wardenserver/Daemon/WardenDaemon.h:139: error: invalid cast from type âDWORDâ to type âlong unsigned intâ
  96. make[2]: *** [src/server/wardenserver/CMakeFiles/wardend.dir/Daemon/WardenDaemon.cpp.o] Error 1
  97. make[2]: *** Waiting for unfinished jobs....
  98. [ 15%] Building CXX object src/server/game/CMakeFiles/game.dir/AI/EventAI/CreatureEventAIMgr.cpp.o
  99. In file included from /home/server/source/trinity-core/src/server/wardenserver/Socket/WardenSocket.h:23,
  100.                  from /home/server/source/trinity-core/src/server/wardenserver/Socket/WardenSocket.cpp:23:
  101. /home/server/source/trinity-core/src/server/wardenserver/Daemon/WardenDaemon.h:53: error: expected â)â before â*â token
  102. /home/server/source/trinity-core/src/server/wardenserver/Daemon/WardenDaemon.h:54: error: expected â)â before â*â token
  103. /home/server/source/trinity-core/src/server/wardenserver/Daemon/WardenDaemon.h:55: error: expected â)â before â*â token
  104. /home/server/source/trinity-core/src/server/wardenserver/Daemon/WardenDaemon.h:55: error: expected initializer before â*â token
  105. /home/server/source/trinity-core/src/server/wardenserver/Daemon/WardenDaemon.h:56: error: expected â)â before â*â token
  106. /home/server/source/trinity-core/src/server/wardenserver/Daemon/WardenDaemon.h:57: error: expected â)â before â*â token
  107. /home/server/source/trinity-core/src/server/wardenserver/Daemon/WardenDaemon.h:58: error: expected â)â before â*â token
  108. /home/server/source/trinity-core/src/server/wardenserver/Daemon/WardenDaemon.h:59: error: expected â)â before â*â token
  109. /home/server/source/trinity-core/src/server/wardenserver/Daemon/WardenDaemon.h:72: error: expected â)â before â*â token
  110. /home/server/source/trinity-core/src/server/wardenserver/Daemon/WardenDaemon.h:73: error: expected â)â before â*â token
  111. /home/server/source/trinity-core/src/server/wardenserver/Daemon/WardenDaemon.h:74: error: expected â)â before â*â token
  112. /home/server/source/trinity-core/src/server/wardenserver/Daemon/WardenDaemon.h:75: error: expected â)â before â*â token
  113. /home/server/source/trinity-core/src/server/wardenserver/Daemon/WardenDaemon.h:78: error: ISO C++ forbids declaration of âfnGenerateRC4Keysâ with no type
  114. /home/server/source/trinity-core/src/server/wardenserver/Daemon/WardenDaemon.h:78: error: expected â;â before â*â token
  115. /home/server/source/trinity-core/src/server/wardenserver/Daemon/WardenDaemon.h:79: error: ISO C++ forbids declaration of âfnUnloadModuleâ with no type
  116. /home/server/source/trinity-core/src/server/wardenserver/Daemon/WardenDaemon.h:79: error: expected â;â before â*â token
  117. In file included from /home/server/source/trinity-core/src/server/wardenserver/Socket/WardenSocket.h:23,
  118.                  from /home/server/source/trinity-core/src/server/wardenserver/Socket/WardenSocket.cpp:23:
  119. /home/server/source/trinity-core/src/server/wardenserver/Daemon/WardenDaemon.h:80: error: ISO C++ forbids declaration of âfnPacketHandlerâ with no type
  120. /home/server/source/trinity-core/src/server/wardenserver/Daemon/WardenDaemon.h:80: error: expected â;â before â*â token
  121. /home/server/source/trinity-core/src/server/wardenserver/Daemon/WardenDaemon.h:81: error: ISO C++ forbids declaration of âfnTickâ with no type
  122. /home/server/source/trinity-core/src/server/wardenserver/Daemon/WardenDaemon.h:81: error: expected â;â before â*â token
  123. /home/server/source/trinity-core/src/server/wardenserver/Daemon/WardenDaemon.h:108: error: expected â)â before â*â token
  124. /home/server/source/trinity-core/src/server/wardenserver/Daemon/WardenDaemon.h:108: error: expected initializer before â*â token
  125. /home/server/source/trinity-core/src/server/wardenserver/Daemon/WardenDaemon.h:142: error: explicit specialization in non-namespace scope âclass CWardenLoaderâ
  126. /home/server/source/trinity-core/src/server/wardenserver/Daemon/WardenDaemon.h:143: error: template-id âGetAddress<DWORD>â in declaration of primary template
  127. /home/server/source/trinity-core/src/server/wardenserver/Daemon/WardenDaemon.h:158: error: too many template-parameter-lists
RAW Paste Data
Top