dominus

Untitled

Oct 4th, 2020
109
Never
Not a member of Pastebin yet? Sign Up, it unlocks many cool features!
  1. This file contains any messages produced by compilers while
  2. running configure, to aid debugging if configure makes a mistake.
  3.  
  4. It was created by dosbox configure SVN, which was
  5. generated by GNU Autoconf 2.69. Invocation command line was
  6.  
  7. $ ./configure --prefix=/opt/arm --with-sdl-prefix=/opt/arm
  8.  
  9. ## --------- ##
  10. ## Platform. ##
  11. ## --------- ##
  12.  
  13. hostname = DTK.fritz.box
  14. uname -m = arm64
  15. uname -r = 20.1.0
  16. uname -s = Darwin
  17. uname -v = Darwin Kernel Version 20.1.0: Thu Sep 24 20:21:57 PDT 2020; root:xnu-7195.40.89.100.3~1/RELEASE_ARM64_T8020
  18.  
  19. /usr/bin/uname -p = arm
  20. /bin/uname -X = unknown
  21.  
  22. /bin/arch = unknown
  23. /usr/bin/arch -k = unknown
  24. /usr/convex/getsysinfo = unknown
  25. /usr/bin/hostinfo = Mach kernel version:
  26. Darwin Kernel Version 20.1.0: Thu Sep 24 20:21:57 PDT 2020; root:xnu-7195.40.89.100.3~1/RELEASE_ARM64_T8020
  27. Kernel configured for up to 8 processors.
  28. 8 processors are physically available.
  29. 8 processors are logically available.
  30. Processor type: arm64e (ARM64E)
  31. Processors active: 0 1 2 3 4 5 6 7
  32. Primary memory available: 16.00 gigabytes
  33. Default processor set: 405 tasks, 1435 threads, 8 processors
  34. Load average: 2.50, Mach factor: 5.49
  35. /bin/machine = unknown
  36. /usr/bin/oslevel = unknown
  37. /bin/universe = unknown
  38.  
  39. PATH: /opt/arm/bin/
  40. PATH: /usr/bin
  41. PATH: /bin
  42. PATH: /usr/sbin
  43. PATH: /sbin
  44. PATH: /usr/local/bin
  45.  
  46.  
  47. ## ----------- ##
  48. ## Core tests. ##
  49. ## ----------- ##
  50.  
  51. configure:2524: checking build system type
  52. configure:2538: result: arm-apple-darwin20.1.0
  53. configure:2558: checking host system type
  54. configure:2571: result: arm-apple-darwin20.1.0
  55. configure:2609: checking for a BSD-compatible install
  56. configure:2677: result: /usr/bin/install -c
  57. configure:2688: checking whether build environment is sane
  58. configure:2743: result: yes
  59. configure:2894: checking for a thread-safe mkdir -p
  60. configure:2933: result: ./install-sh -c -d
  61. configure:2940: checking for gawk
  62. configure:2970: result: no
  63. configure:2940: checking for mawk
  64. configure:2970: result: no
  65. configure:2940: checking for nawk
  66. configure:2970: result: no
  67. configure:2940: checking for awk
  68. configure:2956: found /usr/bin/awk
  69. configure:2967: result: awk
  70. configure:2978: checking whether make sets $(MAKE)
  71. configure:3000: result: yes
  72. configure:3029: checking whether make supports nested variables
  73. configure:3046: result: yes
  74. configure:3175: checking whether make sets $(MAKE)
  75. configure:3197: result: yes
  76. configure:3254: checking for gcc
  77. configure:3281: result: /usr/bin/clang
  78. configure:3510: checking for C compiler version
  79. configure:3519: /usr/bin/clang --version >&5
  80. Apple clang version 12.0.0 (clang-1200.0.32.6)
  81. Target: arm64-apple-darwin20.1.0
  82. Thread model: posix
  83. InstalledDir: /Library/Developer/CommandLineTools/usr/bin
  84. configure:3530: $? = 0
  85. configure:3519: /usr/bin/clang -v >&5
  86. Apple clang version 12.0.0 (clang-1200.0.32.6)
  87. Target: arm64-apple-darwin20.1.0
  88. Thread model: posix
  89. InstalledDir: /Library/Developer/CommandLineTools/usr/bin
  90. configure:3530: $? = 0
  91. configure:3519: /usr/bin/clang -V >&5
  92. clang: error: argument to '-V' is missing (expected 1 value)
  93. clang: error: no input files
  94. configure:3530: $? = 1
  95. configure:3519: /usr/bin/clang -qversion >&5
  96. clang: error: unknown argument '-qversion'; did you mean '--version'?
  97. clang: error: no input files
  98. configure:3530: $? = 1
  99. configure:3550: checking whether the C compiler works
  100. configure:3572: /usr/bin/clang -I/opt/arm/include -isysroot /opt/SDKs/MacOSX11.0.sdk -O2 -m64 -I/opt/arm/include -isysroot /opt/SDKs/MacOSX11.0.sdk -L/opt/arm/lib -isysroot /opt/SDKs/MacOSX11.0.sdk -O2 -m64 conftest.c >&5
  101. configure:3576: $? = 0
  102. configure:3624: result: yes
  103. configure:3627: checking for C compiler default output file name
  104. configure:3629: result: a.out
  105. configure:3635: checking for suffix of executables
  106. configure:3642: /usr/bin/clang -o conftest -I/opt/arm/include -isysroot /opt/SDKs/MacOSX11.0.sdk -O2 -m64 -I/opt/arm/include -isysroot /opt/SDKs/MacOSX11.0.sdk -L/opt/arm/lib -isysroot /opt/SDKs/MacOSX11.0.sdk -O2 -m64 conftest.c >&5
  107. configure:3646: $? = 0
  108. configure:3668: result:
  109. configure:3690: checking whether we are cross compiling
  110. configure:3698: /usr/bin/clang -o conftest -I/opt/arm/include -isysroot /opt/SDKs/MacOSX11.0.sdk -O2 -m64 -I/opt/arm/include -isysroot /opt/SDKs/MacOSX11.0.sdk -L/opt/arm/lib -isysroot /opt/SDKs/MacOSX11.0.sdk -O2 -m64 conftest.c >&5
  111. configure:3702: $? = 0
  112. configure:3709: ./conftest
  113. configure:3713: $? = 0
  114. configure:3728: result: no
  115. configure:3733: checking for suffix of object files
  116. configure:3755: /usr/bin/clang -c -I/opt/arm/include -isysroot /opt/SDKs/MacOSX11.0.sdk -O2 -m64 -I/opt/arm/include -isysroot /opt/SDKs/MacOSX11.0.sdk conftest.c >&5
  117. configure:3759: $? = 0
  118. configure:3780: result: o
  119. configure:3784: checking whether we are using the GNU C compiler
  120. configure:3803: /usr/bin/clang -c -I/opt/arm/include -isysroot /opt/SDKs/MacOSX11.0.sdk -O2 -m64 -I/opt/arm/include -isysroot /opt/SDKs/MacOSX11.0.sdk conftest.c >&5
  121. configure:3803: $? = 0
  122. configure:3812: result: yes
  123. configure:3821: checking whether /usr/bin/clang accepts -g
  124. configure:3841: /usr/bin/clang -c -g -I/opt/arm/include -isysroot /opt/SDKs/MacOSX11.0.sdk conftest.c >&5
  125. configure:3841: $? = 0
  126. configure:3882: result: yes
  127. configure:3899: checking for /usr/bin/clang option to accept ISO C89
  128. configure:3962: /usr/bin/clang -c -I/opt/arm/include -isysroot /opt/SDKs/MacOSX11.0.sdk -O2 -m64 -I/opt/arm/include -isysroot /opt/SDKs/MacOSX11.0.sdk conftest.c >&5
  129. configure:3962: $? = 0
  130. configure:3975: result: none needed
  131. configure:4000: checking whether /usr/bin/clang understands -c and -o together
  132. configure:4022: /usr/bin/clang -c conftest.c -o conftest2.o
  133. configure:4025: $? = 0
  134. configure:4022: /usr/bin/clang -c conftest.c -o conftest2.o
  135. configure:4025: $? = 0
  136. configure:4037: result: yes
  137. configure:4057: checking whether make supports the include directive
  138. configure:4072: make -f confmf.GNU && cat confinc.out
  139. this is the am__doit target
  140. configure:4075: $? = 0
  141. configure:4094: result: yes (GNU style)
  142. configure:4119: checking dependency style of /usr/bin/clang
  143. configure:4230: result: gcc3
  144. configure:4250: checking how to run the C preprocessor
  145. configure:4281: /usr/bin/clang -E -I/opt/arm/include -isysroot /opt/SDKs/MacOSX11.0.sdk conftest.c
  146. configure:4281: $? = 0
  147. configure:4295: /usr/bin/clang -E -I/opt/arm/include -isysroot /opt/SDKs/MacOSX11.0.sdk conftest.c
  148. conftest.c:11:10: fatal error: 'ac_nonexistent.h' file not found
  149. #include <ac_nonexistent.h>
  150. ^~~~~~~~~~~~~~~~~~
  151. 1 error generated.
  152. configure:4295: $? = 1
  153. configure: failed program was:
  154. | /* confdefs.h */
  155. | #define PACKAGE_NAME "dosbox"
  156. | #define PACKAGE_TARNAME "dosbox"
  157. | #define PACKAGE_VERSION "SVN"
  158. | #define PACKAGE_STRING "dosbox SVN"
  159. | #define PACKAGE_BUGREPORT ""
  160. | #define PACKAGE_URL ""
  161. | #define PACKAGE "dosbox"
  162. | #define VERSION "SVN"
  163. | /* end confdefs.h. */
  164. | #include <ac_nonexistent.h>
  165. configure:4320: result: /usr/bin/clang -E
  166. configure:4340: /usr/bin/clang -E -I/opt/arm/include -isysroot /opt/SDKs/MacOSX11.0.sdk conftest.c
  167. configure:4340: $? = 0
  168. configure:4354: /usr/bin/clang -E -I/opt/arm/include -isysroot /opt/SDKs/MacOSX11.0.sdk conftest.c
  169. conftest.c:11:10: fatal error: 'ac_nonexistent.h' file not found
  170. #include <ac_nonexistent.h>
  171. ^~~~~~~~~~~~~~~~~~
  172. 1 error generated.
  173. configure:4354: $? = 1
  174. configure: failed program was:
  175. | /* confdefs.h */
  176. | #define PACKAGE_NAME "dosbox"
  177. | #define PACKAGE_TARNAME "dosbox"
  178. | #define PACKAGE_VERSION "SVN"
  179. | #define PACKAGE_STRING "dosbox SVN"
  180. | #define PACKAGE_BUGREPORT ""
  181. | #define PACKAGE_URL ""
  182. | #define PACKAGE "dosbox"
  183. | #define VERSION "SVN"
  184. | /* end confdefs.h. */
  185. | #include <ac_nonexistent.h>
  186. configure:4494: checking for C++ compiler version
  187. configure:4503: /usr/bin/clang++ --version >&5
  188. Apple clang version 12.0.0 (clang-1200.0.32.6)
  189. Target: arm64-apple-darwin20.1.0
  190. Thread model: posix
  191. InstalledDir: /Library/Developer/CommandLineTools/usr/bin
  192. configure:4514: $? = 0
  193. configure:4503: /usr/bin/clang++ -v >&5
  194. Apple clang version 12.0.0 (clang-1200.0.32.6)
  195. Target: arm64-apple-darwin20.1.0
  196. Thread model: posix
  197. InstalledDir: /Library/Developer/CommandLineTools/usr/bin
  198. configure:4514: $? = 0
  199. configure:4503: /usr/bin/clang++ -V >&5
  200. clang: error: argument to '-V' is missing (expected 1 value)
  201. clang: error: no input files
  202. configure:4514: $? = 1
  203. configure:4503: /usr/bin/clang++ -qversion >&5
  204. clang: error: unknown argument '-qversion'; did you mean '--version'?
  205. clang: error: no input files
  206. configure:4514: $? = 1
  207. configure:4518: checking whether we are using the GNU C++ compiler
  208. configure:4537: /usr/bin/clang++ -c -I/opt/arm/include -isysroot /opt/SDKs/MacOSX11.0.sdk -O2 -m64 -I/opt/arm/include -isysroot /opt/SDKs/MacOSX11.0.sdk conftest.cpp >&5
  209. configure:4537: $? = 0
  210. configure:4546: result: yes
  211. configure:4555: checking whether /usr/bin/clang++ accepts -g
  212. configure:4575: /usr/bin/clang++ -c -g -I/opt/arm/include -isysroot /opt/SDKs/MacOSX11.0.sdk conftest.cpp >&5
  213. configure:4575: $? = 0
  214. configure:4616: result: yes
  215. configure:4641: checking dependency style of /usr/bin/clang++
  216. configure:4752: result: gcc3
  217. configure:4811: checking for ranlib
  218. configure:4827: found /usr/bin/ranlib
  219. configure:4838: result: ranlib
  220. configure:4907: checking for sdl-config
  221. configure:4938: result: /opt/arm/bin/sdl-config
  222. configure:4947: checking for SDL - version >= 1.2.0
  223. configure:5032: /usr/bin/clang -o conftest -I/opt/arm/include -isysroot /opt/SDKs/MacOSX11.0.sdk -O2 -m64 -I/opt/arm/include/SDL -D_GNU_SOURCE=1 -D_THREAD_SAFE -I/opt/arm/include -isysroot /opt/SDKs/MacOSX11.0.sdk -L/opt/arm/lib -isysroot /opt/SDKs/MacOSX11.0.sdk -O2 -m64 conftest.c -L/opt/arm/lib -lSDLmain -lSDL -Wl,-framework,Cocoa >&5
  224. configure:5032: $? = 0
  225. configure:5032: ./conftest
  226. configure:5032: $? = 0
  227. configure:5046: result: yes
  228. configure:5112: checking SDL version only being 1.2.X
  229. configure:5126: /usr/bin/clang -c -I/opt/arm/include -isysroot /opt/SDKs/MacOSX11.0.sdk -O2 -m64 -I/opt/arm/include -isysroot /opt/SDKs/MacOSX11.0.sdk -I/opt/arm/include/SDL -D_GNU_SOURCE=1 -D_THREAD_SAFE conftest.c >&5
  230. configure:5126: $? = 0
  231. configure:5127: result: yes
  232. configure:5138: checking for an ANSI C-conforming const
  233. configure:5204: /usr/bin/clang -c -I/opt/arm/include -isysroot /opt/SDKs/MacOSX11.0.sdk -O2 -m64 -I/opt/arm/include -isysroot /opt/SDKs/MacOSX11.0.sdk -I/opt/arm/include/SDL -D_GNU_SOURCE=1 -D_THREAD_SAFE conftest.c >&5
  234. configure:5204: $? = 0
  235. configure:5211: result: yes
  236. configure:5219: checking for inline
  237. configure:5235: /usr/bin/clang -c -I/opt/arm/include -isysroot /opt/SDKs/MacOSX11.0.sdk -O2 -m64 -I/opt/arm/include -isysroot /opt/SDKs/MacOSX11.0.sdk -I/opt/arm/include/SDL -D_GNU_SOURCE=1 -D_THREAD_SAFE conftest.c >&5
  238. configure:5235: $? = 0
  239. configure:5243: result: inline
  240. configure:5262: checking for grep that handles long lines and -e
  241. configure:5320: result: /usr/bin/grep
  242. configure:5325: checking for egrep
  243. configure:5387: result: /usr/bin/grep -E
  244. configure:5392: checking for ANSI C header files
  245. configure:5412: /usr/bin/clang -c -I/opt/arm/include -isysroot /opt/SDKs/MacOSX11.0.sdk -O2 -m64 -I/opt/arm/include -isysroot /opt/SDKs/MacOSX11.0.sdk -I/opt/arm/include/SDL -D_GNU_SOURCE=1 -D_THREAD_SAFE conftest.c >&5
  246. configure:5412: $? = 0
  247. configure:5485: /usr/bin/clang -o conftest -I/opt/arm/include -isysroot /opt/SDKs/MacOSX11.0.sdk -O2 -m64 -I/opt/arm/include -isysroot /opt/SDKs/MacOSX11.0.sdk -I/opt/arm/include/SDL -D_GNU_SOURCE=1 -D_THREAD_SAFE -L/opt/arm/lib -isysroot /opt/SDKs/MacOSX11.0.sdk -O2 -m64 conftest.c -L/opt/arm/lib -lSDLmain -lSDL -Wl,-framework,Cocoa >&5
  248. configure:5485: $? = 0
  249. configure:5485: ./conftest
  250. configure:5485: $? = 0
  251. configure:5496: result: yes
  252. configure:5509: checking for sys/types.h
  253. configure:5509: /usr/bin/clang -c -I/opt/arm/include -isysroot /opt/SDKs/MacOSX11.0.sdk -O2 -m64 -I/opt/arm/include -isysroot /opt/SDKs/MacOSX11.0.sdk -I/opt/arm/include/SDL -D_GNU_SOURCE=1 -D_THREAD_SAFE conftest.c >&5
  254. configure:5509: $? = 0
  255. configure:5509: result: yes
  256. configure:5509: checking for sys/stat.h
  257. configure:5509: /usr/bin/clang -c -I/opt/arm/include -isysroot /opt/SDKs/MacOSX11.0.sdk -O2 -m64 -I/opt/arm/include -isysroot /opt/SDKs/MacOSX11.0.sdk -I/opt/arm/include/SDL -D_GNU_SOURCE=1 -D_THREAD_SAFE conftest.c >&5
  258. configure:5509: $? = 0
  259. configure:5509: result: yes
  260. configure:5509: checking for stdlib.h
  261. configure:5509: /usr/bin/clang -c -I/opt/arm/include -isysroot /opt/SDKs/MacOSX11.0.sdk -O2 -m64 -I/opt/arm/include -isysroot /opt/SDKs/MacOSX11.0.sdk -I/opt/arm/include/SDL -D_GNU_SOURCE=1 -D_THREAD_SAFE conftest.c >&5
  262. configure:5509: $? = 0
  263. configure:5509: result: yes
  264. configure:5509: checking for string.h
  265. configure:5509: /usr/bin/clang -c -I/opt/arm/include -isysroot /opt/SDKs/MacOSX11.0.sdk -O2 -m64 -I/opt/arm/include -isysroot /opt/SDKs/MacOSX11.0.sdk -I/opt/arm/include/SDL -D_GNU_SOURCE=1 -D_THREAD_SAFE conftest.c >&5
  266. configure:5509: $? = 0
  267. configure:5509: result: yes
  268. configure:5509: checking for memory.h
  269. configure:5509: /usr/bin/clang -c -I/opt/arm/include -isysroot /opt/SDKs/MacOSX11.0.sdk -O2 -m64 -I/opt/arm/include -isysroot /opt/SDKs/MacOSX11.0.sdk -I/opt/arm/include/SDL -D_GNU_SOURCE=1 -D_THREAD_SAFE conftest.c >&5
  270. configure:5509: $? = 0
  271. configure:5509: result: yes
  272. configure:5509: checking for strings.h
  273. configure:5509: /usr/bin/clang -c -I/opt/arm/include -isysroot /opt/SDKs/MacOSX11.0.sdk -O2 -m64 -I/opt/arm/include -isysroot /opt/SDKs/MacOSX11.0.sdk -I/opt/arm/include/SDL -D_GNU_SOURCE=1 -D_THREAD_SAFE conftest.c >&5
  274. configure:5509: $? = 0
  275. configure:5509: result: yes
  276. configure:5509: checking for inttypes.h
  277. configure:5509: /usr/bin/clang -c -I/opt/arm/include -isysroot /opt/SDKs/MacOSX11.0.sdk -O2 -m64 -I/opt/arm/include -isysroot /opt/SDKs/MacOSX11.0.sdk -I/opt/arm/include/SDL -D_GNU_SOURCE=1 -D_THREAD_SAFE conftest.c >&5
  278. configure:5509: $? = 0
  279. configure:5509: result: yes
  280. configure:5509: checking for stdint.h
  281. configure:5509: /usr/bin/clang -c -I/opt/arm/include -isysroot /opt/SDKs/MacOSX11.0.sdk -O2 -m64 -I/opt/arm/include -isysroot /opt/SDKs/MacOSX11.0.sdk -I/opt/arm/include/SDL -D_GNU_SOURCE=1 -D_THREAD_SAFE conftest.c >&5
  282. configure:5509: $? = 0
  283. configure:5509: result: yes
  284. configure:5509: checking for unistd.h
  285. configure:5509: /usr/bin/clang -c -I/opt/arm/include -isysroot /opt/SDKs/MacOSX11.0.sdk -O2 -m64 -I/opt/arm/include -isysroot /opt/SDKs/MacOSX11.0.sdk -I/opt/arm/include/SDL -D_GNU_SOURCE=1 -D_THREAD_SAFE conftest.c >&5
  286. configure:5509: $? = 0
  287. configure:5509: result: yes
  288. configure:5521: checking for size_t
  289. configure:5521: /usr/bin/clang -c -I/opt/arm/include -isysroot /opt/SDKs/MacOSX11.0.sdk -O2 -m64 -I/opt/arm/include -isysroot /opt/SDKs/MacOSX11.0.sdk -I/opt/arm/include/SDL -D_GNU_SOURCE=1 -D_THREAD_SAFE conftest.c >&5
  290. configure:5521: $? = 0
  291. configure:5521: /usr/bin/clang -c -I/opt/arm/include -isysroot /opt/SDKs/MacOSX11.0.sdk -O2 -m64 -I/opt/arm/include -isysroot /opt/SDKs/MacOSX11.0.sdk -I/opt/arm/include/SDL -D_GNU_SOURCE=1 -D_THREAD_SAFE conftest.c >&5
  292. conftest.c:57:21: error: expected expression
  293. if (sizeof ((size_t)))
  294. ^
  295. 1 error generated.
  296. configure:5521: $? = 1
  297. configure: failed program was:
  298. | /* confdefs.h */
  299. | #define PACKAGE_NAME "dosbox"
  300. | #define PACKAGE_TARNAME "dosbox"
  301. | #define PACKAGE_VERSION "SVN"
  302. | #define PACKAGE_STRING "dosbox SVN"
  303. | #define PACKAGE_BUGREPORT ""
  304. | #define PACKAGE_URL ""
  305. | #define PACKAGE "dosbox"
  306. | #define VERSION "SVN"
  307. | #define STDC_HEADERS 1
  308. | #define HAVE_SYS_TYPES_H 1
  309. | #define HAVE_SYS_STAT_H 1
  310. | #define HAVE_STDLIB_H 1
  311. | #define HAVE_STRING_H 1
  312. | #define HAVE_MEMORY_H 1
  313. | #define HAVE_STRINGS_H 1
  314. | #define HAVE_INTTYPES_H 1
  315. | #define HAVE_STDINT_H 1
  316. | #define HAVE_UNISTD_H 1
  317. | /* end confdefs.h. */
  318. | #include <stdio.h>
  319. | #ifdef HAVE_SYS_TYPES_H
  320. | # include <sys/types.h>
  321. | #endif
  322. | #ifdef HAVE_SYS_STAT_H
  323. | # include <sys/stat.h>
  324. | #endif
  325. | #ifdef STDC_HEADERS
  326. | # include <stdlib.h>
  327. | # include <stddef.h>
  328. | #else
  329. | # ifdef HAVE_STDLIB_H
  330. | # include <stdlib.h>
  331. | # endif
  332. | #endif
  333. | #ifdef HAVE_STRING_H
  334. | # if !defined STDC_HEADERS && defined HAVE_MEMORY_H
  335. | # include <memory.h>
  336. | # endif
  337. | # include <string.h>
  338. | #endif
  339. | #ifdef HAVE_STRINGS_H
  340. | # include <strings.h>
  341. | #endif
  342. | #ifdef HAVE_INTTYPES_H
  343. | # include <inttypes.h>
  344. | #endif
  345. | #ifdef HAVE_STDINT_H
  346. | # include <stdint.h>
  347. | #endif
  348. | #ifdef HAVE_UNISTD_H
  349. | # include <unistd.h>
  350. | #endif
  351. | int
  352. | main ()
  353. | {
  354. | if (sizeof ((size_t)))
  355. | return 0;
  356. | ;
  357. | return 0;
  358. | }
  359. configure:5521: result: yes
  360. configure:5532: checking whether struct tm is in sys/time.h or time.h
  361. configure:5552: /usr/bin/clang -c -I/opt/arm/include -isysroot /opt/SDKs/MacOSX11.0.sdk -O2 -m64 -I/opt/arm/include -isysroot /opt/SDKs/MacOSX11.0.sdk -I/opt/arm/include/SDL -D_GNU_SOURCE=1 -D_THREAD_SAFE conftest.c >&5
  362. configure:5552: $? = 0
  363. configure:5559: result: time.h
  364. configure:5571: checking size of unsigned char
  365. configure:5576: /usr/bin/clang -o conftest -I/opt/arm/include -isysroot /opt/SDKs/MacOSX11.0.sdk -O2 -m64 -I/opt/arm/include -isysroot /opt/SDKs/MacOSX11.0.sdk -I/opt/arm/include/SDL -D_GNU_SOURCE=1 -D_THREAD_SAFE -L/opt/arm/lib -isysroot /opt/SDKs/MacOSX11.0.sdk -O2 -m64 conftest.c -L/opt/arm/lib -lSDLmain -lSDL -Wl,-framework,Cocoa >&5
  366. configure:5576: $? = 0
  367. configure:5576: ./conftest
  368. configure:5576: $? = 0
  369. configure:5590: result: 1
  370. configure:5604: checking size of unsigned short
  371. configure:5609: /usr/bin/clang -o conftest -I/opt/arm/include -isysroot /opt/SDKs/MacOSX11.0.sdk -O2 -m64 -I/opt/arm/include -isysroot /opt/SDKs/MacOSX11.0.sdk -I/opt/arm/include/SDL -D_GNU_SOURCE=1 -D_THREAD_SAFE -L/opt/arm/lib -isysroot /opt/SDKs/MacOSX11.0.sdk -O2 -m64 conftest.c -L/opt/arm/lib -lSDLmain -lSDL -Wl,-framework,Cocoa >&5
  372. configure:5609: $? = 0
  373. configure:5609: ./conftest
  374. configure:5609: $? = 0
  375. configure:5623: result: 2
  376. configure:5637: checking size of unsigned int
  377. configure:5642: /usr/bin/clang -o conftest -I/opt/arm/include -isysroot /opt/SDKs/MacOSX11.0.sdk -O2 -m64 -I/opt/arm/include -isysroot /opt/SDKs/MacOSX11.0.sdk -I/opt/arm/include/SDL -D_GNU_SOURCE=1 -D_THREAD_SAFE -L/opt/arm/lib -isysroot /opt/SDKs/MacOSX11.0.sdk -O2 -m64 conftest.c -L/opt/arm/lib -lSDLmain -lSDL -Wl,-framework,Cocoa >&5
  378. configure:5642: $? = 0
  379. configure:5642: ./conftest
  380. configure:5642: $? = 0
  381. configure:5656: result: 4
  382. configure:5670: checking size of unsigned long
  383. configure:5675: /usr/bin/clang -o conftest -I/opt/arm/include -isysroot /opt/SDKs/MacOSX11.0.sdk -O2 -m64 -I/opt/arm/include -isysroot /opt/SDKs/MacOSX11.0.sdk -I/opt/arm/include/SDL -D_GNU_SOURCE=1 -D_THREAD_SAFE -L/opt/arm/lib -isysroot /opt/SDKs/MacOSX11.0.sdk -O2 -m64 conftest.c -L/opt/arm/lib -lSDLmain -lSDL -Wl,-framework,Cocoa >&5
  384. configure:5675: $? = 0
  385. configure:5675: ./conftest
  386. configure:5675: $? = 0
  387. configure:5689: result: 8
  388. configure:5703: checking size of unsigned long long
  389. configure:5708: /usr/bin/clang -o conftest -I/opt/arm/include -isysroot /opt/SDKs/MacOSX11.0.sdk -O2 -m64 -I/opt/arm/include -isysroot /opt/SDKs/MacOSX11.0.sdk -I/opt/arm/include/SDL -D_GNU_SOURCE=1 -D_THREAD_SAFE -L/opt/arm/lib -isysroot /opt/SDKs/MacOSX11.0.sdk -O2 -m64 conftest.c -L/opt/arm/lib -lSDLmain -lSDL -Wl,-framework,Cocoa >&5
  390. configure:5708: $? = 0
  391. configure:5708: ./conftest
  392. configure:5708: $? = 0
  393. configure:5722: result: 8
  394. configure:5736: checking size of int *
  395. configure:5741: /usr/bin/clang -o conftest -I/opt/arm/include -isysroot /opt/SDKs/MacOSX11.0.sdk -O2 -m64 -I/opt/arm/include -isysroot /opt/SDKs/MacOSX11.0.sdk -I/opt/arm/include/SDL -D_GNU_SOURCE=1 -D_THREAD_SAFE -L/opt/arm/lib -isysroot /opt/SDKs/MacOSX11.0.sdk -O2 -m64 conftest.c -L/opt/arm/lib -lSDLmain -lSDL -Wl,-framework,Cocoa >&5
  396. configure:5741: $? = 0
  397. configure:5741: ./conftest
  398. configure:5741: $? = 0
  399. configure:5755: result: 8
  400. configure:5769: checking for stdlib.h
  401. configure:5769: result: yes
  402. configure:5769: checking for sys/types.h
  403. configure:5769: result: yes
  404. configure:5782: checking for sys/socket.h
  405. configure:5782: /usr/bin/clang -c -I/opt/arm/include -isysroot /opt/SDKs/MacOSX11.0.sdk -O2 -m64 -I/opt/arm/include -isysroot /opt/SDKs/MacOSX11.0.sdk -I/opt/arm/include/SDL -D_GNU_SOURCE=1 -D_THREAD_SAFE conftest.c >&5
  406. configure:5782: $? = 0
  407. configure:5782: result: yes
  408. configure:5782: checking for netinet/in.h
  409. configure:5782: /usr/bin/clang -c -I/opt/arm/include -isysroot /opt/SDKs/MacOSX11.0.sdk -O2 -m64 -I/opt/arm/include -isysroot /opt/SDKs/MacOSX11.0.sdk -I/opt/arm/include/SDL -D_GNU_SOURCE=1 -D_THREAD_SAFE conftest.c >&5
  410. configure:5782: $? = 0
  411. configure:5782: result: yes
  412. configure:5782: checking for pwd.h
  413. configure:5782: /usr/bin/clang -c -I/opt/arm/include -isysroot /opt/SDKs/MacOSX11.0.sdk -O2 -m64 -I/opt/arm/include -isysroot /opt/SDKs/MacOSX11.0.sdk -I/opt/arm/include/SDL -D_GNU_SOURCE=1 -D_THREAD_SAFE conftest.c >&5
  414. configure:5782: $? = 0
  415. configure:5782: result: yes
  416. configure:5826: /usr/bin/clang -c -I/opt/arm/include -isysroot /opt/SDKs/MacOSX11.0.sdk -O2 -m64 -I/opt/arm/include -isysroot /opt/SDKs/MacOSX11.0.sdk -I/opt/arm/include/SDL -D_GNU_SOURCE=1 -D_THREAD_SAFE conftest.c >&5
  417. configure:5826: $? = 0
  418. configure:5835: checking if environ can be included
  419. configure:5850: /usr/bin/clang -o conftest -I/opt/arm/include -isysroot /opt/SDKs/MacOSX11.0.sdk -O2 -m64 -I/opt/arm/include -isysroot /opt/SDKs/MacOSX11.0.sdk -I/opt/arm/include/SDL -D_GNU_SOURCE=1 -D_THREAD_SAFE -L/opt/arm/lib -isysroot /opt/SDKs/MacOSX11.0.sdk -O2 -m64 conftest.c -L/opt/arm/lib -lSDLmain -lSDL -Wl,-framework,Cocoa >&5
  420. conftest.c:38:2: error: use of undeclared identifier 'environ'
  421. *environ;
  422. ^
  423. 1 error generated.
  424. configure:5850: $? = 1
  425. configure: failed program was:
  426. | /* confdefs.h */
  427. | #define PACKAGE_NAME "dosbox"
  428. | #define PACKAGE_TARNAME "dosbox"
  429. | #define PACKAGE_VERSION "SVN"
  430. | #define PACKAGE_STRING "dosbox SVN"
  431. | #define PACKAGE_BUGREPORT ""
  432. | #define PACKAGE_URL ""
  433. | #define PACKAGE "dosbox"
  434. | #define VERSION "SVN"
  435. | #define STDC_HEADERS 1
  436. | #define HAVE_SYS_TYPES_H 1
  437. | #define HAVE_SYS_STAT_H 1
  438. | #define HAVE_STDLIB_H 1
  439. | #define HAVE_STRING_H 1
  440. | #define HAVE_MEMORY_H 1
  441. | #define HAVE_STRINGS_H 1
  442. | #define HAVE_INTTYPES_H 1
  443. | #define HAVE_STDINT_H 1
  444. | #define HAVE_UNISTD_H 1
  445. | #define SIZEOF_UNSIGNED_CHAR 1
  446. | #define SIZEOF_UNSIGNED_SHORT 2
  447. | #define SIZEOF_UNSIGNED_INT 4
  448. | #define SIZEOF_UNSIGNED_LONG 8
  449. | #define SIZEOF_UNSIGNED_LONG_LONG 8
  450. | #define SIZEOF_INT_P 8
  451. | #define HAVE_STDLIB_H 1
  452. | #define HAVE_SYS_TYPES_H 1
  453. | #define HAVE_SYS_SOCKET_H 1
  454. | #define HAVE_NETINET_IN_H 1
  455. | #define HAVE_PWD_H 1
  456. | /* end confdefs.h. */
  457. |
  458. | #include <unistd.h>
  459. | #include <stdlib.h>
  460. | int
  461. | main ()
  462. | {
  463. | *environ;
  464. | ;
  465. | return 0;
  466. | }
  467. configure:5856: result: no
  468. configure:5862: checking if environ can be linked
  469. configure:5875: /usr/bin/clang -o conftest -I/opt/arm/include -isysroot /opt/SDKs/MacOSX11.0.sdk -O2 -m64 -I/opt/arm/include -isysroot /opt/SDKs/MacOSX11.0.sdk -I/opt/arm/include/SDL -D_GNU_SOURCE=1 -D_THREAD_SAFE -L/opt/arm/lib -isysroot /opt/SDKs/MacOSX11.0.sdk -O2 -m64 conftest.c -L/opt/arm/lib -lSDLmain -lSDL -Wl,-framework,Cocoa >&5
  470. conftest.c:36:1: warning: expression result unused [-Wunused-value]
  471. *environ;
  472. ^~~~~~~~
  473. 1 warning generated.
  474. configure:5875: $? = 0
  475. configure:5876: result: yes
  476. configure:5887: checking if dirent includes d_type
  477. configure:5899: /usr/bin/clang -c -I/opt/arm/include -isysroot /opt/SDKs/MacOSX11.0.sdk -O2 -m64 -I/opt/arm/include -isysroot /opt/SDKs/MacOSX11.0.sdk -I/opt/arm/include/SDL -D_GNU_SOURCE=1 -D_THREAD_SAFE conftest.c >&5
  478. configure:5899: $? = 0
  479. configure:5900: result: yes
  480. configure:5911: checking for powf in libm
  481. configure:5928: /usr/bin/clang -o conftest -I/opt/arm/include -isysroot /opt/SDKs/MacOSX11.0.sdk -O2 -m64 -I/opt/arm/include -isysroot /opt/SDKs/MacOSX11.0.sdk -I/opt/arm/include/SDL -D_GNU_SOURCE=1 -D_THREAD_SAFE -L/opt/arm/lib -isysroot /opt/SDKs/MacOSX11.0.sdk -O2 -m64 conftest.c -L/opt/arm/lib -lSDLmain -lSDL -Wl,-framework,Cocoa -lm >&5
  482. conftest.c:39:9: warning: ignoring return value of function declared with const attribute [-Wunused-value]
  483. powf(1.0f, 1.0f);
  484. ^~~~ ~~~~~~~~~~
  485. 1 warning generated.
  486. configure:5928: $? = 0
  487. configure:5929: result: yes
  488. configure:5941: checking for library containing clock_gettime
  489. configure:5972: /usr/bin/clang -o conftest -I/opt/arm/include -isysroot /opt/SDKs/MacOSX11.0.sdk -O2 -m64 -I/opt/arm/include -isysroot /opt/SDKs/MacOSX11.0.sdk -I/opt/arm/include/SDL -D_GNU_SOURCE=1 -D_THREAD_SAFE -L/opt/arm/lib -isysroot /opt/SDKs/MacOSX11.0.sdk -O2 -m64 conftest.c -L/opt/arm/lib -lSDLmain -lSDL -Wl,-framework,Cocoa >&5
  490. configure:5972: $? = 0
  491. configure:5989: result: none required
  492. configure:6007: checking if compiler allows __attribute__
  493. configure:6021: /usr/bin/clang -c -I/opt/arm/include -isysroot /opt/SDKs/MacOSX11.0.sdk -O2 -m64 -I/opt/arm/include -isysroot /opt/SDKs/MacOSX11.0.sdk -I/opt/arm/include/SDL -D_GNU_SOURCE=1 -D_THREAD_SAFE conftest.c >&5
  494. configure:6021: $? = 0
  495. configure:6022: result: yes
  496. configure:6037: checking if compiler allows __attribute__((always_inline))
  497. configure:6044: /usr/bin/clang -c -Werror -I/opt/arm/include -isysroot /opt/SDKs/MacOSX11.0.sdk -I/opt/arm/include/SDL -D_GNU_SOURCE=1 -D_THREAD_SAFE conftest.c >&5
  498. configure:6044: $? = 0
  499. configure:6045: result: yes
  500. configure:6055: checking if compiler allows __attribute__((fastcall))
  501. configure:6062: /usr/bin/clang -c -Werror -I/opt/arm/include -isysroot /opt/SDKs/MacOSX11.0.sdk -I/opt/arm/include/SDL -D_GNU_SOURCE=1 -D_THREAD_SAFE conftest.c >&5
  502. conftest.c:37:22: error: 'fastcall' calling convention is not supported for this target [-Werror,-Wignored-attributes]
  503. void __attribute__((fastcall)) test(){}
  504. ^
  505. 1 error generated.
  506. configure:6062: $? = 1
  507. configure: failed program was:
  508. | /* confdefs.h */
  509. | #define PACKAGE_NAME "dosbox"
  510. | #define PACKAGE_TARNAME "dosbox"
  511. | #define PACKAGE_VERSION "SVN"
  512. | #define PACKAGE_STRING "dosbox SVN"
  513. | #define PACKAGE_BUGREPORT ""
  514. | #define PACKAGE_URL ""
  515. | #define PACKAGE "dosbox"
  516. | #define VERSION "SVN"
  517. | #define STDC_HEADERS 1
  518. | #define HAVE_SYS_TYPES_H 1
  519. | #define HAVE_SYS_STAT_H 1
  520. | #define HAVE_STDLIB_H 1
  521. | #define HAVE_STRING_H 1
  522. | #define HAVE_MEMORY_H 1
  523. | #define HAVE_STRINGS_H 1
  524. | #define HAVE_INTTYPES_H 1
  525. | #define HAVE_STDINT_H 1
  526. | #define HAVE_UNISTD_H 1
  527. | #define SIZEOF_UNSIGNED_CHAR 1
  528. | #define SIZEOF_UNSIGNED_SHORT 2
  529. | #define SIZEOF_UNSIGNED_INT 4
  530. | #define SIZEOF_UNSIGNED_LONG 8
  531. | #define SIZEOF_UNSIGNED_LONG_LONG 8
  532. | #define SIZEOF_INT_P 8
  533. | #define HAVE_STDLIB_H 1
  534. | #define HAVE_SYS_TYPES_H 1
  535. | #define HAVE_SYS_SOCKET_H 1
  536. | #define HAVE_NETINET_IN_H 1
  537. | #define HAVE_PWD_H 1
  538. | #define ENVIRON_LINKED 1
  539. | #define DIRENT_HAS_D_TYPE 1
  540. | #define DB_HAVE_CLOCK_GETTIME 1
  541. | #define C_HAS_ATTRIBUTE 1
  542. | #define C_ATTRIBUTE_ALWAYS_INLINE 1
  543. | /* end confdefs.h. */
  544. | void __attribute__((fastcall)) test(){}
  545. |
  546. configure:6067: result: no
  547. configure:6085: checking if compiler allows __builtin_expect
  548. configure:6101: /usr/bin/clang++ -c -I/opt/arm/include -isysroot /opt/SDKs/MacOSX11.0.sdk -O2 -m64 -I/opt/arm/include -isysroot /opt/SDKs/MacOSX11.0.sdk -I/opt/arm/include/SDL -D_GNU_SOURCE=1 -D_THREAD_SAFE conftest.cpp >&5
  549. conftest.cpp:42:44: warning: if statement has empty body [-Wempty-body]
  550. int x=10;if( __builtin_expect ((x==1),0) ) ;
  551. ^
  552. conftest.cpp:42:44: note: put the semicolon on a separate line to silence this warning
  553. 1 warning generated.
  554. configure:6101: $? = 0
  555. configure:6102: result: yes
  556. configure:6121: checking if compiler supports -mno-ms-bitfields
  557. configure:6131: /usr/bin/clang -c -mno-ms-bitfields -I/opt/arm/include -isysroot /opt/SDKs/MacOSX11.0.sdk -I/opt/arm/include/SDL -D_GNU_SOURCE=1 -D_THREAD_SAFE conftest.c >&5
  558. configure:6131: $? = 0
  559. configure:6133: result: yes
  560. configure:6146: checking if compiler supports Apple's Core MIDI headers
  561. configure:6155: /usr/bin/clang -c -I/opt/arm/include -isysroot /opt/SDKs/MacOSX11.0.sdk -O2 -m64 -I/opt/arm/include -isysroot /opt/SDKs/MacOSX11.0.sdk -I/opt/arm/include/SDL -D_GNU_SOURCE=1 -D_THREAD_SAFE conftest.c >&5
  562. configure:6155: $? = 0
  563. configure:6156: result: yes
  564. configure:6167: checking if compiler supports Apple's Core Audio headers
  565. configure:6177: /usr/bin/clang -c -I/opt/arm/include -isysroot /opt/SDKs/MacOSX11.0.sdk -O2 -m64 -I/opt/arm/include -isysroot /opt/SDKs/MacOSX11.0.sdk -I/opt/arm/include/SDL -D_GNU_SOURCE=1 -D_THREAD_SAFE conftest.c >&5
  566. configure:6177: $? = 0
  567. configure:6178: result: yes
  568. configure:6240: checking for ALSA CFLAGS
  569. configure:6246: result:
  570. configure:6249: checking for ALSA LDFLAGS
  571. configure:6262: result: -lasound -lm -ldl -lpthread
  572. configure:6266: checking for libasound headers version >= 0.9.0
  573. configure:6328: /usr/bin/clang -c -I/opt/arm/include -isysroot /opt/SDKs/MacOSX11.0.sdk -O2 -m64 -I/opt/arm/include -isysroot /opt/SDKs/MacOSX11.0.sdk -I/opt/arm/include/SDL -D_GNU_SOURCE=1 -D_THREAD_SAFE conftest.c >&5
  574. conftest.c:41:10: fatal error: 'alsa/asoundlib.h' file not found
  575. #include <alsa/asoundlib.h>
  576. ^~~~~~~~~~~~~~~~~~
  577. 1 error generated.
  578. configure:6328: $? = 1
  579. configure: failed program was:
  580. | /* confdefs.h */
  581. | #define PACKAGE_NAME "dosbox"
  582. | #define PACKAGE_TARNAME "dosbox"
  583. | #define PACKAGE_VERSION "SVN"
  584. | #define PACKAGE_STRING "dosbox SVN"
  585. | #define PACKAGE_BUGREPORT ""
  586. | #define PACKAGE_URL ""
  587. | #define PACKAGE "dosbox"
  588. | #define VERSION "SVN"
  589. | #define STDC_HEADERS 1
  590. | #define HAVE_SYS_TYPES_H 1
  591. | #define HAVE_SYS_STAT_H 1
  592. | #define HAVE_STDLIB_H 1
  593. | #define HAVE_STRING_H 1
  594. | #define HAVE_MEMORY_H 1
  595. | #define HAVE_STRINGS_H 1
  596. | #define HAVE_INTTYPES_H 1
  597. | #define HAVE_STDINT_H 1
  598. | #define HAVE_UNISTD_H 1
  599. | #define SIZEOF_UNSIGNED_CHAR 1
  600. | #define SIZEOF_UNSIGNED_SHORT 2
  601. | #define SIZEOF_UNSIGNED_INT 4
  602. | #define SIZEOF_UNSIGNED_LONG 8
  603. | #define SIZEOF_UNSIGNED_LONG_LONG 8
  604. | #define SIZEOF_INT_P 8
  605. | #define HAVE_STDLIB_H 1
  606. | #define HAVE_SYS_TYPES_H 1
  607. | #define HAVE_SYS_SOCKET_H 1
  608. | #define HAVE_NETINET_IN_H 1
  609. | #define HAVE_PWD_H 1
  610. | #define ENVIRON_LINKED 1
  611. | #define DIRENT_HAS_D_TYPE 1
  612. | #define DB_HAVE_CLOCK_GETTIME 1
  613. | #define C_HAS_ATTRIBUTE 1
  614. | #define C_ATTRIBUTE_ALWAYS_INLINE 1
  615. | #define C_HAS_BUILTIN_EXPECT 1
  616. | #define C_SUPPORTS_COREMIDI /**/
  617. | #define C_SUPPORTS_COREAUDIO /**/
  618. | /* end confdefs.h. */
  619. |
  620. | #include <alsa/asoundlib.h>
  621. |
  622. | int
  623. | main ()
  624. | {
  625. |
  626. | /* ensure backward compatibility */
  627. | #if !defined(SND_LIB_MAJOR) && defined(SOUNDLIB_VERSION_MAJOR)
  628. | #define SND_LIB_MAJOR SOUNDLIB_VERSION_MAJOR
  629. | #endif
  630. | #if !defined(SND_LIB_MINOR) && defined(SOUNDLIB_VERSION_MINOR)
  631. | #define SND_LIB_MINOR SOUNDLIB_VERSION_MINOR
  632. | #endif
  633. | #if !defined(SND_LIB_SUBMINOR) && defined(SOUNDLIB_VERSION_SUBMINOR)
  634. | #define SND_LIB_SUBMINOR SOUNDLIB_VERSION_SUBMINOR
  635. | #endif
  636. |
  637. | # if(SND_LIB_MAJOR > 0)
  638. | exit(0);
  639. | # else
  640. | # if(SND_LIB_MAJOR < 0)
  641. | # error not present
  642. | # endif
  643. |
  644. | # if(SND_LIB_MINOR > 9)
  645. | exit(0);
  646. | # else
  647. | # if(SND_LIB_MINOR < 9)
  648. | # error not present
  649. | # endif
  650. |
  651. | # if(SND_LIB_SUBMINOR < 0)
  652. | # error not present
  653. | # endif
  654. | # endif
  655. | # endif
  656. | exit(0);
  657. |
  658. | ;
  659. | return 0;
  660. | }
  661. configure:6332: result: not present.
  662. configure:6346: checking for snd_ctl_open in -lasound
  663. configure:6371: /usr/bin/clang -o conftest -I/opt/arm/include -isysroot /opt/SDKs/MacOSX11.0.sdk -O2 -m64 -I/opt/arm/include -isysroot /opt/SDKs/MacOSX11.0.sdk -I/opt/arm/include/SDL -D_GNU_SOURCE=1 -D_THREAD_SAFE -L/opt/arm/lib -isysroot /opt/SDKs/MacOSX11.0.sdk -O2 -m64 conftest.c -lasound -lasound -lm -ldl -lpthread -L/opt/arm/lib -lSDLmain -lSDL -Wl,-framework,Cocoa -framework CoreMIDI -framework AudioUnit -framework AudioToolbox >&5
  664. ld: library not found for -lasound
  665. clang: error: linker command failed with exit code 1 (use -v to see invocation)
  666. configure:6371: $? = 1
  667. configure: failed program was:
  668. | /* confdefs.h */
  669. | #define PACKAGE_NAME "dosbox"
  670. | #define PACKAGE_TARNAME "dosbox"
  671. | #define PACKAGE_VERSION "SVN"
  672. | #define PACKAGE_STRING "dosbox SVN"
  673. | #define PACKAGE_BUGREPORT ""
  674. | #define PACKAGE_URL ""
  675. | #define PACKAGE "dosbox"
  676. | #define VERSION "SVN"
  677. | #define STDC_HEADERS 1
  678. | #define HAVE_SYS_TYPES_H 1
  679. | #define HAVE_SYS_STAT_H 1
  680. | #define HAVE_STDLIB_H 1
  681. | #define HAVE_STRING_H 1
  682. | #define HAVE_MEMORY_H 1
  683. | #define HAVE_STRINGS_H 1
  684. | #define HAVE_INTTYPES_H 1
  685. | #define HAVE_STDINT_H 1
  686. | #define HAVE_UNISTD_H 1
  687. | #define SIZEOF_UNSIGNED_CHAR 1
  688. | #define SIZEOF_UNSIGNED_SHORT 2
  689. | #define SIZEOF_UNSIGNED_INT 4
  690. | #define SIZEOF_UNSIGNED_LONG 8
  691. | #define SIZEOF_UNSIGNED_LONG_LONG 8
  692. | #define SIZEOF_INT_P 8
  693. | #define HAVE_STDLIB_H 1
  694. | #define HAVE_SYS_TYPES_H 1
  695. | #define HAVE_SYS_SOCKET_H 1
  696. | #define HAVE_NETINET_IN_H 1
  697. | #define HAVE_PWD_H 1
  698. | #define ENVIRON_LINKED 1
  699. | #define DIRENT_HAS_D_TYPE 1
  700. | #define DB_HAVE_CLOCK_GETTIME 1
  701. | #define C_HAS_ATTRIBUTE 1
  702. | #define C_ATTRIBUTE_ALWAYS_INLINE 1
  703. | #define C_HAS_BUILTIN_EXPECT 1
  704. | #define C_SUPPORTS_COREMIDI /**/
  705. | #define C_SUPPORTS_COREAUDIO /**/
  706. | /* end confdefs.h. */
  707. |
  708. | /* Override any GCC internal prototype to avoid an error.
  709. | Use char because int might match the return type of a GCC
  710. | builtin and then its argument prototype would still apply. */
  711. | #ifdef __cplusplus
  712. | extern "C"
  713. | #endif
  714. | char snd_ctl_open ();
  715. | int
  716. | main ()
  717. | {
  718. | return snd_ctl_open ();
  719. | ;
  720. | return 0;
  721. | }
  722. configure:6380: result: no
  723. configure:6420: checking whether byte ordering is bigendian
  724. configure:6435: /usr/bin/clang -c -I/opt/arm/include -isysroot /opt/SDKs/MacOSX11.0.sdk -O2 -m64 -I/opt/arm/include -isysroot /opt/SDKs/MacOSX11.0.sdk -I/opt/arm/include/SDL -D_GNU_SOURCE=1 -D_THREAD_SAFE conftest.c >&5
  725. configure:6435: $? = 0
  726. configure:6480: /usr/bin/clang -c -I/opt/arm/include -isysroot /opt/SDKs/MacOSX11.0.sdk -O2 -m64 -I/opt/arm/include -isysroot /opt/SDKs/MacOSX11.0.sdk -I/opt/arm/include/SDL -D_GNU_SOURCE=1 -D_THREAD_SAFE conftest.c >&5
  727. configure:6480: $? = 0
  728. configure:6498: /usr/bin/clang -c -I/opt/arm/include -isysroot /opt/SDKs/MacOSX11.0.sdk -O2 -m64 -I/opt/arm/include -isysroot /opt/SDKs/MacOSX11.0.sdk -I/opt/arm/include/SDL -D_GNU_SOURCE=1 -D_THREAD_SAFE conftest.c >&5
  729. conftest.c:47:4: error: use of undeclared identifier 'not'
  730. not big endian
  731. ^
  732. 1 error generated.
  733. configure:6498: $? = 1
  734. configure: failed program was:
  735. | /* confdefs.h */
  736. | #define PACKAGE_NAME "dosbox"
  737. | #define PACKAGE_TARNAME "dosbox"
  738. | #define PACKAGE_VERSION "SVN"
  739. | #define PACKAGE_STRING "dosbox SVN"
  740. | #define PACKAGE_BUGREPORT ""
  741. | #define PACKAGE_URL ""
  742. | #define PACKAGE "dosbox"
  743. | #define VERSION "SVN"
  744. | #define STDC_HEADERS 1
  745. | #define HAVE_SYS_TYPES_H 1
  746. | #define HAVE_SYS_STAT_H 1
  747. | #define HAVE_STDLIB_H 1
  748. | #define HAVE_STRING_H 1
  749. | #define HAVE_MEMORY_H 1
  750. | #define HAVE_STRINGS_H 1
  751. | #define HAVE_INTTYPES_H 1
  752. | #define HAVE_STDINT_H 1
  753. | #define HAVE_UNISTD_H 1
  754. | #define SIZEOF_UNSIGNED_CHAR 1
  755. | #define SIZEOF_UNSIGNED_SHORT 2
  756. | #define SIZEOF_UNSIGNED_INT 4
  757. | #define SIZEOF_UNSIGNED_LONG 8
  758. | #define SIZEOF_UNSIGNED_LONG_LONG 8
  759. | #define SIZEOF_INT_P 8
  760. | #define HAVE_STDLIB_H 1
  761. | #define HAVE_SYS_TYPES_H 1
  762. | #define HAVE_SYS_SOCKET_H 1
  763. | #define HAVE_NETINET_IN_H 1
  764. | #define HAVE_PWD_H 1
  765. | #define ENVIRON_LINKED 1
  766. | #define DIRENT_HAS_D_TYPE 1
  767. | #define DB_HAVE_CLOCK_GETTIME 1
  768. | #define C_HAS_ATTRIBUTE 1
  769. | #define C_ATTRIBUTE_ALWAYS_INLINE 1
  770. | #define C_HAS_BUILTIN_EXPECT 1
  771. | #define C_SUPPORTS_COREMIDI /**/
  772. | #define C_SUPPORTS_COREAUDIO /**/
  773. | /* end confdefs.h. */
  774. | #include <sys/types.h>
  775. | #include <sys/param.h>
  776. |
  777. | int
  778. | main ()
  779. | {
  780. | #if BYTE_ORDER != BIG_ENDIAN
  781. | not big endian
  782. | #endif
  783. |
  784. | ;
  785. | return 0;
  786. | }
  787. configure:6626: result: no
  788. configure:6820: checking whether memory handling in the CPU Core will be inlined
  789. configure:6823: result: yes
  790. configure:6833: checking for target cpu type
  791. configure:6894: result: unknown
  792. configure:6911: /usr/bin/clang -c -I/opt/arm/include -isysroot /opt/SDKs/MacOSX11.0.sdk -O2 -m64 -I/opt/arm/include -isysroot /opt/SDKs/MacOSX11.0.sdk -I/opt/arm/include/SDL -D_GNU_SOURCE=1 -D_THREAD_SAFE conftest.c >&5
  793. conftest.c:44:2: error: size intp is not 4, this not something to worry about
  794. #error size intp is not 4, this not something to worry about
  795. ^
  796. 1 error generated.
  797. configure:6911: $? = 1
  798. configure: failed program was:
  799. | /* confdefs.h */
  800. | #define PACKAGE_NAME "dosbox"
  801. | #define PACKAGE_TARNAME "dosbox"
  802. | #define PACKAGE_VERSION "SVN"
  803. | #define PACKAGE_STRING "dosbox SVN"
  804. | #define PACKAGE_BUGREPORT ""
  805. | #define PACKAGE_URL ""
  806. | #define PACKAGE "dosbox"
  807. | #define VERSION "SVN"
  808. | #define STDC_HEADERS 1
  809. | #define HAVE_SYS_TYPES_H 1
  810. | #define HAVE_SYS_STAT_H 1
  811. | #define HAVE_STDLIB_H 1
  812. | #define HAVE_STRING_H 1
  813. | #define HAVE_MEMORY_H 1
  814. | #define HAVE_STRINGS_H 1
  815. | #define HAVE_INTTYPES_H 1
  816. | #define HAVE_STDINT_H 1
  817. | #define HAVE_UNISTD_H 1
  818. | #define SIZEOF_UNSIGNED_CHAR 1
  819. | #define SIZEOF_UNSIGNED_SHORT 2
  820. | #define SIZEOF_UNSIGNED_INT 4
  821. | #define SIZEOF_UNSIGNED_LONG 8
  822. | #define SIZEOF_UNSIGNED_LONG_LONG 8
  823. | #define SIZEOF_INT_P 8
  824. | #define HAVE_STDLIB_H 1
  825. | #define HAVE_SYS_TYPES_H 1
  826. | #define HAVE_SYS_SOCKET_H 1
  827. | #define HAVE_NETINET_IN_H 1
  828. | #define HAVE_PWD_H 1
  829. | #define ENVIRON_LINKED 1
  830. | #define DIRENT_HAS_D_TYPE 1
  831. | #define DB_HAVE_CLOCK_GETTIME 1
  832. | #define C_HAS_ATTRIBUTE 1
  833. | #define C_ATTRIBUTE_ALWAYS_INLINE 1
  834. | #define C_HAS_BUILTIN_EXPECT 1
  835. | #define C_SUPPORTS_COREMIDI /**/
  836. | #define C_SUPPORTS_COREAUDIO /**/
  837. | #define C_CORE_INLINE 1
  838. | #define C_TARGETCPU UNKNOWN
  839. | /* end confdefs.h. */
  840. |
  841. | #if SIZEOF_INT_P != 4
  842. | #error size intp is not 4, this not something to worry about
  843. | #endif
  844. | void blah() {
  845. | ;
  846. | }
  847. |
  848. configure:6919: checking whether Apple user wants to override the build process to produce a 32 bit binary
  849. configure:6930: result: no
  850. configure:6956: checking whether x86 dynamic cpu core will be enabled
  851. configure:6968: result: no
  852. configure:6981: checking whether recompiling cpu core will be enabled
  853. configure:7004: result: no
  854. configure:7018: checking whether fpu emulation will be enabled
  855. configure:7021: result: yes
  856. configure:7045: checking whether the x86/x64 assembly fpu core will be enabled
  857. configure:7058: result: no
  858. configure:7075: checking whether to enable unaligned memory access
  859. configure:7083: result: no
  860. configure:7095: checking png.h usability
  861. configure:7095: /usr/bin/clang -c -I/opt/arm/include -isysroot /opt/SDKs/MacOSX11.0.sdk -O2 -m64 -I/opt/arm/include -isysroot /opt/SDKs/MacOSX11.0.sdk -I/opt/arm/include/SDL -D_GNU_SOURCE=1 -D_THREAD_SAFE conftest.c >&5
  862. configure:7095: $? = 0
  863. configure:7095: result: yes
  864. configure:7095: checking png.h presence
  865. configure:7095: /usr/bin/clang -E -I/opt/arm/include -isysroot /opt/SDKs/MacOSX11.0.sdk -I/opt/arm/include/SDL -D_GNU_SOURCE=1 -D_THREAD_SAFE conftest.c
  866. configure:7095: $? = 0
  867. configure:7095: result: yes
  868. configure:7095: checking for png.h
  869. configure:7095: result: yes
  870. configure:7103: checking for png_get_io_ptr in -lpng
  871. configure:7128: /usr/bin/clang -o conftest -I/opt/arm/include -isysroot /opt/SDKs/MacOSX11.0.sdk -O2 -m64 -I/opt/arm/include -isysroot /opt/SDKs/MacOSX11.0.sdk -I/opt/arm/include/SDL -D_GNU_SOURCE=1 -D_THREAD_SAFE -L/opt/arm/lib -isysroot /opt/SDKs/MacOSX11.0.sdk -O2 -m64 conftest.c -lpng -lz -L/opt/arm/lib -lSDLmain -lSDL -Wl,-framework,Cocoa -framework CoreMIDI -framework AudioUnit -framework AudioToolbox >&5
  872. configure:7128: $? = 0
  873. configure:7137: result: yes
  874. configure:7145: checking whether screenshots will be enabled
  875. configure:7152: result: yes
  876. configure:7171: checking zlib.h usability
  877. configure:7171: /usr/bin/clang -c -I/opt/arm/include -isysroot /opt/SDKs/MacOSX11.0.sdk -O2 -m64 -I/opt/arm/include -isysroot /opt/SDKs/MacOSX11.0.sdk -I/opt/arm/include/SDL -D_GNU_SOURCE=1 -D_THREAD_SAFE conftest.c >&5
  878. configure:7171: $? = 0
  879. configure:7171: result: yes
  880. configure:7171: checking zlib.h presence
  881. configure:7171: /usr/bin/clang -E -I/opt/arm/include -isysroot /opt/SDKs/MacOSX11.0.sdk -I/opt/arm/include/SDL -D_GNU_SOURCE=1 -D_THREAD_SAFE conftest.c
  882. configure:7171: $? = 0
  883. configure:7171: result: yes
  884. configure:7171: checking for zlib.h
  885. configure:7171: result: yes
  886. configure:7177: checking for compress in -lz
  887. configure:7202: /usr/bin/clang -o conftest -I/opt/arm/include -isysroot /opt/SDKs/MacOSX11.0.sdk -O2 -m64 -I/opt/arm/include -isysroot /opt/SDKs/MacOSX11.0.sdk -I/opt/arm/include/SDL -D_GNU_SOURCE=1 -D_THREAD_SAFE -L/opt/arm/lib -isysroot /opt/SDKs/MacOSX11.0.sdk -O2 -m64 conftest.c -lz -L/opt/arm/lib -lSDLmain -lSDL -Wl,-framework,Cocoa -framework CoreMIDI -framework AudioUnit -framework AudioToolbox -lpng -lz >&5
  888. configure:7202: $? = 0
  889. configure:7211: result: yes
  890. configure:7217: checking whether recording will be enabled
  891. configure:7226: result: yes
  892. configure:7239: checking SDL_net.h usability
  893. configure:7239: /usr/bin/clang -c -I/opt/arm/include -isysroot /opt/SDKs/MacOSX11.0.sdk -O2 -m64 -I/opt/arm/include -isysroot /opt/SDKs/MacOSX11.0.sdk -I/opt/arm/include/SDL -D_GNU_SOURCE=1 -D_THREAD_SAFE conftest.c >&5
  894. configure:7239: $? = 0
  895. configure:7239: result: yes
  896. configure:7239: checking SDL_net.h presence
  897. configure:7239: /usr/bin/clang -E -I/opt/arm/include -isysroot /opt/SDKs/MacOSX11.0.sdk -I/opt/arm/include/SDL -D_GNU_SOURCE=1 -D_THREAD_SAFE conftest.c
  898. configure:7239: $? = 0
  899. configure:7239: result: yes
  900. configure:7239: checking for SDL_net.h
  901. configure:7239: result: yes
  902. configure:7275: checking for SDLNet_Init in -lSDL_net
  903. configure:7300: /usr/bin/clang -o conftest -I/opt/arm/include -isysroot /opt/SDKs/MacOSX11.0.sdk -O2 -m64 -I/opt/arm/include -isysroot /opt/SDKs/MacOSX11.0.sdk -I/opt/arm/include/SDL -D_GNU_SOURCE=1 -D_THREAD_SAFE -L/opt/arm/lib -isysroot /opt/SDKs/MacOSX11.0.sdk -O2 -m64 conftest.c -lSDL_net -L/opt/arm/lib -lSDLmain -lSDL -Wl,-framework,Cocoa -framework CoreMIDI -framework AudioUnit -framework AudioToolbox -lpng -lz >&5
  904. configure:7300: $? = 0
  905. configure:7309: result: yes
  906. configure:7328: checking for main in -lX11
  907. configure:7347: /usr/bin/clang -o conftest -I/opt/arm/include -isysroot /opt/SDKs/MacOSX11.0.sdk -O2 -m64 -I/opt/arm/include -isysroot /opt/SDKs/MacOSX11.0.sdk -I/opt/arm/include/SDL -D_GNU_SOURCE=1 -D_THREAD_SAFE -L/opt/arm/lib -isysroot /opt/SDKs/MacOSX11.0.sdk -O2 -m64 conftest.c -lX11 -L/opt/arm/lib -lSDLmain -lSDL -Wl,-framework,Cocoa -framework CoreMIDI -framework AudioUnit -framework AudioToolbox -lpng -lz -lSDL_net >&5
  908. ld: library not found for -lX11
  909. clang: error: linker command failed with exit code 1 (use -v to see invocation)
  910. configure:7347: $? = 1
  911. configure: failed program was:
  912. | /* confdefs.h */
  913. | #define PACKAGE_NAME "dosbox"
  914. | #define PACKAGE_TARNAME "dosbox"
  915. | #define PACKAGE_VERSION "SVN"
  916. | #define PACKAGE_STRING "dosbox SVN"
  917. | #define PACKAGE_BUGREPORT ""
  918. | #define PACKAGE_URL ""
  919. | #define PACKAGE "dosbox"
  920. | #define VERSION "SVN"
  921. | #define STDC_HEADERS 1
  922. | #define HAVE_SYS_TYPES_H 1
  923. | #define HAVE_SYS_STAT_H 1
  924. | #define HAVE_STDLIB_H 1
  925. | #define HAVE_STRING_H 1
  926. | #define HAVE_MEMORY_H 1
  927. | #define HAVE_STRINGS_H 1
  928. | #define HAVE_INTTYPES_H 1
  929. | #define HAVE_STDINT_H 1
  930. | #define HAVE_UNISTD_H 1
  931. | #define SIZEOF_UNSIGNED_CHAR 1
  932. | #define SIZEOF_UNSIGNED_SHORT 2
  933. | #define SIZEOF_UNSIGNED_INT 4
  934. | #define SIZEOF_UNSIGNED_LONG 8
  935. | #define SIZEOF_UNSIGNED_LONG_LONG 8
  936. | #define SIZEOF_INT_P 8
  937. | #define HAVE_STDLIB_H 1
  938. | #define HAVE_SYS_TYPES_H 1
  939. | #define HAVE_SYS_SOCKET_H 1
  940. | #define HAVE_NETINET_IN_H 1
  941. | #define HAVE_PWD_H 1
  942. | #define ENVIRON_LINKED 1
  943. | #define DIRENT_HAS_D_TYPE 1
  944. | #define DB_HAVE_CLOCK_GETTIME 1
  945. | #define C_HAS_ATTRIBUTE 1
  946. | #define C_ATTRIBUTE_ALWAYS_INLINE 1
  947. | #define C_HAS_BUILTIN_EXPECT 1
  948. | #define C_SUPPORTS_COREMIDI /**/
  949. | #define C_SUPPORTS_COREAUDIO /**/
  950. | #define C_CORE_INLINE 1
  951. | #define C_TARGETCPU UNKNOWN
  952. | #define C_FPU 1
  953. | #define C_SSHOT 1
  954. | #define C_SRECORD 1
  955. | #define C_MODEM 1
  956. | #define C_IPX 1
  957. | /* end confdefs.h. */
  958. |
  959. |
  960. | int
  961. | main ()
  962. | {
  963. | return main ();
  964. | ;
  965. | return 0;
  966. | }
  967. configure:7356: result: no
  968. configure:7364: checking X11/XKBlib.h usability
  969. configure:7364: /usr/bin/clang -c -I/opt/arm/include -isysroot /opt/SDKs/MacOSX11.0.sdk -O2 -m64 -I/opt/arm/include -isysroot /opt/SDKs/MacOSX11.0.sdk -I/opt/arm/include/SDL -D_GNU_SOURCE=1 -D_THREAD_SAFE conftest.c >&5
  970. conftest.c:80:10: fatal error: 'X11/XKBlib.h' file not found
  971. #include <X11/XKBlib.h>
  972. ^~~~~~~~~~~~~~
  973. 1 error generated.
  974. configure:7364: $? = 1
  975. configure: failed program was:
  976. | /* confdefs.h */
  977. | #define PACKAGE_NAME "dosbox"
  978. | #define PACKAGE_TARNAME "dosbox"
  979. | #define PACKAGE_VERSION "SVN"
  980. | #define PACKAGE_STRING "dosbox SVN"
  981. | #define PACKAGE_BUGREPORT ""
  982. | #define PACKAGE_URL ""
  983. | #define PACKAGE "dosbox"
  984. | #define VERSION "SVN"
  985. | #define STDC_HEADERS 1
  986. | #define HAVE_SYS_TYPES_H 1
  987. | #define HAVE_SYS_STAT_H 1
  988. | #define HAVE_STDLIB_H 1
  989. | #define HAVE_STRING_H 1
  990. | #define HAVE_MEMORY_H 1
  991. | #define HAVE_STRINGS_H 1
  992. | #define HAVE_INTTYPES_H 1
  993. | #define HAVE_STDINT_H 1
  994. | #define HAVE_UNISTD_H 1
  995. | #define SIZEOF_UNSIGNED_CHAR 1
  996. | #define SIZEOF_UNSIGNED_SHORT 2
  997. | #define SIZEOF_UNSIGNED_INT 4
  998. | #define SIZEOF_UNSIGNED_LONG 8
  999. | #define SIZEOF_UNSIGNED_LONG_LONG 8
  1000. | #define SIZEOF_INT_P 8
  1001. | #define HAVE_STDLIB_H 1
  1002. | #define HAVE_SYS_TYPES_H 1
  1003. | #define HAVE_SYS_SOCKET_H 1
  1004. | #define HAVE_NETINET_IN_H 1
  1005. | #define HAVE_PWD_H 1
  1006. | #define ENVIRON_LINKED 1
  1007. | #define DIRENT_HAS_D_TYPE 1
  1008. | #define DB_HAVE_CLOCK_GETTIME 1
  1009. | #define C_HAS_ATTRIBUTE 1
  1010. | #define C_ATTRIBUTE_ALWAYS_INLINE 1
  1011. | #define C_HAS_BUILTIN_EXPECT 1
  1012. | #define C_SUPPORTS_COREMIDI /**/
  1013. | #define C_SUPPORTS_COREAUDIO /**/
  1014. | #define C_CORE_INLINE 1
  1015. | #define C_TARGETCPU UNKNOWN
  1016. | #define C_FPU 1
  1017. | #define C_SSHOT 1
  1018. | #define C_SRECORD 1
  1019. | #define C_MODEM 1
  1020. | #define C_IPX 1
  1021. | /* end confdefs.h. */
  1022. | #include <stdio.h>
  1023. | #ifdef HAVE_SYS_TYPES_H
  1024. | # include <sys/types.h>
  1025. | #endif
  1026. | #ifdef HAVE_SYS_STAT_H
  1027. | # include <sys/stat.h>
  1028. | #endif
  1029. | #ifdef STDC_HEADERS
  1030. | # include <stdlib.h>
  1031. | # include <stddef.h>
  1032. | #else
  1033. | # ifdef HAVE_STDLIB_H
  1034. | # include <stdlib.h>
  1035. | # endif
  1036. | #endif
  1037. | #ifdef HAVE_STRING_H
  1038. | # if !defined STDC_HEADERS && defined HAVE_MEMORY_H
  1039. | # include <memory.h>
  1040. | # endif
  1041. | # include <string.h>
  1042. | #endif
  1043. | #ifdef HAVE_STRINGS_H
  1044. | # include <strings.h>
  1045. | #endif
  1046. | #ifdef HAVE_INTTYPES_H
  1047. | # include <inttypes.h>
  1048. | #endif
  1049. | #ifdef HAVE_STDINT_H
  1050. | # include <stdint.h>
  1051. | #endif
  1052. | #ifdef HAVE_UNISTD_H
  1053. | # include <unistd.h>
  1054. | #endif
  1055. | #include <X11/XKBlib.h>
  1056. configure:7364: result: no
  1057. configure:7364: checking X11/XKBlib.h presence
  1058. configure:7364: /usr/bin/clang -E -I/opt/arm/include -isysroot /opt/SDKs/MacOSX11.0.sdk -I/opt/arm/include/SDL -D_GNU_SOURCE=1 -D_THREAD_SAFE conftest.c
  1059. conftest.c:47:10: fatal error: 'X11/XKBlib.h' file not found
  1060. #include <X11/XKBlib.h>
  1061. ^~~~~~~~~~~~~~
  1062. 1 error generated.
  1063. configure:7364: $? = 1
  1064. configure: failed program was:
  1065. | /* confdefs.h */
  1066. | #define PACKAGE_NAME "dosbox"
  1067. | #define PACKAGE_TARNAME "dosbox"
  1068. | #define PACKAGE_VERSION "SVN"
  1069. | #define PACKAGE_STRING "dosbox SVN"
  1070. | #define PACKAGE_BUGREPORT ""
  1071. | #define PACKAGE_URL ""
  1072. | #define PACKAGE "dosbox"
  1073. | #define VERSION "SVN"
  1074. | #define STDC_HEADERS 1
  1075. | #define HAVE_SYS_TYPES_H 1
  1076. | #define HAVE_SYS_STAT_H 1
  1077. | #define HAVE_STDLIB_H 1
  1078. | #define HAVE_STRING_H 1
  1079. | #define HAVE_MEMORY_H 1
  1080. | #define HAVE_STRINGS_H 1
  1081. | #define HAVE_INTTYPES_H 1
  1082. | #define HAVE_STDINT_H 1
  1083. | #define HAVE_UNISTD_H 1
  1084. | #define SIZEOF_UNSIGNED_CHAR 1
  1085. | #define SIZEOF_UNSIGNED_SHORT 2
  1086. | #define SIZEOF_UNSIGNED_INT 4
  1087. | #define SIZEOF_UNSIGNED_LONG 8
  1088. | #define SIZEOF_UNSIGNED_LONG_LONG 8
  1089. | #define SIZEOF_INT_P 8
  1090. | #define HAVE_STDLIB_H 1
  1091. | #define HAVE_SYS_TYPES_H 1
  1092. | #define HAVE_SYS_SOCKET_H 1
  1093. | #define HAVE_NETINET_IN_H 1
  1094. | #define HAVE_PWD_H 1
  1095. | #define ENVIRON_LINKED 1
  1096. | #define DIRENT_HAS_D_TYPE 1
  1097. | #define DB_HAVE_CLOCK_GETTIME 1
  1098. | #define C_HAS_ATTRIBUTE 1
  1099. | #define C_ATTRIBUTE_ALWAYS_INLINE 1
  1100. | #define C_HAS_BUILTIN_EXPECT 1
  1101. | #define C_SUPPORTS_COREMIDI /**/
  1102. | #define C_SUPPORTS_COREAUDIO /**/
  1103. | #define C_CORE_INLINE 1
  1104. | #define C_TARGETCPU UNKNOWN
  1105. | #define C_FPU 1
  1106. | #define C_SSHOT 1
  1107. | #define C_SRECORD 1
  1108. | #define C_MODEM 1
  1109. | #define C_IPX 1
  1110. | /* end confdefs.h. */
  1111. | #include <X11/XKBlib.h>
  1112. configure:7364: result: no
  1113. configure:7364: checking for X11/XKBlib.h
  1114. configure:7364: result: no
  1115. configure:7372: checking for XKBlib support
  1116. configure:7381: result: no
  1117. configure:7386: checking for main in -lGL
  1118. configure:7405: /usr/bin/clang -o conftest -I/opt/arm/include -isysroot /opt/SDKs/MacOSX11.0.sdk -O2 -m64 -I/opt/arm/include -isysroot /opt/SDKs/MacOSX11.0.sdk -I/opt/arm/include/SDL -D_GNU_SOURCE=1 -D_THREAD_SAFE -L/opt/arm/lib -isysroot /opt/SDKs/MacOSX11.0.sdk -O2 -m64 conftest.c -lGL -L/opt/arm/lib -lSDLmain -lSDL -Wl,-framework,Cocoa -framework CoreMIDI -framework AudioUnit -framework AudioToolbox -lpng -lz -lSDL_net >&5
  1119. ld: library not found for -lGL
  1120. clang: error: linker command failed with exit code 1 (use -v to see invocation)
  1121. configure:7405: $? = 1
  1122. configure: failed program was:
  1123. | /* confdefs.h */
  1124. | #define PACKAGE_NAME "dosbox"
  1125. | #define PACKAGE_TARNAME "dosbox"
  1126. | #define PACKAGE_VERSION "SVN"
  1127. | #define PACKAGE_STRING "dosbox SVN"
  1128. | #define PACKAGE_BUGREPORT ""
  1129. | #define PACKAGE_URL ""
  1130. | #define PACKAGE "dosbox"
  1131. | #define VERSION "SVN"
  1132. | #define STDC_HEADERS 1
  1133. | #define HAVE_SYS_TYPES_H 1
  1134. | #define HAVE_SYS_STAT_H 1
  1135. | #define HAVE_STDLIB_H 1
  1136. | #define HAVE_STRING_H 1
  1137. | #define HAVE_MEMORY_H 1
  1138. | #define HAVE_STRINGS_H 1
  1139. | #define HAVE_INTTYPES_H 1
  1140. | #define HAVE_STDINT_H 1
  1141. | #define HAVE_UNISTD_H 1
  1142. | #define SIZEOF_UNSIGNED_CHAR 1
  1143. | #define SIZEOF_UNSIGNED_SHORT 2
  1144. | #define SIZEOF_UNSIGNED_INT 4
  1145. | #define SIZEOF_UNSIGNED_LONG 8
  1146. | #define SIZEOF_UNSIGNED_LONG_LONG 8
  1147. | #define SIZEOF_INT_P 8
  1148. | #define HAVE_STDLIB_H 1
  1149. | #define HAVE_SYS_TYPES_H 1
  1150. | #define HAVE_SYS_SOCKET_H 1
  1151. | #define HAVE_NETINET_IN_H 1
  1152. | #define HAVE_PWD_H 1
  1153. | #define ENVIRON_LINKED 1
  1154. | #define DIRENT_HAS_D_TYPE 1
  1155. | #define DB_HAVE_CLOCK_GETTIME 1
  1156. | #define C_HAS_ATTRIBUTE 1
  1157. | #define C_ATTRIBUTE_ALWAYS_INLINE 1
  1158. | #define C_HAS_BUILTIN_EXPECT 1
  1159. | #define C_SUPPORTS_COREMIDI /**/
  1160. | #define C_SUPPORTS_COREAUDIO /**/
  1161. | #define C_CORE_INLINE 1
  1162. | #define C_TARGETCPU UNKNOWN
  1163. | #define C_FPU 1
  1164. | #define C_SSHOT 1
  1165. | #define C_SRECORD 1
  1166. | #define C_MODEM 1
  1167. | #define C_IPX 1
  1168. | /* end confdefs.h. */
  1169. |
  1170. |
  1171. | int
  1172. | main ()
  1173. | {
  1174. | return main ();
  1175. | ;
  1176. | return 0;
  1177. | }
  1178. configure:7414: result: no
  1179. configure:7422: checking for main in -lopengl32
  1180. configure:7441: /usr/bin/clang -o conftest -I/opt/arm/include -isysroot /opt/SDKs/MacOSX11.0.sdk -O2 -m64 -I/opt/arm/include -isysroot /opt/SDKs/MacOSX11.0.sdk -I/opt/arm/include/SDL -D_GNU_SOURCE=1 -D_THREAD_SAFE -L/opt/arm/lib -isysroot /opt/SDKs/MacOSX11.0.sdk -O2 -m64 conftest.c -lopengl32 -L/opt/arm/lib -lSDLmain -lSDL -Wl,-framework,Cocoa -framework CoreMIDI -framework AudioUnit -framework AudioToolbox -lpng -lz -lSDL_net >&5
  1181. ld: library not found for -lopengl32
  1182. clang: error: linker command failed with exit code 1 (use -v to see invocation)
  1183. configure:7441: $? = 1
  1184. configure: failed program was:
  1185. | /* confdefs.h */
  1186. | #define PACKAGE_NAME "dosbox"
  1187. | #define PACKAGE_TARNAME "dosbox"
  1188. | #define PACKAGE_VERSION "SVN"
  1189. | #define PACKAGE_STRING "dosbox SVN"
  1190. | #define PACKAGE_BUGREPORT ""
  1191. | #define PACKAGE_URL ""
  1192. | #define PACKAGE "dosbox"
  1193. | #define VERSION "SVN"
  1194. | #define STDC_HEADERS 1
  1195. | #define HAVE_SYS_TYPES_H 1
  1196. | #define HAVE_SYS_STAT_H 1
  1197. | #define HAVE_STDLIB_H 1
  1198. | #define HAVE_STRING_H 1
  1199. | #define HAVE_MEMORY_H 1
  1200. | #define HAVE_STRINGS_H 1
  1201. | #define HAVE_INTTYPES_H 1
  1202. | #define HAVE_STDINT_H 1
  1203. | #define HAVE_UNISTD_H 1
  1204. | #define SIZEOF_UNSIGNED_CHAR 1
  1205. | #define SIZEOF_UNSIGNED_SHORT 2
  1206. | #define SIZEOF_UNSIGNED_INT 4
  1207. | #define SIZEOF_UNSIGNED_LONG 8
  1208. | #define SIZEOF_UNSIGNED_LONG_LONG 8
  1209. | #define SIZEOF_INT_P 8
  1210. | #define HAVE_STDLIB_H 1
  1211. | #define HAVE_SYS_TYPES_H 1
  1212. | #define HAVE_SYS_SOCKET_H 1
  1213. | #define HAVE_NETINET_IN_H 1
  1214. | #define HAVE_PWD_H 1
  1215. | #define ENVIRON_LINKED 1
  1216. | #define DIRENT_HAS_D_TYPE 1
  1217. | #define DB_HAVE_CLOCK_GETTIME 1
  1218. | #define C_HAS_ATTRIBUTE 1
  1219. | #define C_ATTRIBUTE_ALWAYS_INLINE 1
  1220. | #define C_HAS_BUILTIN_EXPECT 1
  1221. | #define C_SUPPORTS_COREMIDI /**/
  1222. | #define C_SUPPORTS_COREAUDIO /**/
  1223. | #define C_CORE_INLINE 1
  1224. | #define C_TARGETCPU UNKNOWN
  1225. | #define C_FPU 1
  1226. | #define C_SSHOT 1
  1227. | #define C_SRECORD 1
  1228. | #define C_MODEM 1
  1229. | #define C_IPX 1
  1230. | /* end confdefs.h. */
  1231. |
  1232. |
  1233. | int
  1234. | main ()
  1235. | {
  1236. | return main ();
  1237. | ;
  1238. | return 0;
  1239. | }
  1240. configure:7450: result: no
  1241. configure:7458: checking GL/gl.h usability
  1242. configure:7458: /usr/bin/clang -c -I/opt/arm/include -isysroot /opt/SDKs/MacOSX11.0.sdk -O2 -m64 -I/opt/arm/include -isysroot /opt/SDKs/MacOSX11.0.sdk -I/opt/arm/include/SDL -D_GNU_SOURCE=1 -D_THREAD_SAFE conftest.c >&5
  1243. conftest.c:80:10: fatal error: 'GL/gl.h' file not found
  1244. #include <GL/gl.h>
  1245. ^~~~~~~~~
  1246. 1 error generated.
  1247. configure:7458: $? = 1
  1248. configure: failed program was:
  1249. | /* confdefs.h */
  1250. | #define PACKAGE_NAME "dosbox"
  1251. | #define PACKAGE_TARNAME "dosbox"
  1252. | #define PACKAGE_VERSION "SVN"
  1253. | #define PACKAGE_STRING "dosbox SVN"
  1254. | #define PACKAGE_BUGREPORT ""
  1255. | #define PACKAGE_URL ""
  1256. | #define PACKAGE "dosbox"
  1257. | #define VERSION "SVN"
  1258. | #define STDC_HEADERS 1
  1259. | #define HAVE_SYS_TYPES_H 1
  1260. | #define HAVE_SYS_STAT_H 1
  1261. | #define HAVE_STDLIB_H 1
  1262. | #define HAVE_STRING_H 1
  1263. | #define HAVE_MEMORY_H 1
  1264. | #define HAVE_STRINGS_H 1
  1265. | #define HAVE_INTTYPES_H 1
  1266. | #define HAVE_STDINT_H 1
  1267. | #define HAVE_UNISTD_H 1
  1268. | #define SIZEOF_UNSIGNED_CHAR 1
  1269. | #define SIZEOF_UNSIGNED_SHORT 2
  1270. | #define SIZEOF_UNSIGNED_INT 4
  1271. | #define SIZEOF_UNSIGNED_LONG 8
  1272. | #define SIZEOF_UNSIGNED_LONG_LONG 8
  1273. | #define SIZEOF_INT_P 8
  1274. | #define HAVE_STDLIB_H 1
  1275. | #define HAVE_SYS_TYPES_H 1
  1276. | #define HAVE_SYS_SOCKET_H 1
  1277. | #define HAVE_NETINET_IN_H 1
  1278. | #define HAVE_PWD_H 1
  1279. | #define ENVIRON_LINKED 1
  1280. | #define DIRENT_HAS_D_TYPE 1
  1281. | #define DB_HAVE_CLOCK_GETTIME 1
  1282. | #define C_HAS_ATTRIBUTE 1
  1283. | #define C_ATTRIBUTE_ALWAYS_INLINE 1
  1284. | #define C_HAS_BUILTIN_EXPECT 1
  1285. | #define C_SUPPORTS_COREMIDI /**/
  1286. | #define C_SUPPORTS_COREAUDIO /**/
  1287. | #define C_CORE_INLINE 1
  1288. | #define C_TARGETCPU UNKNOWN
  1289. | #define C_FPU 1
  1290. | #define C_SSHOT 1
  1291. | #define C_SRECORD 1
  1292. | #define C_MODEM 1
  1293. | #define C_IPX 1
  1294. | /* end confdefs.h. */
  1295. | #include <stdio.h>
  1296. | #ifdef HAVE_SYS_TYPES_H
  1297. | # include <sys/types.h>
  1298. | #endif
  1299. | #ifdef HAVE_SYS_STAT_H
  1300. | # include <sys/stat.h>
  1301. | #endif
  1302. | #ifdef STDC_HEADERS
  1303. | # include <stdlib.h>
  1304. | # include <stddef.h>
  1305. | #else
  1306. | # ifdef HAVE_STDLIB_H
  1307. | # include <stdlib.h>
  1308. | # endif
  1309. | #endif
  1310. | #ifdef HAVE_STRING_H
  1311. | # if !defined STDC_HEADERS && defined HAVE_MEMORY_H
  1312. | # include <memory.h>
  1313. | # endif
  1314. | # include <string.h>
  1315. | #endif
  1316. | #ifdef HAVE_STRINGS_H
  1317. | # include <strings.h>
  1318. | #endif
  1319. | #ifdef HAVE_INTTYPES_H
  1320. | # include <inttypes.h>
  1321. | #endif
  1322. | #ifdef HAVE_STDINT_H
  1323. | # include <stdint.h>
  1324. | #endif
  1325. | #ifdef HAVE_UNISTD_H
  1326. | # include <unistd.h>
  1327. | #endif
  1328. | #include <GL/gl.h>
  1329. configure:7458: result: no
  1330. configure:7458: checking GL/gl.h presence
  1331. configure:7458: /usr/bin/clang -E -I/opt/arm/include -isysroot /opt/SDKs/MacOSX11.0.sdk -I/opt/arm/include/SDL -D_GNU_SOURCE=1 -D_THREAD_SAFE conftest.c
  1332. conftest.c:47:10: fatal error: 'GL/gl.h' file not found
  1333. #include <GL/gl.h>
  1334. ^~~~~~~~~
  1335. 1 error generated.
  1336. configure:7458: $? = 1
  1337. configure: failed program was:
  1338. | /* confdefs.h */
  1339. | #define PACKAGE_NAME "dosbox"
  1340. | #define PACKAGE_TARNAME "dosbox"
  1341. | #define PACKAGE_VERSION "SVN"
  1342. | #define PACKAGE_STRING "dosbox SVN"
  1343. | #define PACKAGE_BUGREPORT ""
  1344. | #define PACKAGE_URL ""
  1345. | #define PACKAGE "dosbox"
  1346. | #define VERSION "SVN"
  1347. | #define STDC_HEADERS 1
  1348. | #define HAVE_SYS_TYPES_H 1
  1349. | #define HAVE_SYS_STAT_H 1
  1350. | #define HAVE_STDLIB_H 1
  1351. | #define HAVE_STRING_H 1
  1352. | #define HAVE_MEMORY_H 1
  1353. | #define HAVE_STRINGS_H 1
  1354. | #define HAVE_INTTYPES_H 1
  1355. | #define HAVE_STDINT_H 1
  1356. | #define HAVE_UNISTD_H 1
  1357. | #define SIZEOF_UNSIGNED_CHAR 1
  1358. | #define SIZEOF_UNSIGNED_SHORT 2
  1359. | #define SIZEOF_UNSIGNED_INT 4
  1360. | #define SIZEOF_UNSIGNED_LONG 8
  1361. | #define SIZEOF_UNSIGNED_LONG_LONG 8
  1362. | #define SIZEOF_INT_P 8
  1363. | #define HAVE_STDLIB_H 1
  1364. | #define HAVE_SYS_TYPES_H 1
  1365. | #define HAVE_SYS_SOCKET_H 1
  1366. | #define HAVE_NETINET_IN_H 1
  1367. | #define HAVE_PWD_H 1
  1368. | #define ENVIRON_LINKED 1
  1369. | #define DIRENT_HAS_D_TYPE 1
  1370. | #define DB_HAVE_CLOCK_GETTIME 1
  1371. | #define C_HAS_ATTRIBUTE 1
  1372. | #define C_ATTRIBUTE_ALWAYS_INLINE 1
  1373. | #define C_HAS_BUILTIN_EXPECT 1
  1374. | #define C_SUPPORTS_COREMIDI /**/
  1375. | #define C_SUPPORTS_COREAUDIO /**/
  1376. | #define C_CORE_INLINE 1
  1377. | #define C_TARGETCPU UNKNOWN
  1378. | #define C_FPU 1
  1379. | #define C_SSHOT 1
  1380. | #define C_SRECORD 1
  1381. | #define C_MODEM 1
  1382. | #define C_IPX 1
  1383. | /* end confdefs.h. */
  1384. | #include <GL/gl.h>
  1385. configure:7458: result: no
  1386. configure:7458: checking for GL/gl.h
  1387. configure:7458: result: no
  1388. configure:7473: checking whether opengl display output will be enabled
  1389. configure:7478: result: yes
  1390. configure:7516: checking ddraw.h usability
  1391. configure:7516: /usr/bin/clang -c -I/opt/arm/include -isysroot /opt/SDKs/MacOSX11.0.sdk -O2 -m64 -I/opt/arm/include -isysroot /opt/SDKs/MacOSX11.0.sdk -I/opt/arm/include/SDL -D_GNU_SOURCE=1 -D_THREAD_SAFE conftest.c >&5
  1392. conftest.c:81:10: fatal error: 'ddraw.h' file not found
  1393. #include <ddraw.h>
  1394. ^~~~~~~~~
  1395. 1 error generated.
  1396. configure:7516: $? = 1
  1397. configure: failed program was:
  1398. | /* confdefs.h */
  1399. | #define PACKAGE_NAME "dosbox"
  1400. | #define PACKAGE_TARNAME "dosbox"
  1401. | #define PACKAGE_VERSION "SVN"
  1402. | #define PACKAGE_STRING "dosbox SVN"
  1403. | #define PACKAGE_BUGREPORT ""
  1404. | #define PACKAGE_URL ""
  1405. | #define PACKAGE "dosbox"
  1406. | #define VERSION "SVN"
  1407. | #define STDC_HEADERS 1
  1408. | #define HAVE_SYS_TYPES_H 1
  1409. | #define HAVE_SYS_STAT_H 1
  1410. | #define HAVE_STDLIB_H 1
  1411. | #define HAVE_STRING_H 1
  1412. | #define HAVE_MEMORY_H 1
  1413. | #define HAVE_STRINGS_H 1
  1414. | #define HAVE_INTTYPES_H 1
  1415. | #define HAVE_STDINT_H 1
  1416. | #define HAVE_UNISTD_H 1
  1417. | #define SIZEOF_UNSIGNED_CHAR 1
  1418. | #define SIZEOF_UNSIGNED_SHORT 2
  1419. | #define SIZEOF_UNSIGNED_INT 4
  1420. | #define SIZEOF_UNSIGNED_LONG 8
  1421. | #define SIZEOF_UNSIGNED_LONG_LONG 8
  1422. | #define SIZEOF_INT_P 8
  1423. | #define HAVE_STDLIB_H 1
  1424. | #define HAVE_SYS_TYPES_H 1
  1425. | #define HAVE_SYS_SOCKET_H 1
  1426. | #define HAVE_NETINET_IN_H 1
  1427. | #define HAVE_PWD_H 1
  1428. | #define ENVIRON_LINKED 1
  1429. | #define DIRENT_HAS_D_TYPE 1
  1430. | #define DB_HAVE_CLOCK_GETTIME 1
  1431. | #define C_HAS_ATTRIBUTE 1
  1432. | #define C_ATTRIBUTE_ALWAYS_INLINE 1
  1433. | #define C_HAS_BUILTIN_EXPECT 1
  1434. | #define C_SUPPORTS_COREMIDI /**/
  1435. | #define C_SUPPORTS_COREAUDIO /**/
  1436. | #define C_CORE_INLINE 1
  1437. | #define C_TARGETCPU UNKNOWN
  1438. | #define C_FPU 1
  1439. | #define C_SSHOT 1
  1440. | #define C_SRECORD 1
  1441. | #define C_MODEM 1
  1442. | #define C_IPX 1
  1443. | #define C_OPENGL 1
  1444. | /* end confdefs.h. */
  1445. | #include <stdio.h>
  1446. | #ifdef HAVE_SYS_TYPES_H
  1447. | # include <sys/types.h>
  1448. | #endif
  1449. | #ifdef HAVE_SYS_STAT_H
  1450. | # include <sys/stat.h>
  1451. | #endif
  1452. | #ifdef STDC_HEADERS
  1453. | # include <stdlib.h>
  1454. | # include <stddef.h>
  1455. | #else
  1456. | # ifdef HAVE_STDLIB_H
  1457. | # include <stdlib.h>
  1458. | # endif
  1459. | #endif
  1460. | #ifdef HAVE_STRING_H
  1461. | # if !defined STDC_HEADERS && defined HAVE_MEMORY_H
  1462. | # include <memory.h>
  1463. | # endif
  1464. | # include <string.h>
  1465. | #endif
  1466. | #ifdef HAVE_STRINGS_H
  1467. | # include <strings.h>
  1468. | #endif
  1469. | #ifdef HAVE_INTTYPES_H
  1470. | # include <inttypes.h>
  1471. | #endif
  1472. | #ifdef HAVE_STDINT_H
  1473. | # include <stdint.h>
  1474. | #endif
  1475. | #ifdef HAVE_UNISTD_H
  1476. | # include <unistd.h>
  1477. | #endif
  1478. | #include <ddraw.h>
  1479. configure:7516: result: no
  1480. configure:7516: checking ddraw.h presence
  1481. configure:7516: /usr/bin/clang -E -I/opt/arm/include -isysroot /opt/SDKs/MacOSX11.0.sdk -I/opt/arm/include/SDL -D_GNU_SOURCE=1 -D_THREAD_SAFE conftest.c
  1482. conftest.c:48:10: fatal error: 'ddraw.h' file not found
  1483. #include <ddraw.h>
  1484. ^~~~~~~~~
  1485. 1 error generated.
  1486. configure:7516: $? = 1
  1487. configure: failed program was:
  1488. | /* confdefs.h */
  1489. | #define PACKAGE_NAME "dosbox"
  1490. | #define PACKAGE_TARNAME "dosbox"
  1491. | #define PACKAGE_VERSION "SVN"
  1492. | #define PACKAGE_STRING "dosbox SVN"
  1493. | #define PACKAGE_BUGREPORT ""
  1494. | #define PACKAGE_URL ""
  1495. | #define PACKAGE "dosbox"
  1496. | #define VERSION "SVN"
  1497. | #define STDC_HEADERS 1
  1498. | #define HAVE_SYS_TYPES_H 1
  1499. | #define HAVE_SYS_STAT_H 1
  1500. | #define HAVE_STDLIB_H 1
  1501. | #define HAVE_STRING_H 1
  1502. | #define HAVE_MEMORY_H 1
  1503. | #define HAVE_STRINGS_H 1
  1504. | #define HAVE_INTTYPES_H 1
  1505. | #define HAVE_STDINT_H 1
  1506. | #define HAVE_UNISTD_H 1
  1507. | #define SIZEOF_UNSIGNED_CHAR 1
  1508. | #define SIZEOF_UNSIGNED_SHORT 2
  1509. | #define SIZEOF_UNSIGNED_INT 4
  1510. | #define SIZEOF_UNSIGNED_LONG 8
  1511. | #define SIZEOF_UNSIGNED_LONG_LONG 8
  1512. | #define SIZEOF_INT_P 8
  1513. | #define HAVE_STDLIB_H 1
  1514. | #define HAVE_SYS_TYPES_H 1
  1515. | #define HAVE_SYS_SOCKET_H 1
  1516. | #define HAVE_NETINET_IN_H 1
  1517. | #define HAVE_PWD_H 1
  1518. | #define ENVIRON_LINKED 1
  1519. | #define DIRENT_HAS_D_TYPE 1
  1520. | #define DB_HAVE_CLOCK_GETTIME 1
  1521. | #define C_HAS_ATTRIBUTE 1
  1522. | #define C_ATTRIBUTE_ALWAYS_INLINE 1
  1523. | #define C_HAS_BUILTIN_EXPECT 1
  1524. | #define C_SUPPORTS_COREMIDI /**/
  1525. | #define C_SUPPORTS_COREAUDIO /**/
  1526. | #define C_CORE_INLINE 1
  1527. | #define C_TARGETCPU UNKNOWN
  1528. | #define C_FPU 1
  1529. | #define C_SSHOT 1
  1530. | #define C_SRECORD 1
  1531. | #define C_MODEM 1
  1532. | #define C_IPX 1
  1533. | #define C_OPENGL 1
  1534. | /* end confdefs.h. */
  1535. | #include <ddraw.h>
  1536. configure:7516: result: no
  1537. configure:7516: checking for ddraw.h
  1538. configure:7516: result: no
  1539. configure:7524: checking whether ddraw display output will be enabled
  1540. configure:7540: result: no
  1541. configure:7547: checking SDL_sound.h usability
  1542. configure:7547: /usr/bin/clang -c -I/opt/arm/include -isysroot /opt/SDKs/MacOSX11.0.sdk -O2 -m64 -I/opt/arm/include -isysroot /opt/SDKs/MacOSX11.0.sdk -I/opt/arm/include/SDL -D_GNU_SOURCE=1 -D_THREAD_SAFE conftest.c >&5
  1543. configure:7547: $? = 0
  1544. configure:7547: result: yes
  1545. configure:7547: checking SDL_sound.h presence
  1546. configure:7547: /usr/bin/clang -E -I/opt/arm/include -isysroot /opt/SDKs/MacOSX11.0.sdk -I/opt/arm/include/SDL -D_GNU_SOURCE=1 -D_THREAD_SAFE conftest.c
  1547. configure:7547: $? = 0
  1548. configure:7547: result: yes
  1549. configure:7547: checking for SDL_sound.h
  1550. configure:7547: result: yes
  1551. configure:7553: checking for Sound_Init in -lSDL_sound
  1552. configure:7578: /usr/bin/clang -o conftest -I/opt/arm/include -isysroot /opt/SDKs/MacOSX11.0.sdk -O2 -m64 -I/opt/arm/include -isysroot /opt/SDKs/MacOSX11.0.sdk -I/opt/arm/include/SDL -D_GNU_SOURCE=1 -D_THREAD_SAFE -L/opt/arm/lib -isysroot /opt/SDKs/MacOSX11.0.sdk -O2 -m64 conftest.c -lSDL_sound -L/opt/arm/lib -lSDLmain -lSDL -Wl,-framework,Cocoa -framework CoreMIDI -framework AudioUnit -framework AudioToolbox -lpng -lz -lSDL_net -framework OpenGL >&5
  1553. configure:7578: $? = 0
  1554. configure:7587: result: yes
  1555. configure:7593: checking for Sound_Seek in -lSDL_sound
  1556. configure:7618: /usr/bin/clang -o conftest -I/opt/arm/include -isysroot /opt/SDKs/MacOSX11.0.sdk -O2 -m64 -I/opt/arm/include -isysroot /opt/SDKs/MacOSX11.0.sdk -I/opt/arm/include/SDL -D_GNU_SOURCE=1 -D_THREAD_SAFE -L/opt/arm/lib -isysroot /opt/SDKs/MacOSX11.0.sdk -O2 -m64 conftest.c -lSDL_sound -L/opt/arm/lib -lSDLmain -lSDL -Wl,-framework,Cocoa -framework CoreMIDI -framework AudioUnit -framework AudioToolbox -lpng -lz -lSDL_net -framework OpenGL >&5
  1557. configure:7618: $? = 0
  1558. configure:7627: result: yes
  1559. configure:7648: checking sys/mman.h usability
  1560. configure:7648: /usr/bin/clang -c -I/opt/arm/include -isysroot /opt/SDKs/MacOSX11.0.sdk -O2 -m64 -I/opt/arm/include -isysroot /opt/SDKs/MacOSX11.0.sdk -I/opt/arm/include/SDL -D_GNU_SOURCE=1 -D_THREAD_SAFE conftest.c >&5
  1561. configure:7648: $? = 0
  1562. configure:7648: result: yes
  1563. configure:7648: checking sys/mman.h presence
  1564. configure:7648: /usr/bin/clang -E -I/opt/arm/include -isysroot /opt/SDKs/MacOSX11.0.sdk -I/opt/arm/include/SDL -D_GNU_SOURCE=1 -D_THREAD_SAFE conftest.c
  1565. configure:7648: $? = 0
  1566. configure:7648: result: yes
  1567. configure:7648: checking for sys/mman.h
  1568. configure:7648: result: yes
  1569. configure:7654: checking for shm_open in -lrt
  1570. configure:7679: /usr/bin/clang -o conftest -I/opt/arm/include -isysroot /opt/SDKs/MacOSX11.0.sdk -O2 -m64 -I/opt/arm/include -isysroot /opt/SDKs/MacOSX11.0.sdk -I/opt/arm/include/SDL -D_GNU_SOURCE=1 -D_THREAD_SAFE -L/opt/arm/lib -isysroot /opt/SDKs/MacOSX11.0.sdk -O2 -m64 conftest.c -lrt -lSDL_sound -L/opt/arm/lib -lSDLmain -lSDL -Wl,-framework,Cocoa -framework CoreMIDI -framework AudioUnit -framework AudioToolbox -lpng -lz -lSDL_net -framework OpenGL >&5
  1571. ld: library not found for -lrt
  1572. clang: error: linker command failed with exit code 1 (use -v to see invocation)
  1573. configure:7679: $? = 1
  1574. configure: failed program was:
  1575. | /* confdefs.h */
  1576. | #define PACKAGE_NAME "dosbox"
  1577. | #define PACKAGE_TARNAME "dosbox"
  1578. | #define PACKAGE_VERSION "SVN"
  1579. | #define PACKAGE_STRING "dosbox SVN"
  1580. | #define PACKAGE_BUGREPORT ""
  1581. | #define PACKAGE_URL ""
  1582. | #define PACKAGE "dosbox"
  1583. | #define VERSION "SVN"
  1584. | #define STDC_HEADERS 1
  1585. | #define HAVE_SYS_TYPES_H 1
  1586. | #define HAVE_SYS_STAT_H 1
  1587. | #define HAVE_STDLIB_H 1
  1588. | #define HAVE_STRING_H 1
  1589. | #define HAVE_MEMORY_H 1
  1590. | #define HAVE_STRINGS_H 1
  1591. | #define HAVE_INTTYPES_H 1
  1592. | #define HAVE_STDINT_H 1
  1593. | #define HAVE_UNISTD_H 1
  1594. | #define SIZEOF_UNSIGNED_CHAR 1
  1595. | #define SIZEOF_UNSIGNED_SHORT 2
  1596. | #define SIZEOF_UNSIGNED_INT 4
  1597. | #define SIZEOF_UNSIGNED_LONG 8
  1598. | #define SIZEOF_UNSIGNED_LONG_LONG 8
  1599. | #define SIZEOF_INT_P 8
  1600. | #define HAVE_STDLIB_H 1
  1601. | #define HAVE_SYS_TYPES_H 1
  1602. | #define HAVE_SYS_SOCKET_H 1
  1603. | #define HAVE_NETINET_IN_H 1
  1604. | #define HAVE_PWD_H 1
  1605. | #define ENVIRON_LINKED 1
  1606. | #define DIRENT_HAS_D_TYPE 1
  1607. | #define DB_HAVE_CLOCK_GETTIME 1
  1608. | #define C_HAS_ATTRIBUTE 1
  1609. | #define C_ATTRIBUTE_ALWAYS_INLINE 1
  1610. | #define C_HAS_BUILTIN_EXPECT 1
  1611. | #define C_SUPPORTS_COREMIDI /**/
  1612. | #define C_SUPPORTS_COREAUDIO /**/
  1613. | #define C_CORE_INLINE 1
  1614. | #define C_TARGETCPU UNKNOWN
  1615. | #define C_FPU 1
  1616. | #define C_SSHOT 1
  1617. | #define C_SRECORD 1
  1618. | #define C_MODEM 1
  1619. | #define C_IPX 1
  1620. | #define C_OPENGL 1
  1621. | #define C_SDL_SOUND 1
  1622. | /* end confdefs.h. */
  1623. |
  1624. | /* Override any GCC internal prototype to avoid an error.
  1625. | Use char because int might match the return type of a GCC
  1626. | builtin and then its argument prototype would still apply. */
  1627. | #ifdef __cplusplus
  1628. | extern "C"
  1629. | #endif
  1630. | char shm_open ();
  1631. | int
  1632. | main ()
  1633. | {
  1634. | return shm_open ();
  1635. | ;
  1636. | return 0;
  1637. | }
  1638. configure:7688: result: no
  1639. configure:7707: checking for realpath
  1640. configure:7707: /usr/bin/clang -o conftest -I/opt/arm/include -isysroot /opt/SDKs/MacOSX11.0.sdk -O2 -m64 -I/opt/arm/include -isysroot /opt/SDKs/MacOSX11.0.sdk -I/opt/arm/include/SDL -D_GNU_SOURCE=1 -D_THREAD_SAFE -L/opt/arm/lib -isysroot /opt/SDKs/MacOSX11.0.sdk -O2 -m64 conftest.c -lSDL_sound -L/opt/arm/lib -lSDLmain -lSDL -Wl,-framework,Cocoa -framework CoreMIDI -framework AudioUnit -framework AudioToolbox -lpng -lz -lSDL_net -framework OpenGL >&5
  1641. configure:7707: $? = 0
  1642. configure:7707: result: yes
  1643. configure:7718: checking for setpriority support
  1644. configure:7729: /usr/bin/clang -o conftest -I/opt/arm/include -isysroot /opt/SDKs/MacOSX11.0.sdk -O2 -m64 -I/opt/arm/include -isysroot /opt/SDKs/MacOSX11.0.sdk -I/opt/arm/include/SDL -D_GNU_SOURCE=1 -D_THREAD_SAFE -L/opt/arm/lib -isysroot /opt/SDKs/MacOSX11.0.sdk -O2 -m64 conftest.c -lSDL_sound -L/opt/arm/lib -lSDLmain -lSDL -Wl,-framework,Cocoa -framework CoreMIDI -framework AudioUnit -framework AudioToolbox -lpng -lz -lSDL_net -framework OpenGL >&5
  1645. conftest.c:53:5: error: second parameter of 'main' (argument array) must be of type 'char **'
  1646. int main(int argc,char * argv) {
  1647. ^
  1648. 1 error generated.
  1649. configure:7729: $? = 1
  1650. configure: failed program was:
  1651. | /* confdefs.h */
  1652. | #define PACKAGE_NAME "dosbox"
  1653. | #define PACKAGE_TARNAME "dosbox"
  1654. | #define PACKAGE_VERSION "SVN"
  1655. | #define PACKAGE_STRING "dosbox SVN"
  1656. | #define PACKAGE_BUGREPORT ""
  1657. | #define PACKAGE_URL ""
  1658. | #define PACKAGE "dosbox"
  1659. | #define VERSION "SVN"
  1660. | #define STDC_HEADERS 1
  1661. | #define HAVE_SYS_TYPES_H 1
  1662. | #define HAVE_SYS_STAT_H 1
  1663. | #define HAVE_STDLIB_H 1
  1664. | #define HAVE_STRING_H 1
  1665. | #define HAVE_MEMORY_H 1
  1666. | #define HAVE_STRINGS_H 1
  1667. | #define HAVE_INTTYPES_H 1
  1668. | #define HAVE_STDINT_H 1
  1669. | #define HAVE_UNISTD_H 1
  1670. | #define SIZEOF_UNSIGNED_CHAR 1
  1671. | #define SIZEOF_UNSIGNED_SHORT 2
  1672. | #define SIZEOF_UNSIGNED_INT 4
  1673. | #define SIZEOF_UNSIGNED_LONG 8
  1674. | #define SIZEOF_UNSIGNED_LONG_LONG 8
  1675. | #define SIZEOF_INT_P 8
  1676. | #define HAVE_STDLIB_H 1
  1677. | #define HAVE_SYS_TYPES_H 1
  1678. | #define HAVE_SYS_SOCKET_H 1
  1679. | #define HAVE_NETINET_IN_H 1
  1680. | #define HAVE_PWD_H 1
  1681. | #define ENVIRON_LINKED 1
  1682. | #define DIRENT_HAS_D_TYPE 1
  1683. | #define DB_HAVE_CLOCK_GETTIME 1
  1684. | #define C_HAS_ATTRIBUTE 1
  1685. | #define C_ATTRIBUTE_ALWAYS_INLINE 1
  1686. | #define C_HAS_BUILTIN_EXPECT 1
  1687. | #define C_SUPPORTS_COREMIDI /**/
  1688. | #define C_SUPPORTS_COREAUDIO /**/
  1689. | #define C_CORE_INLINE 1
  1690. | #define C_TARGETCPU UNKNOWN
  1691. | #define C_FPU 1
  1692. | #define C_SSHOT 1
  1693. | #define C_SRECORD 1
  1694. | #define C_MODEM 1
  1695. | #define C_IPX 1
  1696. | #define C_OPENGL 1
  1697. | #define C_SDL_SOUND 1
  1698. | #define C_HAVE_MMAP 1
  1699. | #define HAVE_REALPATH 1
  1700. | /* end confdefs.h. */
  1701. |
  1702. | #include <sys/resource.h>
  1703. | int main(int argc,char * argv) {
  1704. | return setpriority (PRIO_PROCESS, 0,PRIO_MIN+PRIO_MAX);
  1705. | };
  1706. |
  1707. configure:7734: result: no
  1708. configure:8006: checking that generated files are newer than configure
  1709. configure:8012: result: done
  1710. configure:8044: creating ./config.status
  1711.  
  1712. ## ---------------------- ##
  1713. ## Running config.status. ##
  1714. ## ---------------------- ##
  1715.  
  1716. This file was extended by dosbox config.status SVN, which was
  1717. generated by GNU Autoconf 2.69. Invocation command line was
  1718.  
  1719. CONFIG_FILES =
  1720. CONFIG_HEADERS =
  1721. CONFIG_LINKS =
  1722. CONFIG_COMMANDS =
  1723. $ ./config.status
  1724.  
  1725. on DTK.fritz.box
  1726.  
  1727. config.status:932: creating Makefile
  1728. config.status:932: creating src/Makefile
  1729. config.status:932: creating src/cpu/Makefile
  1730. config.status:932: creating src/cpu/core_full/Makefile
  1731. config.status:932: creating src/cpu/core_normal/Makefile
  1732. config.status:932: creating src/cpu/core_dyn_x86/Makefile
  1733. config.status:932: creating src/cpu/core_dynrec/Makefile
  1734. config.status:932: creating src/debug/Makefile
  1735. config.status:932: creating src/dos/Makefile
  1736. config.status:932: creating src/fpu/Makefile
  1737. config.status:932: creating src/gui/Makefile
  1738. config.status:932: creating src/hardware/Makefile
  1739. config.status:932: creating src/hardware/mame/Makefile
  1740. config.status:932: creating src/hardware/serialport/Makefile
  1741. config.status:932: creating src/ints/Makefile
  1742. config.status:932: creating src/libs/Makefile
  1743. config.status:932: creating src/libs/zmbv/Makefile
  1744. config.status:932: creating src/libs/gui_tk/Makefile
  1745. config.status:932: creating src/misc/Makefile
  1746. config.status:932: creating src/shell/Makefile
  1747. config.status:932: creating src/platform/Makefile
  1748. config.status:932: creating src/platform/visualc/Makefile
  1749. config.status:932: creating visualc_net/Makefile
  1750. config.status:932: creating include/Makefile
  1751. config.status:932: creating docs/Makefile
  1752. config.status:932: creating config.h
  1753. config.status:1161: executing depfiles commands
  1754. config.status:1238: cd src && sed -e '/# am--include-marker/d' Makefile | make -f - am--depfiles
  1755. make: Nothing to be done for `am--depfiles'.
  1756. config.status:1243: $? = 0
  1757. config.status:1238: cd src/cpu && sed -e '/# am--include-marker/d' Makefile | make -f - am--depfiles
  1758. make: Nothing to be done for `am--depfiles'.
  1759. config.status:1243: $? = 0
  1760. config.status:1238: cd src/debug && sed -e '/# am--include-marker/d' Makefile | make -f - am--depfiles
  1761. make: Nothing to be done for `am--depfiles'.
  1762. config.status:1243: $? = 0
  1763. config.status:1238: cd src/dos && sed -e '/# am--include-marker/d' Makefile | make -f - am--depfiles
  1764. make: Nothing to be done for `am--depfiles'.
  1765. config.status:1243: $? = 0
  1766. config.status:1238: cd src/fpu && sed -e '/# am--include-marker/d' Makefile | make -f - am--depfiles
  1767. make: Nothing to be done for `am--depfiles'.
  1768. config.status:1243: $? = 0
  1769. config.status:1238: cd src/gui && sed -e '/# am--include-marker/d' Makefile | make -f - am--depfiles
  1770. make: Nothing to be done for `am--depfiles'.
  1771. config.status:1243: $? = 0
  1772. config.status:1238: cd src/hardware && sed -e '/# am--include-marker/d' Makefile | make -f - am--depfiles
  1773. make: Nothing to be done for `am--depfiles'.
  1774. config.status:1243: $? = 0
  1775. config.status:1238: cd src/hardware/mame && sed -e '/# am--include-marker/d' Makefile | make -f - am--depfiles
  1776. make: Nothing to be done for `am--depfiles'.
  1777. config.status:1243: $? = 0
  1778. config.status:1238: cd src/hardware/serialport && sed -e '/# am--include-marker/d' Makefile | make -f - am--depfiles
  1779. make: Nothing to be done for `am--depfiles'.
  1780. config.status:1243: $? = 0
  1781. config.status:1238: cd src/ints && sed -e '/# am--include-marker/d' Makefile | make -f - am--depfiles
  1782. make: Nothing to be done for `am--depfiles'.
  1783. config.status:1243: $? = 0
  1784. config.status:1238: cd src/libs/gui_tk && sed -e '/# am--include-marker/d' Makefile | make -f - am--depfiles
  1785. make: Nothing to be done for `am--depfiles'.
  1786. config.status:1243: $? = 0
  1787. config.status:1238: cd src/misc && sed -e '/# am--include-marker/d' Makefile | make -f - am--depfiles
  1788. make: Nothing to be done for `am--depfiles'.
  1789. config.status:1243: $? = 0
  1790. config.status:1238: cd src/shell && sed -e '/# am--include-marker/d' Makefile | make -f - am--depfiles
  1791. make: Nothing to be done for `am--depfiles'.
  1792. config.status:1243: $? = 0
  1793.  
  1794. ## ---------------- ##
  1795. ## Cache variables. ##
  1796. ## ---------------- ##
  1797.  
  1798. ac_cv_build=arm-apple-darwin20.1.0
  1799. ac_cv_c_bigendian=no
  1800. ac_cv_c_compiler_gnu=yes
  1801. ac_cv_c_const=yes
  1802. ac_cv_c_inline=inline
  1803. ac_cv_cxx_compiler_gnu=yes
  1804. ac_cv_env_CCC_set=
  1805. ac_cv_env_CCC_value=
  1806. ac_cv_env_CC_set=set
  1807. ac_cv_env_CC_value=/usr/bin/clang
  1808. ac_cv_env_CFLAGS_set=set
  1809. ac_cv_env_CFLAGS_value='-I/opt/arm/include -isysroot /opt/SDKs/MacOSX11.0.sdk -O2 -m64 '
  1810. ac_cv_env_CPPFLAGS_set=set
  1811. ac_cv_env_CPPFLAGS_value='-I/opt/arm/include -isysroot /opt/SDKs/MacOSX11.0.sdk'
  1812. ac_cv_env_CPP_set=
  1813. ac_cv_env_CPP_value=
  1814. ac_cv_env_CXXFLAGS_set=set
  1815. ac_cv_env_CXXFLAGS_value='-I/opt/arm/include -isysroot /opt/SDKs/MacOSX11.0.sdk -O2 -m64 '
  1816. ac_cv_env_CXX_set=set
  1817. ac_cv_env_CXX_value=/usr/bin/clang++
  1818. ac_cv_env_LDFLAGS_set=set
  1819. ac_cv_env_LDFLAGS_value='-L/opt/arm/lib -isysroot /opt/SDKs/MacOSX11.0.sdk -O2 -m64 '
  1820. ac_cv_env_LIBS_set=
  1821. ac_cv_env_LIBS_value=
  1822. ac_cv_env_build_alias_set=
  1823. ac_cv_env_build_alias_value=
  1824. ac_cv_env_host_alias_set=
  1825. ac_cv_env_host_alias_value=
  1826. ac_cv_env_target_alias_set=
  1827. ac_cv_env_target_alias_value=
  1828. ac_cv_func_realpath=yes
  1829. ac_cv_header_GL_gl_h=no
  1830. ac_cv_header_SDL_net_h=yes
  1831. ac_cv_header_SDL_sound_h=yes
  1832. ac_cv_header_X11_XKBlib_h=no
  1833. ac_cv_header_ddraw_h=no
  1834. ac_cv_header_inttypes_h=yes
  1835. ac_cv_header_memory_h=yes
  1836. ac_cv_header_netinet_in_h=yes
  1837. ac_cv_header_png_h=yes
  1838. ac_cv_header_pwd_h=yes
  1839. ac_cv_header_stdc=yes
  1840. ac_cv_header_stdint_h=yes
  1841. ac_cv_header_stdlib_h=yes
  1842. ac_cv_header_string_h=yes
  1843. ac_cv_header_strings_h=yes
  1844. ac_cv_header_sys_mman_h=yes
  1845. ac_cv_header_sys_socket_h=yes
  1846. ac_cv_header_sys_stat_h=yes
  1847. ac_cv_header_sys_types_h=yes
  1848. ac_cv_header_unistd_h=yes
  1849. ac_cv_header_zlib_h=yes
  1850. ac_cv_host=arm-apple-darwin20.1.0
  1851. ac_cv_lib_GL_main=no
  1852. ac_cv_lib_SDL_net_SDLNet_Init=yes
  1853. ac_cv_lib_SDL_sound_Sound_Init=yes
  1854. ac_cv_lib_SDL_sound_Sound_Seek=yes
  1855. ac_cv_lib_X11_main=no
  1856. ac_cv_lib_asound_snd_ctl_open=no
  1857. ac_cv_lib_opengl32_main=no
  1858. ac_cv_lib_png_png_get_io_ptr=yes
  1859. ac_cv_lib_rt_shm_open=no
  1860. ac_cv_lib_z_compress=yes
  1861. ac_cv_objext=o
  1862. ac_cv_path_EGREP='/usr/bin/grep -E'
  1863. ac_cv_path_GREP=/usr/bin/grep
  1864. ac_cv_path_SDL_CONFIG=/opt/arm/bin/sdl-config
  1865. ac_cv_path_install='/usr/bin/install -c'
  1866. ac_cv_prog_AWK=awk
  1867. ac_cv_prog_CPP='/usr/bin/clang -E'
  1868. ac_cv_prog_ac_ct_CC=/usr/bin/clang
  1869. ac_cv_prog_ac_ct_RANLIB=ranlib
  1870. ac_cv_prog_cc_c89=
  1871. ac_cv_prog_cc_g=yes
  1872. ac_cv_prog_cxx_g=yes
  1873. ac_cv_prog_make_make_set=yes
  1874. ac_cv_search_clock_gettime='none required'
  1875. ac_cv_sizeof_int_p=8
  1876. ac_cv_sizeof_unsigned_char=1
  1877. ac_cv_sizeof_unsigned_int=4
  1878. ac_cv_sizeof_unsigned_long=8
  1879. ac_cv_sizeof_unsigned_long_long=8
  1880. ac_cv_sizeof_unsigned_short=2
  1881. ac_cv_struct_tm=time.h
  1882. ac_cv_type_size_t=yes
  1883. am_cv_CC_dependencies_compiler_type=gcc3
  1884. am_cv_CXX_dependencies_compiler_type=gcc3
  1885. am_cv_make_support_nested_variables=yes
  1886. am_cv_prog_cc_c_o=yes
  1887.  
  1888. ## ----------------- ##
  1889. ## Output variables. ##
  1890. ## ----------------- ##
  1891.  
  1892. ACLOCAL='${SHELL} /Users/dtk/code/dosbox_wx/missing aclocal-1.16'
  1893. ALSA_CFLAGS=''
  1894. ALSA_LIBS=''
  1895. AMDEPBACKSLASH='\'
  1896. AMDEP_FALSE='#'
  1897. AMDEP_TRUE=''
  1898. AMTAR='$${TAR-tar}'
  1899. AM_BACKSLASH='\'
  1900. AM_DEFAULT_V='$(AM_DEFAULT_VERBOSITY)'
  1901. AM_DEFAULT_VERBOSITY='1'
  1902. AM_V='$(V)'
  1903. AUTOCONF='${SHELL} /Users/dtk/code/dosbox_wx/missing autoconf'
  1904. AUTOHEADER='${SHELL} /Users/dtk/code/dosbox_wx/missing autoheader'
  1905. AUTOMAKE='${SHELL} /Users/dtk/code/dosbox_wx/missing automake-1.16'
  1906. AWK='awk'
  1907. CC='/usr/bin/clang'
  1908. CCDEPMODE='depmode=gcc3'
  1909. CFLAGS='-I/opt/arm/include -isysroot /opt/SDKs/MacOSX11.0.sdk -O2 -m64 '
  1910. CPP='/usr/bin/clang -E'
  1911. CPPFLAGS='-I/opt/arm/include -isysroot /opt/SDKs/MacOSX11.0.sdk -I/opt/arm/include/SDL -D_GNU_SOURCE=1 -D_THREAD_SAFE'
  1912. CXX='/usr/bin/clang++'
  1913. CXXDEPMODE='depmode=gcc3'
  1914. CXXFLAGS='-I/opt/arm/include -isysroot /opt/SDKs/MacOSX11.0.sdk -O2 -m64 -mno-ms-bitfields '
  1915. CYGPATH_W='echo'
  1916. DEFS='-DHAVE_CONFIG_H'
  1917. DEPDIR='.deps'
  1918. ECHO_C='\c'
  1919. ECHO_N=''
  1920. ECHO_T=''
  1921. EGREP='/usr/bin/grep -E'
  1922. EXEEXT=''
  1923. GREP='/usr/bin/grep'
  1924. HAVE_WINDRES_FALSE=''
  1925. HAVE_WINDRES_TRUE='#'
  1926. INSTALL_DATA='${INSTALL} -m 644'
  1927. INSTALL_PROGRAM='${INSTALL}'
  1928. INSTALL_SCRIPT='${INSTALL}'
  1929. INSTALL_STRIP_PROGRAM='$(install_sh) -c -s'
  1930. LDFLAGS='-L/opt/arm/lib -isysroot /opt/SDKs/MacOSX11.0.sdk -O2 -m64 '
  1931. LIBOBJS=''
  1932. LIBS='-lSDL_sound -L/opt/arm/lib -lSDLmain -lSDL -Wl,-framework,Cocoa -framework CoreMIDI -framework AudioUnit -framework AudioToolbox -lpng -lz -lSDL_net -framework OpenGL'
  1933. LTLIBOBJS=''
  1934. MAKEINFO='${SHELL} /Users/dtk/code/dosbox_wx/missing makeinfo'
  1935. MKDIR_P='./install-sh -c -d'
  1936. OBJEXT='o'
  1937. PACKAGE='dosbox'
  1938. PACKAGE_BUGREPORT=''
  1939. PACKAGE_NAME='dosbox'
  1940. PACKAGE_STRING='dosbox SVN'
  1941. PACKAGE_TARNAME='dosbox'
  1942. PACKAGE_URL=''
  1943. PACKAGE_VERSION='SVN'
  1944. PATH_SEPARATOR=':'
  1945. RANLIB='ranlib'
  1946. SDL_CFLAGS='-I/opt/arm/include/SDL -D_GNU_SOURCE=1 -D_THREAD_SAFE'
  1947. SDL_CONFIG='/opt/arm/bin/sdl-config'
  1948. SDL_LIBS='-L/opt/arm/lib -lSDLmain -lSDL -Wl,-framework,Cocoa'
  1949. SET_MAKE=''
  1950. SHELL='/bin/sh'
  1951. STRIP=''
  1952. VERSION='SVN'
  1953. WINDRES=':'
  1954. ac_ct_CC='/usr/bin/clang'
  1955. ac_ct_CXX=''
  1956. am__EXEEXT_FALSE=''
  1957. am__EXEEXT_TRUE='#'
  1958. am__fastdepCC_FALSE='#'
  1959. am__fastdepCC_TRUE=''
  1960. am__fastdepCXX_FALSE='#'
  1961. am__fastdepCXX_TRUE=''
  1962. am__include='include'
  1963. am__isrc=''
  1964. am__leading_dot='.'
  1965. am__nodep='_no'
  1966. am__quote=''
  1967. am__tar='$${TAR-tar} chof - "$$tardir"'
  1968. am__untar='$${TAR-tar} xf -'
  1969. bindir='${exec_prefix}/bin'
  1970. build='arm-apple-darwin20.1.0'
  1971. build_alias=''
  1972. build_cpu='arm'
  1973. build_os='darwin20.1.0'
  1974. build_vendor='apple'
  1975. datadir='${datarootdir}'
  1976. datarootdir='${prefix}/share'
  1977. docdir='${datarootdir}/doc/${PACKAGE_TARNAME}'
  1978. dvidir='${docdir}'
  1979. exec_prefix='${prefix}'
  1980. host='arm-apple-darwin20.1.0'
  1981. host_alias=''
  1982. host_cpu='arm'
  1983. host_os='darwin20.1.0'
  1984. host_vendor='apple'
  1985. htmldir='${docdir}'
  1986. includedir='${prefix}/include'
  1987. infodir='${datarootdir}/info'
  1988. install_sh='${SHELL} /Users/dtk/code/dosbox_wx/install-sh'
  1989. libdir='${exec_prefix}/lib'
  1990. libexecdir='${exec_prefix}/libexec'
  1991. localedir='${datarootdir}/locale'
  1992. localstatedir='${prefix}/var'
  1993. mandir='${datarootdir}/man'
  1994. mkdir_p='$(MKDIR_P)'
  1995. oldincludedir='/usr/include'
  1996. pdfdir='${docdir}'
  1997. prefix='/opt/arm'
  1998. program_transform_name='s,x,x,'
  1999. psdir='${docdir}'
  2000. sbindir='${exec_prefix}/sbin'
  2001. sharedstatedir='${prefix}/com'
  2002. sysconfdir='${prefix}/etc'
  2003. target_alias=''
  2004.  
  2005. ## ----------- ##
  2006. ## confdefs.h. ##
  2007. ## ----------- ##
  2008.  
  2009. /* confdefs.h */
  2010. #define PACKAGE_NAME "dosbox"
  2011. #define PACKAGE_TARNAME "dosbox"
  2012. #define PACKAGE_VERSION "SVN"
  2013. #define PACKAGE_STRING "dosbox SVN"
  2014. #define PACKAGE_BUGREPORT ""
  2015. #define PACKAGE_URL ""
  2016. #define PACKAGE "dosbox"
  2017. #define VERSION "SVN"
  2018. #define STDC_HEADERS 1
  2019. #define HAVE_SYS_TYPES_H 1
  2020. #define HAVE_SYS_STAT_H 1
  2021. #define HAVE_STDLIB_H 1
  2022. #define HAVE_STRING_H 1
  2023. #define HAVE_MEMORY_H 1
  2024. #define HAVE_STRINGS_H 1
  2025. #define HAVE_INTTYPES_H 1
  2026. #define HAVE_STDINT_H 1
  2027. #define HAVE_UNISTD_H 1
  2028. #define SIZEOF_UNSIGNED_CHAR 1
  2029. #define SIZEOF_UNSIGNED_SHORT 2
  2030. #define SIZEOF_UNSIGNED_INT 4
  2031. #define SIZEOF_UNSIGNED_LONG 8
  2032. #define SIZEOF_UNSIGNED_LONG_LONG 8
  2033. #define SIZEOF_INT_P 8
  2034. #define HAVE_STDLIB_H 1
  2035. #define HAVE_SYS_TYPES_H 1
  2036. #define HAVE_SYS_SOCKET_H 1
  2037. #define HAVE_NETINET_IN_H 1
  2038. #define HAVE_PWD_H 1
  2039. #define ENVIRON_LINKED 1
  2040. #define DIRENT_HAS_D_TYPE 1
  2041. #define DB_HAVE_CLOCK_GETTIME 1
  2042. #define C_HAS_ATTRIBUTE 1
  2043. #define C_ATTRIBUTE_ALWAYS_INLINE 1
  2044. #define C_HAS_BUILTIN_EXPECT 1
  2045. #define C_SUPPORTS_COREMIDI /**/
  2046. #define C_SUPPORTS_COREAUDIO /**/
  2047. #define C_CORE_INLINE 1
  2048. #define C_TARGETCPU UNKNOWN
  2049. #define C_FPU 1
  2050. #define C_SSHOT 1
  2051. #define C_SRECORD 1
  2052. #define C_MODEM 1
  2053. #define C_IPX 1
  2054. #define C_OPENGL 1
  2055. #define C_SDL_SOUND 1
  2056. #define C_HAVE_MMAP 1
  2057. #define HAVE_REALPATH 1
  2058. #define MACOSX 1
  2059. #define C_DIRECTSERIAL 1
  2060.  
  2061. configure: exit 0
  2062. efine C_DIRECTSERIAL 1
  2063.  
  2064. configure: exit 0
  2065.  
RAW Paste Data