daily pastebin goal
0%
SHARE
TWEET

Untitled

a guest Jan 22nd, 2019 81 Never
Not a member of Pastebin yet? Sign Up, it unlocks many cool features!
  1. -- Check for working C compiler: C:/Program Files (x86)/mingw-w64/i686-6.3.0-posix-dwarf-rt_v5-rev2/mingw32/bin/gcc.exe
  2. -- Check for working C compiler: C:/Program Files (x86)/mingw-w64/i686-6.3.0-posix-dwarf-rt_v5-rev2/mingw32/bin/gcc.exe -- broken
  3. CMake Error at C:/Program Files/JetBrains/CLion 2018.2.3/bin/cmake/win/share/cmake-3.12/Modules/CMakeTestCCompiler.cmake:52 (message):
  4.   The C compiler
  5.  
  6.     "C:/Program Files (x86)/mingw-w64/i686-6.3.0-posix-dwarf-rt_v5-rev2/mingw32/bin/gcc.exe"
  7.  
  8.   is not able to compile a simple test program.
  9.  
  10.   It fails with the following output:
  11.  
  12.     Change Dir: D:/gdrive/studier/programmering/kurser MIUN/designmönster i c++/datr1700_laboration/cmake-build-debug/CMakeFiles/CMakeTmp
  13.    
  14.     Run Build Command:"C:/PROGRA~2/MINGW-~1/I686-6~1.0-P/mingw32/bin/mingw32-make.exe" "cmTC_20351/fast"
  15.     C:/PROGRA~2/MINGW-~1/I686-6~1.0-P/mingw32/bin/mingw32-make.exe -f CMakeFiles\cmTC_20351.dir\build.make CMakeFiles/cmTC_20351.dir/build
  16.     mingw32-make.exe[1]: Entering directory 'D:/gdrive/studier/programmering/kurser MIUN/designm÷nster i c++/datr1700_laboration/cmake-build-debug/CMakeFiles/CMakeTmp'
  17.     Building C object CMakeFiles/cmTC_20351.dir/testCCompiler.c.obj
  18.     C:\PROGRA~2\MINGW-~1\I686-6~1.0-P\mingw32\bin\gcc.exe    -o CMakeFiles\cmTC_20351.dir\testCCompiler.c.obj   -c "D:\gdrive\studier\programmering\kurser MIUN\designm├╢nster i c++\datr1700_laboration\cmake-build-debug\CMakeFiles\CMakeTmp\testCCompiler.c"
  19.     gcc.exe: error: D:\gdrive\studier\programmering\kurser MIUN\designm├╢nster i c++\datr1700_laboration\cmake-build-debug\CMakeFiles\CMakeTmp\testCCompiler.c: No such file or directory
  20.     gcc.exe: fatal error: no input files
  21.     compilation terminated.
  22.     CMakeFiles\cmTC_20351.dir\build.make:64: recipe for target 'CMakeFiles/cmTC_20351.dir/testCCompiler.c.obj' failed
  23.     mingw32-make.exe[1]: *** [CMakeFiles/cmTC_20351.dir/testCCompiler.c.obj] Error 1
  24.     mingw32-make.exe[1]: Leaving directory 'D:/gdrive/studier/programmering/kurser MIUN/designm÷nster i c++/datr1700_laboration/cmake-build-debug/CMakeFiles/CMakeTmp'
  25.     Makefile:120: recipe for target 'cmTC_20351/fast' failed
  26.     mingw32-make.exe: *** [cmTC_20351/fast] Error 2
  27.    
  28.  
  29.  
  30.  
  31.   CMake will not be able to correctly generate this project.
  32. Call Stack (most recent call first):
  33.   CMakeLists.txt:2 (project)
RAW Paste Data
We use cookies for various purposes including analytics. By continuing to use Pastebin, you agree to our use of cookies as described in the Cookies Policy. OK, I Understand
 
Top