Advertisement
Guest User

Untitled

a guest
May 24th, 2019
233
0
Never
Not a member of Pastebin yet? Sign Up, it unlocks many cool features!
text 11.14 KB | None | 0 0
  1. This mapping 'snapshot_20171003' was designed for MC 1.12! Use at your own peril.This mapping 'snapshot_20171003' was designed for MC 1.12! Use at your own peril.
  2.  
  3. #################################################
  4. ForgeGradle 2.3-SNAPSHOT-7764e3e
  5. https://github.com/MinecraftForge/ForgeGradle
  6. #################################################
  7. Powered by MCP
  8. http://modcoderpack.com
  9. by: Searge, ProfMobius, R4wk, ZeuX
  10. Fesh0r, IngisKahn, bspkrs, LexManos
  11. #################################################
  12. :deobfCompileDummyTask
  13. :deobfProvidedDummyTask
  14. :getVersionJson
  15. :extractUserdev UP-TO-DATE
  16. :extractDependencyATs SKIPPED
  17. :extractMcpData SKIPPED
  18. :extractMcpMappings SKIPPED
  19. :genSrgs SKIPPED
  20. :downloadClient SKIPPED
  21. :downloadServer SKIPPED
  22. :splitServerJar SKIPPED
  23. :mergeJars SKIPPED
  24. :deobfMcSRG SKIPPED
  25. :decompileMcException in thread "main" java.lang.OutOfMemoryError: GC overhead limit exceeded
  26. at org.jetbrains.java.decompiler.struct.StructClass.<init>(StructClass.java:113)
  27. at org.jetbrains.java.decompiler.struct.StructClass.<init>(StructClass.java:72)
  28. at org.jetbrains.java.decompiler.struct.StructContext.addArchive(StructContext.java:162)
  29. at org.jetbrains.java.decompiler.struct.StructContext.addSpace(StructContext.java:101)
  30. at org.jetbrains.java.decompiler.struct.StructContext.addSpace(StructContext.java:79)
  31. at org.jetbrains.java.decompiler.util.ClasspathScanner.addAllClasspath(ClasspathScanner.java:43)
  32. at org.jetbrains.java.decompiler.main.Fernflower.<init>(Fernflower.java:48)
  33. at org.jetbrains.java.decompiler.main.decompiler.BaseDecompiler.<init>(BaseDecompiler.java:32)
  34. at net.minecraftforge.gradle.tasks.fernflower.FernFlowerInvoker.runFernFlower(FernFlowerInvoker.java:64)
  35. at net.minecraftforge.gradle.tasks.fernflower.FernFlowerInvoker.main(FernFlowerInvoker.java:41)
  36. Picked up _JAVA_OPTIONS: -Xmx512M
  37. FAILED
  38.  
  39. FAILURE: Build failed with an exception.
  40.  
  41. * What went wrong:
  42. Execution failed for task ':decompileMc'.
  43. > Process 'command 'C:\Program Files\Java\jdk1.8.0_152\bin\java.exe'' finished with non-zero exit value 1
  44.  
  45. * Try:
  46. Run with --info or --debug option to get more log output.
  47.  
  48. * Exception is:
  49. org.gradle.api.tasks.TaskExecutionException: Execution failed for task ':decompileMc'.
  50. at org.gradle.api.internal.tasks.execution.ExecuteActionsTaskExecuter.executeActions(ExecuteActionsTaskExecuter.java:69)
  51. at org.gradle.api.internal.tasks.execution.ExecuteActionsTaskExecuter.execute(ExecuteActionsTaskExecuter.java:46)
  52. at org.gradle.api.internal.tasks.execution.PostExecutionAnalysisTaskExecuter.execute(PostExecutionAnalysisTaskExecuter.java:35)
  53. at org.gradle.api.internal.tasks.execution.SkipUpToDateTaskExecuter.execute(SkipUpToDateTaskExecuter.java:66)
  54. at org.gradle.api.internal.tasks.execution.ValidatingTaskExecuter.execute(ValidatingTaskExecuter.java:58)
  55. at org.gradle.api.internal.tasks.execution.SkipEmptySourceFilesTaskExecuter.execute(SkipEmptySourceFilesTaskExecuter.java:52)
  56. at org.gradle.api.internal.tasks.execution.SkipTaskWithNoActionsExecuter.execute(SkipTaskWithNoActionsExecuter.java:52)
  57. at org.gradle.api.internal.tasks.execution.SkipOnlyIfTaskExecuter.execute(SkipOnlyIfTaskExecuter.java:53)
  58. at org.gradle.api.internal.tasks.execution.ExecuteAtMostOnceTaskExecuter.execute(ExecuteAtMostOnceTaskExecuter.java:43)
  59. at org.gradle.execution.taskgraph.DefaultTaskGraphExecuter$EventFiringTaskWorker.execute(DefaultTaskGraphExecuter.java:203)
  60. at org.gradle.execution.taskgraph.DefaultTaskGraphExecuter$EventFiringTaskWorker.execute(DefaultTaskGraphExecuter.java:185)
  61. at org.gradle.execution.taskgraph.AbstractTaskPlanExecutor$TaskExecutorWorker.processTask(AbstractTaskPlanExecutor.java:66)
  62. at org.gradle.execution.taskgraph.AbstractTaskPlanExecutor$TaskExecutorWorker.run(AbstractTaskPlanExecutor.java:50)
  63. at org.gradle.execution.taskgraph.DefaultTaskPlanExecutor.process(DefaultTaskPlanExecutor.java:25)
  64. at org.gradle.execution.taskgraph.DefaultTaskGraphExecuter.execute(DefaultTaskGraphExecuter.java:110)
  65. at org.gradle.execution.SelectedTaskExecutionAction.execute(SelectedTaskExecutionAction.java:37)
  66. at org.gradle.execution.DefaultBuildExecuter.execute(DefaultBuildExecuter.java:37)
  67. at org.gradle.execution.DefaultBuildExecuter.access$000(DefaultBuildExecuter.java:23)
  68. at org.gradle.execution.DefaultBuildExecuter$1.proceed(DefaultBuildExecuter.java:43)
  69. at org.gradle.execution.DryRunBuildExecutionAction.execute(DryRunBuildExecutionAction.java:32)
  70. at org.gradle.execution.DefaultBuildExecuter.execute(DefaultBuildExecuter.java:37)
  71. at org.gradle.execution.DefaultBuildExecuter.execute(DefaultBuildExecuter.java:30)
  72. at org.gradle.initialization.DefaultGradleLauncher$4.run(DefaultGradleLauncher.java:153)
  73. at org.gradle.internal.Factories$1.create(Factories.java:22)
  74. at org.gradle.internal.progress.DefaultBuildOperationExecutor.run(DefaultBuildOperationExecutor.java:91)
  75. at org.gradle.internal.progress.DefaultBuildOperationExecutor.run(DefaultBuildOperationExecutor.java:53)
  76. at org.gradle.initialization.DefaultGradleLauncher.doBuildStages(DefaultGradleLauncher.java:150)
  77. at org.gradle.initialization.DefaultGradleLauncher.access$200(DefaultGradleLauncher.java:32)
  78. at org.gradle.initialization.DefaultGradleLauncher$1.create(DefaultGradleLauncher.java:98)
  79. at org.gradle.initialization.DefaultGradleLauncher$1.create(DefaultGradleLauncher.java:92)
  80. at org.gradle.internal.progress.DefaultBuildOperationExecutor.run(DefaultBuildOperationExecutor.java:91)
  81. at org.gradle.internal.progress.DefaultBuildOperationExecutor.run(DefaultBuildOperationExecutor.java:63)
  82. at org.gradle.initialization.DefaultGradleLauncher.doBuild(DefaultGradleLauncher.java:92)
  83. at org.gradle.initialization.DefaultGradleLauncher.run(DefaultGradleLauncher.java:83)
  84. at org.gradle.launcher.exec.InProcessBuildActionExecuter$DefaultBuildController.run(InProcessBuildActionExecuter.java:99)
  85. at org.gradle.tooling.internal.provider.ExecuteBuildActionRunner.run(ExecuteBuildActionRunner.java:28)
  86. at org.gradle.launcher.exec.ChainingBuildActionRunner.run(ChainingBuildActionRunner.java:35)
  87. at org.gradle.launcher.exec.InProcessBuildActionExecuter.execute(InProcessBuildActionExecuter.java:48)
  88. at org.gradle.launcher.exec.InProcessBuildActionExecuter.execute(InProcessBuildActionExecuter.java:30)
  89. at org.gradle.launcher.exec.ContinuousBuildActionExecuter.execute(ContinuousBuildActionExecuter.java:81)
  90. at org.gradle.launcher.exec.ContinuousBuildActionExecuter.execute(ContinuousBuildActionExecuter.java:46)
  91. at org.gradle.launcher.daemon.server.exec.ExecuteBuild.doBuild(ExecuteBuild.java:52)
  92. at org.gradle.launcher.daemon.server.exec.BuildCommandOnly.execute(BuildCommandOnly.java:36)
  93. at org.gradle.launcher.daemon.server.api.DaemonCommandExecution.proceed(DaemonCommandExecution.java:120)
  94. at org.gradle.launcher.daemon.server.exec.WatchForDisconnection.execute(WatchForDisconnection.java:37)
  95. at org.gradle.launcher.daemon.server.api.DaemonCommandExecution.proceed(DaemonCommandExecution.java:120)
  96. at org.gradle.launcher.daemon.server.exec.ResetDeprecationLogger.execute(ResetDeprecationLogger.java:26)
  97. at org.gradle.launcher.daemon.server.api.DaemonCommandExecution.proceed(DaemonCommandExecution.java:120)
  98. at org.gradle.launcher.daemon.server.exec.RequestStopIfSingleUsedDaemon.execute(RequestStopIfSingleUsedDaemon.java:34)
  99. at org.gradle.launcher.daemon.server.api.DaemonCommandExecution.proceed(DaemonCommandExecution.java:120)
  100. at org.gradle.launcher.daemon.server.exec.ForwardClientInput$2.call(ForwardClientInput.java:74)
  101. at org.gradle.launcher.daemon.server.exec.ForwardClientInput$2.call(ForwardClientInput.java:72)
  102. at org.gradle.util.Swapper.swap(Swapper.java:38)
  103. at org.gradle.launcher.daemon.server.exec.ForwardClientInput.execute(ForwardClientInput.java:72)
  104. at org.gradle.launcher.daemon.server.api.DaemonCommandExecution.proceed(DaemonCommandExecution.java:120)
  105. at org.gradle.launcher.daemon.server.health.DaemonHealthTracker.execute(DaemonHealthTracker.java:40)
  106. at org.gradle.launcher.daemon.server.api.DaemonCommandExecution.proceed(DaemonCommandExecution.java:120)
  107. at org.gradle.launcher.daemon.server.exec.LogToClient.doBuild(LogToClient.java:60)
  108. at org.gradle.launcher.daemon.server.exec.BuildCommandOnly.execute(BuildCommandOnly.java:36)
  109. at org.gradle.launcher.daemon.server.api.DaemonCommandExecution.proceed(DaemonCommandExecution.java:120)
  110. at org.gradle.launcher.daemon.server.exec.EstablishBuildEnvironment.doBuild(EstablishBuildEnvironment.java:72)
  111. at org.gradle.launcher.daemon.server.exec.BuildCommandOnly.execute(BuildCommandOnly.java:36)
  112. at org.gradle.launcher.daemon.server.api.DaemonCommandExecution.proceed(DaemonCommandExecution.java:120)
  113. at org.gradle.launcher.daemon.server.health.HintGCAfterBuild.execute(HintGCAfterBuild.java:41)
  114. at org.gradle.launcher.daemon.server.api.DaemonCommandExecution.proceed(DaemonCommandExecution.java:120)
  115. at org.gradle.launcher.daemon.server.exec.StartBuildOrRespondWithBusy$1.run(StartBuildOrRespondWithBusy.java:50)
  116. at org.gradle.launcher.daemon.server.DaemonStateCoordinator$1.run(DaemonStateCoordinator.java:237)
  117. at org.gradle.internal.concurrent.ExecutorPolicy$CatchAndRecordFailures.onExecute(ExecutorPolicy.java:54)
  118. at org.gradle.internal.concurrent.StoppableExecutorImpl$1.run(StoppableExecutorImpl.java:40)
  119. Caused by: org.gradle.process.internal.ExecException: Process 'command 'C:\Program Files\Java\jdk1.8.0_152\bin\java.exe'' finished with non-zero exit value 1
  120. at org.gradle.process.internal.DefaultExecHandle$ExecResultImpl.assertNormalExitValue(DefaultExecHandle.java:367)
  121. at org.gradle.process.internal.DefaultJavaExecAction.execute(DefaultJavaExecAction.java:31)
  122. at org.gradle.api.internal.file.DefaultFileOperations.javaexec(DefaultFileOperations.java:170)
  123. at org.gradle.api.internal.project.AbstractProject.javaexec(AbstractProject.java:848)
  124. at net.minecraftforge.gradle.tasks.fernflower.ApplyFernFlowerTask.runForkedFernFlower(ApplyFernFlowerTask.java:131)
  125. at net.minecraftforge.gradle.tasks.fernflower.ApplyFernFlowerTask.runFernFlower(ApplyFernFlowerTask.java:103)
  126. at net.minecraftforge.gradle.tasks.fernflower.ApplyFernFlowerTask.applyFernFlower(ApplyFernFlowerTask.java:84)
  127. at org.gradle.internal.reflect.JavaMethod.invoke(JavaMethod.java:75)
  128. at org.gradle.api.internal.project.taskfactory.AnnotationProcessingTaskFactory$StandardTaskAction.doExecute(AnnotationProcessingTaskFactory.java:228)
  129. at org.gradle.api.internal.project.taskfactory.AnnotationProcessingTaskFactory$StandardTaskAction.execute(AnnotationProcessingTaskFactory.java:221)
  130. at org.gradle.api.internal.project.taskfactory.AnnotationProcessingTaskFactory$StandardTaskAction.execute(AnnotationProcessingTaskFactory.java:210)
  131. at org.gradle.api.internal.AbstractTask$TaskActionWrapper.execute(AbstractTask.java:621)
  132. at org.gradle.api.internal.AbstractTask$TaskActionWrapper.execute(AbstractTask.java:604)
  133. at org.gradle.api.internal.tasks.execution.ExecuteActionsTaskExecuter.executeAction(ExecuteActionsTaskExecuter.java:80)
  134. at org.gradle.api.internal.tasks.execution.ExecuteActionsTaskExecuter.executeActions(ExecuteActionsTaskExecuter.java:61)
  135. ... 68 more
  136.  
  137.  
  138. BUILD FAILED
  139.  
  140. Total time: 31.888 secs
Advertisement
Add Comment
Please, Sign In to add comment
Advertisement