daily pastebin goal
41%
SHARE
TWEET

Untitled

a guest Aug 21st, 2018 90 Never
Not a member of Pastebin yet? Sign Up, it unlocks many cool features!
  1. 13:41:24:024 [15112] | ERROR | Failed to compile 'm:\reshade_ogl\shaders\qUINT_bloom.fx':
  2. 0(82) : error C1115: unable to find compatible overloaded function "ldexp(vec2, int)"
  3.  m:\reshade_ogl\shaders\qUINT_bloom.fx(265, 6): error: internal shader compilation failed
  4. Fragment info
  5. -------------
  6. 0(82) : error C1115: unable to find compatible overloaded function "ldexp(vec2, int)"
  7. (0) : error C2003: incompatible options for link
  8.  m:\reshade_ogl\shaders\qUINT_bloom.fx(355, 1): error: program linking failed
  9. 0(82) : error C1115: unable to find compatible overloaded function "ldexp(vec2, int)"
  10.  m:\reshade_ogl\shaders\qUINT_bloom.fx(269, 6): error: internal shader compilation failed
  11. Fragment info
  12. -------------
  13. 0(82) : error C1115: unable to find compatible overloaded function "ldexp(vec2, int)"
  14. (0) : error C2003: incompatible options for link
  15.  m:\reshade_ogl\shaders\qUINT_bloom.fx(356, 1): error: program linking failed
  16. 0(82) : error C1115: unable to find compatible overloaded function "ldexp(vec2, int)"
  17.  m:\reshade_ogl\shaders\qUINT_bloom.fx(273, 6): error: internal shader compilation failed
  18. Fragment info
  19. -------------
  20. 0(82) : error C1115: unable to find compatible overloaded function "ldexp(vec2, int)"
  21. (0) : error C2003: incompatible options for link
  22.  m:\reshade_ogl\shaders\qUINT_bloom.fx(357, 1): error: program linking failed
  23. 0(82) : error C1115: unable to find compatible overloaded function "ldexp(vec2, int)"
  24.  m:\reshade_ogl\shaders\qUINT_bloom.fx(277, 6): error: internal shader compilation failed
  25. Fragment info
  26. -------------
  27. 0(82) : error C1115: unable to find compatible overloaded function "ldexp(vec2, int)"
  28. (0) : error C2003: incompatible options for link
  29.  m:\reshade_ogl\shaders\qUINT_bloom.fx(358, 1): error: program linking failed
  30. 0(82) : error C1115: unable to find compatible overloaded function "ldexp(vec2, int)"
  31.  m:\reshade_ogl\shaders\qUINT_bloom.fx(281, 6): error: internal shader compilation failed
  32. Fragment info
  33. -------------
  34. 0(82) : error C1115: unable to find compatible overloaded function "ldexp(vec2, int)"
  35. (0) : error C2003: incompatible options for link
  36.  m:\reshade_ogl\shaders\qUINT_bloom.fx(359, 1): error: program linking failed
  37. 0(82) : error C1115: unable to find compatible overloaded function "ldexp(vec2, int)"
  38.  m:\reshade_ogl\shaders\qUINT_bloom.fx(285, 6): error: internal shader compilation failed
  39. Fragment info
  40. -------------
  41. 0(82) : error C1115: unable to find compatible overloaded function "ldexp(vec2, int)"
  42. (0) : error C2003: incompatible options for link
  43.  m:\reshade_ogl\shaders\qUINT_bloom.fx(360, 1): error: program linking failed
  44. 0(82) : error C1115: unable to find compatible overloaded function "ldexp(vec2, int)"
  45.  m:\reshade_ogl\shaders\qUINT_bloom.fx(289, 6): error: internal shader compilation failed
  46. Fragment info
  47. -------------
  48. 0(82) : error C1115: unable to find compatible overloaded function "ldexp(vec2, int)"
  49. (0) : error C2003: incompatible options for link
  50.  m:\reshade_ogl\shaders\qUINT_bloom.fx(361, 1): error: program linking failed
  51. 0(71) : error C1115: unable to find compatible overloaded function "ldexp(vec2, int)"
  52.  m:\reshade_ogl\shaders\qUINT_bloom.fx(300, 6): error: internal shader compilation failed
  53. Fragment info
  54. -------------
  55. 0(71) : error C1115: unable to find compatible overloaded function "ldexp(vec2, int)"
  56. (0) : error C2003: incompatible options for link
  57.  m:\reshade_ogl\shaders\qUINT_bloom.fx(372, 1): error: program linking failed
  58. 0(71) : error C1115: unable to find compatible overloaded function "ldexp(vec2, int)"
  59.  m:\reshade_ogl\shaders\qUINT_bloom.fx(303, 6): error: internal shader compilation failed
  60. Fragment info
  61. -------------
  62. 0(71) : error C1115: unable to find compatible overloaded function "ldexp(vec2, int)"
  63. (0) : error C2003: incompatible options for link
  64.  m:\reshade_ogl\shaders\qUINT_bloom.fx(373, 1): error: program linking failed
  65. 0(71) : error C1115: unable to find compatible overloaded function "ldexp(vec2, int)"
  66.  m:\reshade_ogl\shaders\qUINT_bloom.fx(307, 6): error: internal shader compilation failed
  67. Fragment info
  68. -------------
  69. 0(71) : error C1115: unable to find compatible overloaded function "ldexp(vec2, int)"
  70. (0) : error C2003: incompatible options for link
  71.  m:\reshade_ogl\shaders\qUINT_bloom.fx(374, 1): error: program linking failed
  72. 0(71) : error C1115: unable to find compatible overloaded function "ldexp(vec2, int)"
  73.  m:\reshade_ogl\shaders\qUINT_bloom.fx(311, 6): error: internal shader compilation failed
  74. Fragment info
  75. -------------
  76. 0(71) : error C1115: unable to find compatible overloaded function "ldexp(vec2, int)"
  77. (0) : error C2003: incompatible options for link
  78.  m:\reshade_ogl\shaders\qUINT_bloom.fx(375, 1): error: program linking failed
  79. 0(71) : error C1115: unable to find compatible overloaded function "ldexp(vec2, int)"
  80.  m:\reshade_ogl\shaders\qUINT_bloom.fx(315, 6): error: internal shader compilation failed
  81. Fragment info
  82. -------------
  83. 0(71) : error C1115: unable to find compatible overloaded function "ldexp(vec2, int)"
  84. (0) : error C2003: incompatible options for link
  85.  m:\reshade_ogl\shaders\qUINT_bloom.fx(376, 1): error: program linking failed
  86. 0(71) : error C1115: unable to find compatible overloaded function "ldexp(vec2, int)"
  87.  m:\reshade_ogl\shaders\qUINT_bloom.fx(319, 6): error: internal shader compilation failed
  88. Fragment info
  89. -------------
  90. 0(71) : error C1115: unable to find compatible overloaded function "ldexp(vec2, int)"
  91. (0) : error C2003: incompatible options for link
  92.  m:\reshade_ogl\shaders\qUINT_bloom.fx(377, 1): error: program linking failed
  93. 0(71) : error C1115: unable to find compatible overloaded function "ldexp(vec2, int)"
  94.  m:\reshade_ogl\shaders\qUINT_bloom.fx(324, 6): error: internal shader compilation failed
  95. Fragment info
  96. -------------
  97. 0(71) : error C1115: unable to find compatible overloaded function "ldexp(vec2, int)"
  98. (0) : error C2003: incompatible options for link
  99.  m:\reshade_ogl\shaders\qUINT_bloom.fx(379, 1): error: program linking failed
RAW Paste Data
We use cookies for various purposes including analytics. By continuing to use Pastebin, you agree to our use of cookies as described in the Cookies Policy. OK, I Understand
 
Top