Guest User

Untitled

a guest
Jun 21st, 2015
14
Never
Not a member of Pastebin yet? Sign Up, it unlocks many cool features!
  1. Determining if the include file io.h exists failed with the following output:
  2. Change Dir: /opt/local/var/macports/build/_opt_local_var_macports_sources_rsync.macports.org_release_tarballs_ports_science_gnuradio/gnuradio/work/build/CMakeFiles/CMakeTmp
  3.  
  4. Run Build Command:"/opt/local/bin/gmake" "cmTryCompileExec2027701306/fast"
  5. /opt/local/bin/gmake -f CMakeFiles/cmTryCompileExec2027701306.dir/build.make CMakeFiles/cmTryCompileExec2027701306.dir/build
  6. gmake[1]: Entering directory '/opt/local/var/macports/build/_opt_local_var_macports_sources_rsync.macports.org_release_tarballs_ports_science_gnuradio/gnuradio/work/build/CMakeFiles/CMakeTmp'
  7. /opt/local/bin/cmake -E cmake_progress_report /opt/local/var/macports/build/_opt_local_var_macports_sources_rsync.macports.org_release_tarballs_ports_science_gnuradio/gnuradio/work/build/CMakeFiles/CMakeTmp/CMakeFiles 1
  8. Building CXX object CMakeFiles/cmTryCompileExec2027701306.dir/CheckIncludeFile.cxx.o
  9. /Developer/usr/bin/g++-4.2    -pipe -Os -arch x86_64  -fvisibility=hidden -Wsign-compare -Wall -Wno-uninitialized  -arch x86_64 -mmacosx-version-min=10.6   -o CMakeFiles/cmTryCompileExec2027701306.dir/CheckIncludeFile.cxx.o -c /opt/local/var/macports/build/_opt_local_var_macports_sources_rsync.macports.org_release_tarballs_ports_science_gnuradio/gnuradio/work/build/CMakeFiles/CMakeTmp/CheckIncludeFile.cxx
  10. /opt/local/var/macports/build/_opt_local_var_macports_sources_rsync.macports.org_release_tarballs_ports_science_gnuradio/gnuradio/work/build/CMakeFiles/CMakeTmp/CheckIncludeFile.cxx:1:16: error: io.h: No such file or directory
  11. CMakeFiles/cmTryCompileExec2027701306.dir/build.make:57: recipe for target 'CMakeFiles/cmTryCompileExec2027701306.dir/CheckIncludeFile.cxx.o' failed
  12. gmake[1]: *** [CMakeFiles/cmTryCompileExec2027701306.dir/CheckIncludeFile.cxx.o] Error 1
  13. gmake[1]: Leaving directory '/opt/local/var/macports/build/_opt_local_var_macports_sources_rsync.macports.org_release_tarballs_ports_science_gnuradio/gnuradio/work/build/CMakeFiles/CMakeTmp'
  14. Makefile:117: recipe for target 'cmTryCompileExec2027701306/fast' failed
  15. gmake: *** [cmTryCompileExec2027701306/fast] Error 2
  16.  
  17.  
  18. Determining if the include file byteswap.h exists failed with the following output:
  19. Change Dir: /opt/local/var/macports/build/_opt_local_var_macports_sources_rsync.macports.org_release_tarballs_ports_science_gnuradio/gnuradio/work/build/CMakeFiles/CMakeTmp
  20.  
  21. Run Build Command:"/opt/local/bin/gmake" "cmTryCompileExec1377269882/fast"
  22. /opt/local/bin/gmake -f CMakeFiles/cmTryCompileExec1377269882.dir/build.make CMakeFiles/cmTryCompileExec1377269882.dir/build
  23. gmake[1]: Entering directory '/opt/local/var/macports/build/_opt_local_var_macports_sources_rsync.macports.org_release_tarballs_ports_science_gnuradio/gnuradio/work/build/CMakeFiles/CMakeTmp'
  24. /opt/local/bin/cmake -E cmake_progress_report /opt/local/var/macports/build/_opt_local_var_macports_sources_rsync.macports.org_release_tarballs_ports_science_gnuradio/gnuradio/work/build/CMakeFiles/CMakeTmp/CMakeFiles 1
  25. Building CXX object CMakeFiles/cmTryCompileExec1377269882.dir/CheckIncludeFile.cxx.o
  26. /Developer/usr/bin/g++-4.2    -pipe -Os -arch x86_64  -fvisibility=hidden -Wsign-compare -Wall -Wno-uninitialized  -arch x86_64 -mmacosx-version-min=10.6   -o CMakeFiles/cmTryCompileExec1377269882.dir/CheckIncludeFile.cxx.o -c /opt/local/var/macports/build/_opt_local_var_macports_sources_rsync.macports.org_release_tarballs_ports_science_gnuradio/gnuradio/work/build/CMakeFiles/CMakeTmp/CheckIncludeFile.cxx
  27. /opt/local/var/macports/build/_opt_local_var_macports_sources_rsync.macports.org_release_tarballs_ports_science_gnuradio/gnuradio/work/build/CMakeFiles/CMakeTmp/CheckIncludeFile.cxx:1:22: error: byteswap.h: No such file or directory
  28. CMakeFiles/cmTryCompileExec1377269882.dir/build.make:57: recipe for target 'CMakeFiles/cmTryCompileExec1377269882.dir/CheckIncludeFile.cxx.o' failed
  29. gmake[1]: *** [CMakeFiles/cmTryCompileExec1377269882.dir/CheckIncludeFile.cxx.o] Error 1
  30. gmake[1]: Leaving directory '/opt/local/var/macports/build/_opt_local_var_macports_sources_rsync.macports.org_release_tarballs_ports_science_gnuradio/gnuradio/work/build/CMakeFiles/CMakeTmp'
  31. Makefile:117: recipe for target 'cmTryCompileExec1377269882/fast' failed
  32. gmake: *** [cmTryCompileExec1377269882/fast] Error 2
  33.  
  34.  
  35. Determining if the include file linux/ppdev.h exists failed with the following output:
  36. Change Dir: /opt/local/var/macports/build/_opt_local_var_macports_sources_rsync.macports.org_release_tarballs_ports_science_gnuradio/gnuradio/work/build/CMakeFiles/CMakeTmp
  37.  
  38. Run Build Command:"/opt/local/bin/gmake" "cmTryCompileExec2333898873/fast"
  39. /opt/local/bin/gmake -f CMakeFiles/cmTryCompileExec2333898873.dir/build.make CMakeFiles/cmTryCompileExec2333898873.dir/build
  40. gmake[1]: Entering directory '/opt/local/var/macports/build/_opt_local_var_macports_sources_rsync.macports.org_release_tarballs_ports_science_gnuradio/gnuradio/work/build/CMakeFiles/CMakeTmp'
  41. /opt/local/bin/cmake -E cmake_progress_report /opt/local/var/macports/build/_opt_local_var_macports_sources_rsync.macports.org_release_tarballs_ports_science_gnuradio/gnuradio/work/build/CMakeFiles/CMakeTmp/CMakeFiles 1
  42. Building CXX object CMakeFiles/cmTryCompileExec2333898873.dir/CheckIncludeFile.cxx.o
  43. /Developer/usr/bin/g++-4.2    -pipe -Os -arch x86_64  -fvisibility=hidden -Wsign-compare -Wall -Wno-uninitialized  -arch x86_64 -mmacosx-version-min=10.6   -o CMakeFiles/cmTryCompileExec2333898873.dir/CheckIncludeFile.cxx.o -c /opt/local/var/macports/build/_opt_local_var_macports_sources_rsync.macports.org_release_tarballs_ports_science_gnuradio/gnuradio/work/build/CMakeFiles/CMakeTmp/CheckIncludeFile.cxx
  44. /opt/local/var/macports/build/_opt_local_var_macports_sources_rsync.macports.org_release_tarballs_ports_science_gnuradio/gnuradio/work/build/CMakeFiles/CMakeTmp/CheckIncludeFile.cxx:1:25: error: linux/ppdev.h: No such file or directory
  45. CMakeFiles/cmTryCompileExec2333898873.dir/build.make:57: recipe for target 'CMakeFiles/cmTryCompileExec2333898873.dir/CheckIncludeFile.cxx.o' failed
  46. gmake[1]: *** [CMakeFiles/cmTryCompileExec2333898873.dir/CheckIncludeFile.cxx.o] Error 1
  47. gmake[1]: Leaving directory '/opt/local/var/macports/build/_opt_local_var_macports_sources_rsync.macports.org_release_tarballs_ports_science_gnuradio/gnuradio/work/build/CMakeFiles/CMakeTmp'
  48. Makefile:117: recipe for target 'cmTryCompileExec2333898873/fast' failed
  49. gmake: *** [cmTryCompileExec2333898873/fast] Error 2
  50.  
  51.  
  52. Determining if the include file dev/ppbus/ppi.h exists failed with the following output:
  53. Change Dir: /opt/local/var/macports/build/_opt_local_var_macports_sources_rsync.macports.org_release_tarballs_ports_science_gnuradio/gnuradio/work/build/CMakeFiles/CMakeTmp
  54.  
  55. Run Build Command:"/opt/local/bin/gmake" "cmTryCompileExec4143874312/fast"
  56. /opt/local/bin/gmake -f CMakeFiles/cmTryCompileExec4143874312.dir/build.make CMakeFiles/cmTryCompileExec4143874312.dir/build
  57. gmake[1]: Entering directory '/opt/local/var/macports/build/_opt_local_var_macports_sources_rsync.macports.org_release_tarballs_ports_science_gnuradio/gnuradio/work/build/CMakeFiles/CMakeTmp'
  58. /opt/local/bin/cmake -E cmake_progress_report /opt/local/var/macports/build/_opt_local_var_macports_sources_rsync.macports.org_release_tarballs_ports_science_gnuradio/gnuradio/work/build/CMakeFiles/CMakeTmp/CMakeFiles 1
  59. Building CXX object CMakeFiles/cmTryCompileExec4143874312.dir/CheckIncludeFile.cxx.o
  60. /Developer/usr/bin/g++-4.2    -pipe -Os -arch x86_64  -fvisibility=hidden -Wsign-compare -Wall -Wno-uninitialized  -arch x86_64 -mmacosx-version-min=10.6   -o CMakeFiles/cmTryCompileExec4143874312.dir/CheckIncludeFile.cxx.o -c /opt/local/var/macports/build/_opt_local_var_macports_sources_rsync.macports.org_release_tarballs_ports_science_gnuradio/gnuradio/work/build/CMakeFiles/CMakeTmp/CheckIncludeFile.cxx
  61. /opt/local/var/macports/build/_opt_local_var_macports_sources_rsync.macports.org_release_tarballs_ports_science_gnuradio/gnuradio/work/build/CMakeFiles/CMakeTmp/CheckIncludeFile.cxx:1:27: error: dev/ppbus/ppi.h: No such file or directory
  62. CMakeFiles/cmTryCompileExec4143874312.dir/build.make:57: recipe for target 'CMakeFiles/cmTryCompileExec4143874312.dir/CheckIncludeFile.cxx.o' failed
  63. gmake[1]: *** [CMakeFiles/cmTryCompileExec4143874312.dir/CheckIncludeFile.cxx.o] Error 1
  64. gmake[1]: Leaving directory '/opt/local/var/macports/build/_opt_local_var_macports_sources_rsync.macports.org_release_tarballs_ports_science_gnuradio/gnuradio/work/build/CMakeFiles/CMakeTmp'
  65. Makefile:117: recipe for target 'cmTryCompileExec4143874312/fast' failed
  66. gmake: *** [cmTryCompileExec4143874312/fast] Error 2
  67.  
  68.  
  69. Determining if the include file malloc.h exists failed with the following output:
  70. Change Dir: /opt/local/var/macports/build/_opt_local_var_macports_sources_rsync.macports.org_release_tarballs_ports_science_gnuradio/gnuradio/work/build/CMakeFiles/CMakeTmp
  71.  
  72. Run Build Command:"/opt/local/bin/gmake" "cmTryCompileExec2416456270/fast"
  73. /opt/local/bin/gmake -f CMakeFiles/cmTryCompileExec2416456270.dir/build.make CMakeFiles/cmTryCompileExec2416456270.dir/build
  74. gmake[1]: Entering directory '/opt/local/var/macports/build/_opt_local_var_macports_sources_rsync.macports.org_release_tarballs_ports_science_gnuradio/gnuradio/work/build/CMakeFiles/CMakeTmp'
  75. /opt/local/bin/cmake -E cmake_progress_report /opt/local/var/macports/build/_opt_local_var_macports_sources_rsync.macports.org_release_tarballs_ports_science_gnuradio/gnuradio/work/build/CMakeFiles/CMakeTmp/CMakeFiles 1
  76. Building CXX object CMakeFiles/cmTryCompileExec2416456270.dir/CheckIncludeFile.cxx.o
  77. /Developer/usr/bin/g++-4.2    -pipe -Os -arch x86_64  -fvisibility=hidden -Wsign-compare -Wall -Wno-uninitialized  -arch x86_64 -mmacosx-version-min=10.6   -o CMakeFiles/cmTryCompileExec2416456270.dir/CheckIncludeFile.cxx.o -c /opt/local/var/macports/build/_opt_local_var_macports_sources_rsync.macports.org_release_tarballs_ports_science_gnuradio/gnuradio/work/build/CMakeFiles/CMakeTmp/CheckIncludeFile.cxx
  78. /opt/local/var/macports/build/_opt_local_var_macports_sources_rsync.macports.org_release_tarballs_ports_science_gnuradio/gnuradio/work/build/CMakeFiles/CMakeTmp/CheckIncludeFile.cxx:1:20: error: malloc.h: No such file or directory
  79. CMakeFiles/cmTryCompileExec2416456270.dir/build.make:57: recipe for target 'CMakeFiles/cmTryCompileExec2416456270.dir/CheckIncludeFile.cxx.o' failed
  80. gmake[1]: *** [CMakeFiles/cmTryCompileExec2416456270.dir/CheckIncludeFile.cxx.o] Error 1
  81. gmake[1]: Leaving directory '/opt/local/var/macports/build/_opt_local_var_macports_sources_rsync.macports.org_release_tarballs_ports_science_gnuradio/gnuradio/work/build/CMakeFiles/CMakeTmp'
  82. Makefile:117: recipe for target 'cmTryCompileExec2416456270/fast' failed
  83. gmake: *** [cmTryCompileExec2416456270/fast] Error 2
  84.  
  85.  
  86. Performing C++ SOURCE FILE Test HAVE_SSLEEP failed with the following output:
  87. Change Dir: /opt/local/var/macports/build/_opt_local_var_macports_sources_rsync.macports.org_release_tarballs_ports_science_gnuradio/gnuradio/work/build/CMakeFiles/CMakeTmp
  88.  
  89. Run Build Command:"/opt/local/bin/gmake" "cmTryCompileExec1416313033/fast"
  90. /opt/local/bin/gmake -f CMakeFiles/cmTryCompileExec1416313033.dir/build.make CMakeFiles/cmTryCompileExec1416313033.dir/build
  91. gmake[1]: Entering directory '/opt/local/var/macports/build/_opt_local_var_macports_sources_rsync.macports.org_release_tarballs_ports_science_gnuradio/gnuradio/work/build/CMakeFiles/CMakeTmp'
  92. /opt/local/bin/cmake -E cmake_progress_report /opt/local/var/macports/build/_opt_local_var_macports_sources_rsync.macports.org_release_tarballs_ports_science_gnuradio/gnuradio/work/build/CMakeFiles/CMakeTmp/CMakeFiles 1
  93. Building CXX object CMakeFiles/cmTryCompileExec1416313033.dir/src.cxx.o
  94. /Developer/usr/bin/g++-4.2    -pipe -Os -arch x86_64  -fvisibility=hidden -Wsign-compare -Wall -Wno-uninitialized -DHAVE_SSLEEP -arch x86_64 -mmacosx-version-min=10.6   -o CMakeFiles/cmTryCompileExec1416313033.dir/src.cxx.o -c /opt/local/var/macports/build/_opt_local_var_macports_sources_rsync.macports.org_release_tarballs_ports_science_gnuradio/gnuradio/work/build/CMakeFiles/CMakeTmp/src.cxx
  95. /opt/local/var/macports/build/_opt_local_var_macports_sources_rsync.macports.org_release_tarballs_ports_science_gnuradio/gnuradio/work/build/CMakeFiles/CMakeTmp/src.cxx:2:25: error: Winbase.h: No such file or directory
  96. /opt/local/var/macports/build/_opt_local_var_macports_sources_rsync.macports.org_release_tarballs_ports_science_gnuradio/gnuradio/work/build/CMakeFiles/CMakeTmp/src.cxx: In function ‘int main()’:
  97. /opt/local/var/macports/build/_opt_local_var_macports_sources_rsync.macports.org_release_tarballs_ports_science_gnuradio/gnuradio/work/build/CMakeFiles/CMakeTmp/src.cxx:3: error:Sleep’ was not declared in this scope
  98. CMakeFiles/cmTryCompileExec1416313033.dir/build.make:57: recipe for target 'CMakeFiles/cmTryCompileExec1416313033.dir/src.cxx.o' failed
  99. gmake[1]: *** [CMakeFiles/cmTryCompileExec1416313033.dir/src.cxx.o] Error 1
  100. gmake[1]: Leaving directory '/opt/local/var/macports/build/_opt_local_var_macports_sources_rsync.macports.org_release_tarballs_ports_science_gnuradio/gnuradio/work/build/CMakeFiles/CMakeTmp'
  101. Makefile:117: recipe for target 'cmTryCompileExec1416313033/fast' failed
  102. gmake: *** [cmTryCompileExec1416313033/fast] Error 2
  103.  
  104. Source file was:
  105.  
  106.     #include <Winbase.h>
  107.     int main(){Sleep(0); return 0;}
  108.    
  109. Performing C++ SOURCE FILE Test HAVE_VALLOC failed with the following output:
  110. Change Dir: /opt/local/var/macports/build/_opt_local_var_macports_sources_rsync.macports.org_release_tarballs_ports_science_gnuradio/gnuradio/work/build/CMakeFiles/CMakeTmp
  111.  
  112. Run Build Command:"/opt/local/bin/gmake" "cmTryCompileExec3986202820/fast"
  113. /opt/local/bin/gmake -f CMakeFiles/cmTryCompileExec3986202820.dir/build.make CMakeFiles/cmTryCompileExec3986202820.dir/build
  114. gmake[1]: Entering directory '/opt/local/var/macports/build/_opt_local_var_macports_sources_rsync.macports.org_release_tarballs_ports_science_gnuradio/gnuradio/work/build/CMakeFiles/CMakeTmp'
  115. /opt/local/bin/cmake -E cmake_progress_report /opt/local/var/macports/build/_opt_local_var_macports_sources_rsync.macports.org_release_tarballs_ports_science_gnuradio/gnuradio/work/build/CMakeFiles/CMakeTmp/CMakeFiles 1
  116. Building CXX object CMakeFiles/cmTryCompileExec3986202820.dir/src.cxx.o
  117. /Developer/usr/bin/g++-4.2    -pipe -Os -arch x86_64  -fvisibility=hidden -Wsign-compare -Wall -Wno-uninitialized -DHAVE_VALLOC -arch x86_64 -mmacosx-version-min=10.6   -o CMakeFiles/cmTryCompileExec3986202820.dir/src.cxx.o -c /opt/local/var/macports/build/_opt_local_var_macports_sources_rsync.macports.org_release_tarballs_ports_science_gnuradio/gnuradio/work/build/CMakeFiles/CMakeTmp/src.cxx
  118. /opt/local/var/macports/build/_opt_local_var_macports_sources_rsync.macports.org_release_tarballs_ports_science_gnuradio/gnuradio/work/build/CMakeFiles/CMakeTmp/src.cxx:2:24: error: malloc.h: No such file or directory
  119. /opt/local/var/macports/build/_opt_local_var_macports_sources_rsync.macports.org_release_tarballs_ports_science_gnuradio/gnuradio/work/build/CMakeFiles/CMakeTmp/src.cxx: In function ‘int main()’:
  120. /opt/local/var/macports/build/_opt_local_var_macports_sources_rsync.macports.org_release_tarballs_ports_science_gnuradio/gnuradio/work/build/CMakeFiles/CMakeTmp/src.cxx:3: error: ‘valloc’ was not declared in this scope
  121. CMakeFiles/cmTryCompileExec3986202820.dir/build.make:57: recipe for target 'CMakeFiles/cmTryCompileExec3986202820.dir/src.cxx.o' failed
  122. gmake[1]: *** [CMakeFiles/cmTryCompileExec3986202820.dir/src.cxx.o] Error 1
  123. gmake[1]: Leaving directory '/opt/local/var/macports/build/_opt_local_var_macports_sources_rsync.macports.org_release_tarballs_ports_science_gnuradio/gnuradio/work/build/CMakeFiles/CMakeTmp'
  124. Makefile:117: recipe for target 'cmTryCompileExec3986202820/fast' failed
  125. gmake: *** [cmTryCompileExec3986202820/fast] Error 2
  126.  
  127. Source file was:
  128.  
  129.     #include <malloc.h>
  130.     int main(){valloc(0); return 0;}
  131.    
  132. Performing C++ SOURCE FILE Test HAVE_CREATEFILEMAPPING failed with the following output:
  133. Change Dir: /opt/local/var/macports/build/_opt_local_var_macports_sources_rsync.macports.org_release_tarballs_ports_science_gnuradio/gnuradio/work/build/CMakeFiles/CMakeTmp
  134.  
  135. Run Build Command:"/opt/local/bin/gmake" "cmTryCompileExec4161648589/fast"
  136. /opt/local/bin/gmake -f CMakeFiles/cmTryCompileExec4161648589.dir/build.make CMakeFiles/cmTryCompileExec4161648589.dir/build
  137. gmake[1]: Entering directory '/opt/local/var/macports/build/_opt_local_var_macports_sources_rsync.macports.org_release_tarballs_ports_science_gnuradio/gnuradio/work/build/CMakeFiles/CMakeTmp'
  138. /opt/local/bin/cmake -E cmake_progress_report /opt/local/var/macports/build/_opt_local_var_macports_sources_rsync.macports.org_release_tarballs_ports_science_gnuradio/gnuradio/work/build/CMakeFiles/CMakeTmp/CMakeFiles 1
  139. Building CXX object CMakeFiles/cmTryCompileExec4161648589.dir/src.cxx.o
  140. /Developer/usr/bin/g++-4.2    -pipe -Os -arch x86_64  -fvisibility=hidden -Wsign-compare -Wall -Wno-uninitialized -DHAVE_CREATEFILEMAPPING -arch x86_64 -mmacosx-version-min=10.6   -o CMakeFiles/cmTryCompileExec4161648589.dir/src.cxx.o -c /opt/local/var/macports/build/_opt_local_var_macports_sources_rsync.macports.org_release_tarballs_ports_science_gnuradio/gnuradio/work/build/CMakeFiles/CMakeTmp/src.cxx
  141. /opt/local/var/macports/build/_opt_local_var_macports_sources_rsync.macports.org_release_tarballs_ports_science_gnuradio/gnuradio/work/build/CMakeFiles/CMakeTmp/src.cxx:2:25: error: windows.h: No such file or directory
  142. /opt/local/var/macports/build/_opt_local_var_macports_sources_rsync.macports.org_release_tarballs_ports_science_gnuradio/gnuradio/work/build/CMakeFiles/CMakeTmp/src.cxx: In function ‘int main()’:
  143. /opt/local/var/macports/build/_opt_local_var_macports_sources_rsync.macports.org_release_tarballs_ports_science_gnuradio/gnuradio/work/build/CMakeFiles/CMakeTmp/src.cxx:4: error:HANDLE’ was not declared in this scope
  144. /opt/local/var/macports/build/_opt_local_var_macports_sources_rsync.macports.org_release_tarballs_ports_science_gnuradio/gnuradio/work/build/CMakeFiles/CMakeTmp/src.cxx:4: error: expected `;' before ‘handle’
  145. /opt/local/var/macports/build/_opt_local_var_macports_sources_rsync.macports.org_release_tarballs_ports_science_gnuradio/gnuradio/work/build/CMakeFiles/CMakeTmp/src.cxx:6: error: ‘LPCTSTR’ was not declared in this scope
  146. /opt/local/var/macports/build/_opt_local_var_macports_sources_rsync.macports.org_release_tarballs_ports_science_gnuradio/gnuradio/work/build/CMakeFiles/CMakeTmp/src.cxx:6: error: expected `;' before ‘lpName’
  147. /opt/local/var/macports/build/_opt_local_var_macports_sources_rsync.macports.org_release_tarballs_ports_science_gnuradio/gnuradio/work/build/CMakeFiles/CMakeTmp/src.cxx:7: error: ‘handle’ was not declared in this scope
  148. /opt/local/var/macports/build/_opt_local_var_macports_sources_rsync.macports.org_release_tarballs_ports_science_gnuradio/gnuradio/work/build/CMakeFiles/CMakeTmp/src.cxx:8: error:INVALID_HANDLE_VALUE’ was not declared in this scope
  149. /opt/local/var/macports/build/_opt_local_var_macports_sources_rsync.macports.org_release_tarballs_ports_science_gnuradio/gnuradio/work/build/CMakeFiles/CMakeTmp/src.cxx:9: error:NULL’ was not declared in this scope
  150. /opt/local/var/macports/build/_opt_local_var_macports_sources_rsync.macports.org_release_tarballs_ports_science_gnuradio/gnuradio/work/build/CMakeFiles/CMakeTmp/src.cxx:10: error:PAGE_READWRITE’ was not declared in this scope
  151. /opt/local/var/macports/build/_opt_local_var_macports_sources_rsync.macports.org_release_tarballs_ports_science_gnuradio/gnuradio/work/build/CMakeFiles/CMakeTmp/src.cxx:13: error: ‘lpName’ was not declared in this scope
  152. /opt/local/var/macports/build/_opt_local_var_macports_sources_rsync.macports.org_release_tarballs_ports_science_gnuradio/gnuradio/work/build/CMakeFiles/CMakeTmp/src.cxx:13: error:CreateFileMapping’ was not declared in this scope
  153. CMakeFiles/cmTryCompileExec4161648589.dir/build.make:57: recipe for target 'CMakeFiles/cmTryCompileExec4161648589.dir/src.cxx.o' failed
  154. gmake[1]: Leaving directory '/opt/local/var/macports/build/_opt_local_var_macports_sources_rsync.macports.org_release_tarballs_ports_science_gnuradio/gnuradio/work/build/CMakeFiles/CMakeTmp'
  155. gmake[1]: *** [CMakeFiles/cmTryCompileExec4161648589.dir/src.cxx.o] Error 1
  156. Makefile:117: recipe for target 'cmTryCompileExec4161648589/fast' failed
  157. gmake: *** [cmTryCompileExec4161648589/fast] Error 2
  158.  
  159. Source file was:
  160.  
  161.     #include <windows.h>
  162.     int main(){
  163.         HANDLE handle;
  164.         int size;
  165.         LPCTSTR lpName;
  166.         handle = CreateFileMapping(
  167.                          INVALID_HANDLE_VALUE,    // use paging file
  168.                          NULL,                    // default security
  169.                          PAGE_READWRITE,          // read/write access
  170.                          0,                       // max. object size
  171.                          size,                    // buffer size
  172.                          lpName);                 // name of mapping object
  173.         return 0;
  174.     }
  175. Performing C++ SOURCE FILE Test HAVE_SHM_OPEN failed with the following output:
  176. Change Dir: /opt/local/var/macports/build/_opt_local_var_macports_sources_rsync.macports.org_release_tarballs_ports_science_gnuradio/gnuradio/work/build/CMakeFiles/CMakeTmp
  177.  
  178. Run Build Command:"/opt/local/bin/gmake" "cmTryCompileExec2213549167/fast"
  179. /opt/local/bin/gmake -f CMakeFiles/cmTryCompileExec2213549167.dir/build.make CMakeFiles/cmTryCompileExec2213549167.dir/build
  180. gmake[1]: Entering directory '/opt/local/var/macports/build/_opt_local_var_macports_sources_rsync.macports.org_release_tarballs_ports_science_gnuradio/gnuradio/work/build/CMakeFiles/CMakeTmp'
  181. /opt/local/bin/cmake -E cmake_progress_report /opt/local/var/macports/build/_opt_local_var_macports_sources_rsync.macports.org_release_tarballs_ports_science_gnuradio/gnuradio/work/build/CMakeFiles/CMakeTmp/CMakeFiles 1
  182. Building CXX object CMakeFiles/cmTryCompileExec2213549167.dir/src.cxx.o
  183. /Developer/usr/bin/g++-4.2    -pipe -Os -arch x86_64  -fvisibility=hidden -Wsign-compare -Wall -Wno-uninitialized -DHAVE_SHM_OPEN -arch x86_64 -mmacosx-version-min=10.6   -o CMakeFiles/cmTryCompileExec2213549167.dir/src.cxx.o -c /opt/local/var/macports/build/_opt_local_var_macports_sources_rsync.macports.org_release_tarballs_ports_science_gnuradio/gnuradio/work/build/CMakeFiles/CMakeTmp/src.cxx
  184. Linking CXX executable cmTryCompileExec2213549167
  185. /opt/local/bin/cmake -E cmake_link_script CMakeFiles/cmTryCompileExec2213549167.dir/link.txt --verbose=1
  186. /Developer/usr/bin/g++-4.2   -pipe -Os -arch x86_64  -fvisibility=hidden -Wsign-compare -Wall -Wno-uninitialized -DHAVE_SHM_OPEN -arch x86_64 -mmacosx-version-min=10.6 -Wl,-search_paths_first -Wl,-headerpad_max_install_names  -Wl,-headerpad_max_install_names -arch x86_64  CMakeFiles/cmTryCompileExec2213549167.dir/src.cxx.o  -o cmTryCompileExec2213549167  -lrt
  187. ld: library not found for -lrt
  188. collect2: ld returned 1 exit status
  189. CMakeFiles/cmTryCompileExec2213549167.dir/build.make:88: recipe for target 'cmTryCompileExec2213549167' failed
  190. gmake[1]: *** [cmTryCompileExec2213549167] Error 1
  191. gmake[1]: Leaving directory '/opt/local/var/macports/build/_opt_local_var_macports_sources_rsync.macports.org_release_tarballs_ports_science_gnuradio/gnuradio/work/build/CMakeFiles/CMakeTmp'
  192. Makefile:117: recipe for target 'cmTryCompileExec2213549167/fast' failed
  193. gmake: *** [cmTryCompileExec2213549167/fast] Error 2
  194.  
  195. Source file was:
  196.  
  197.     #include <sys/types.h>
  198.     #include <sys/mman.h>
  199.     int main(){shm_open(0, 0, 0); return 0;}
  200.    
  201. Performing C++ SOURCE FILE Test HAVE_SINCOS failed with the following output:
  202. Change Dir: /opt/local/var/macports/build/_opt_local_var_macports_sources_rsync.macports.org_release_tarballs_ports_science_gnuradio/gnuradio/work/build/CMakeFiles/CMakeTmp
  203.  
  204. Run Build Command:"/opt/local/bin/gmake" "cmTryCompileExec2519986933/fast"
  205. /opt/local/bin/gmake -f CMakeFiles/cmTryCompileExec2519986933.dir/build.make CMakeFiles/cmTryCompileExec2519986933.dir/build
  206. gmake[1]: Entering directory '/opt/local/var/macports/build/_opt_local_var_macports_sources_rsync.macports.org_release_tarballs_ports_science_gnuradio/gnuradio/work/build/CMakeFiles/CMakeTmp'
  207. /opt/local/bin/cmake -E cmake_progress_report /opt/local/var/macports/build/_opt_local_var_macports_sources_rsync.macports.org_release_tarballs_ports_science_gnuradio/gnuradio/work/build/CMakeFiles/CMakeTmp/CMakeFiles 1
  208. Building CXX object CMakeFiles/cmTryCompileExec2519986933.dir/src.cxx.o
  209. /Developer/usr/bin/g++-4.2    -pipe -Os -arch x86_64  -fvisibility=hidden -Wsign-compare -Wall -Wno-uninitialized -DHAVE_SINCOS -arch x86_64 -mmacosx-version-min=10.6   -o CMakeFiles/cmTryCompileExec2519986933.dir/src.cxx.o -c /opt/local/var/macports/build/_opt_local_var_macports_sources_rsync.macports.org_release_tarballs_ports_science_gnuradio/gnuradio/work/build/CMakeFiles/CMakeTmp/src.cxx
  210. /opt/local/var/macports/build/_opt_local_var_macports_sources_rsync.macports.org_release_tarballs_ports_science_gnuradio/gnuradio/work/build/CMakeFiles/CMakeTmp/src.cxx: In function ‘int main()’:
  211. /opt/local/var/macports/build/_opt_local_var_macports_sources_rsync.macports.org_release_tarballs_ports_science_gnuradio/gnuradio/work/build/CMakeFiles/CMakeTmp/src.cxx:4: error: ‘sincos’ was not declared in this scope
  212. CMakeFiles/cmTryCompileExec2519986933.dir/build.make:57: recipe for target 'CMakeFiles/cmTryCompileExec2519986933.dir/src.cxx.o' failed
  213. gmake[1]: *** [CMakeFiles/cmTryCompileExec2519986933.dir/src.cxx.o] Error 1
  214. gmake[1]: Leaving directory '/opt/local/var/macports/build/_opt_local_var_macports_sources_rsync.macports.org_release_tarballs_ports_science_gnuradio/gnuradio/work/build/CMakeFiles/CMakeTmp'
  215. Makefile:117: recipe for target 'cmTryCompileExec2519986933/fast' failed
  216. gmake: *** [cmTryCompileExec2519986933/fast] Error 2
  217.  
  218. Source file was:
  219.  
  220.     #define _GNU_SOURCE
  221.     #include <math.h>
  222.     int main(){double x, sin, cos; sincos(x, &sin, &cos); return 0;}
  223.    
  224. Performing C++ SOURCE FILE Test HAVE_SINCOSF failed with the following output:
  225. Change Dir: /opt/local/var/macports/build/_opt_local_var_macports_sources_rsync.macports.org_release_tarballs_ports_science_gnuradio/gnuradio/work/build/CMakeFiles/CMakeTmp
  226.  
  227. Run Build Command:"/opt/local/bin/gmake" "cmTryCompileExec2886925019/fast"
  228. /opt/local/bin/gmake -f CMakeFiles/cmTryCompileExec2886925019.dir/build.make CMakeFiles/cmTryCompileExec2886925019.dir/build
  229. gmake[1]: Entering directory '/opt/local/var/macports/build/_opt_local_var_macports_sources_rsync.macports.org_release_tarballs_ports_science_gnuradio/gnuradio/work/build/CMakeFiles/CMakeTmp'
  230. /opt/local/bin/cmake -E cmake_progress_report /opt/local/var/macports/build/_opt_local_var_macports_sources_rsync.macports.org_release_tarballs_ports_science_gnuradio/gnuradio/work/build/CMakeFiles/CMakeTmp/CMakeFiles 1
  231. Building CXX object CMakeFiles/cmTryCompileExec2886925019.dir/src.cxx.o
  232. /Developer/usr/bin/g++-4.2    -pipe -Os -arch x86_64  -fvisibility=hidden -Wsign-compare -Wall -Wno-uninitialized -DHAVE_SINCOSF -arch x86_64 -mmacosx-version-min=10.6   -o CMakeFiles/cmTryCompileExec2886925019.dir/src.cxx.o -c /opt/local/var/macports/build/_opt_local_var_macports_sources_rsync.macports.org_release_tarballs_ports_science_gnuradio/gnuradio/work/build/CMakeFiles/CMakeTmp/src.cxx
  233. /opt/local/var/macports/build/_opt_local_var_macports_sources_rsync.macports.org_release_tarballs_ports_science_gnuradio/gnuradio/work/build/CMakeFiles/CMakeTmp/src.cxx: In function ‘int main()’:
  234. /opt/local/var/macports/build/_opt_local_var_macports_sources_rsync.macports.org_release_tarballs_ports_science_gnuradio/gnuradio/work/build/CMakeFiles/CMakeTmp/src.cxx:4: error: ‘sincosf’ was not declared in this scope
  235. CMakeFiles/cmTryCompileExec2886925019.dir/build.make:57: recipe for target 'CMakeFiles/cmTryCompileExec2886925019.dir/src.cxx.o' failed
  236. gmake[1]: *** [CMakeFiles/cmTryCompileExec2886925019.dir/src.cxx.o] Error 1
  237. gmake[1]: Leaving directory '/opt/local/var/macports/build/_opt_local_var_macports_sources_rsync.macports.org_release_tarballs_ports_science_gnuradio/gnuradio/work/build/CMakeFiles/CMakeTmp'
  238. Makefile:117: recipe for target 'cmTryCompileExec2886925019/fast' failed
  239. gmake: *** [cmTryCompileExec2886925019/fast] Error 2
  240.  
  241. Source file was:
  242.  
  243.     #define _GNU_SOURCE
  244.     #include <math.h>
  245.     int main(){float x, sin, cos; sincosf(x, &sin, &cos); return 0;}
  246.    
  247. Performing C++ SOURCE FILE Test HAVE_SCHED_SETSCHEDULER failed with the following output:
  248. Change Dir: /opt/local/var/macports/build/_opt_local_var_macports_sources_rsync.macports.org_release_tarballs_ports_science_gnuradio/gnuradio/work/build/CMakeFiles/CMakeTmp
  249.  
  250. Run Build Command:"/opt/local/bin/gmake" "cmTryCompileExec3055093407/fast"
  251. /opt/local/bin/gmake -f CMakeFiles/cmTryCompileExec3055093407.dir/build.make CMakeFiles/cmTryCompileExec3055093407.dir/build
  252. gmake[1]: Entering directory '/opt/local/var/macports/build/_opt_local_var_macports_sources_rsync.macports.org_release_tarballs_ports_science_gnuradio/gnuradio/work/build/CMakeFiles/CMakeTmp'
  253. /opt/local/bin/cmake -E cmake_progress_report /opt/local/var/macports/build/_opt_local_var_macports_sources_rsync.macports.org_release_tarballs_ports_science_gnuradio/gnuradio/work/build/CMakeFiles/CMakeTmp/CMakeFiles 1
  254. Building CXX object CMakeFiles/cmTryCompileExec3055093407.dir/src.cxx.o
  255. /Developer/usr/bin/g++-4.2    -pipe -Os -arch x86_64  -fvisibility=hidden -Wsign-compare -Wall -Wno-uninitialized -DHAVE_SCHED_SETSCHEDULER -arch x86_64 -mmacosx-version-min=10.6   -o CMakeFiles/cmTryCompileExec3055093407.dir/src.cxx.o -c /opt/local/var/macports/build/_opt_local_var_macports_sources_rsync.macports.org_release_tarballs_ports_science_gnuradio/gnuradio/work/build/CMakeFiles/CMakeTmp/src.cxx
  256. /opt/local/var/macports/build/_opt_local_var_macports_sources_rsync.macports.org_release_tarballs_ports_science_gnuradio/gnuradio/work/build/CMakeFiles/CMakeTmp/src.cxx: In function ‘int main()’:
  257. /opt/local/var/macports/build/_opt_local_var_macports_sources_rsync.macports.org_release_tarballs_ports_science_gnuradio/gnuradio/work/build/CMakeFiles/CMakeTmp/src.cxx:4: error: ‘pid_t’ was not declared in this scope
  258. /opt/local/var/macports/build/_opt_local_var_macports_sources_rsync.macports.org_release_tarballs_ports_science_gnuradio/gnuradio/work/build/CMakeFiles/CMakeTmp/src.cxx:4: error: expected `;' before ‘pid’
  259. /opt/local/var/macports/build/_opt_local_var_macports_sources_rsync.macports.org_release_tarballs_ports_science_gnuradio/gnuradio/work/build/CMakeFiles/CMakeTmp/src.cxx:5: error: ‘pid’ was not declared in this scope
  260. /opt/local/var/macports/build/_opt_local_var_macports_sources_rsync.macports.org_release_tarballs_ports_science_gnuradio/gnuradio/work/build/CMakeFiles/CMakeTmp/src.cxx:5: error: ‘sched_setscheduler’ was not declared in this scope
  261. CMakeFiles/cmTryCompileExec3055093407.dir/build.make:57: recipe for target 'CMakeFiles/cmTryCompileExec3055093407.dir/src.cxx.o' failed
  262. gmake[1]: *** [CMakeFiles/cmTryCompileExec3055093407.dir/src.cxx.o] Error 1
  263. gmake[1]: Leaving directory '/opt/local/var/macports/build/_opt_local_var_macports_sources_rsync.macports.org_release_tarballs_ports_science_gnuradio/gnuradio/work/build/CMakeFiles/CMakeTmp'
  264. Makefile:117: recipe for target 'cmTryCompileExec3055093407/fast' failed
  265. gmake: *** [cmTryCompileExec3055093407/fast] Error 2
  266.  
  267. Source file was:
  268.  
  269.        #include <sched.h>
  270.        int main(){
  271.            pid_t pid;
  272.            sched_setscheduler(pid, 0, 0);
  273.            return 0;
  274.        }
  275. Determining if the include file windows.h exists failed with the following output:
  276. Change Dir: /opt/local/var/macports/build/_opt_local_var_macports_sources_rsync.macports.org_release_tarballs_ports_science_gnuradio/gnuradio/work/build/CMakeFiles/CMakeTmp
  277.  
  278. Run Build Command:"/opt/local/bin/gmake" "cmTryCompileExec1384243177/fast"
  279. /opt/local/bin/gmake -f CMakeFiles/cmTryCompileExec1384243177.dir/build.make CMakeFiles/cmTryCompileExec1384243177.dir/build
  280. gmake[1]: Entering directory '/opt/local/var/macports/build/_opt_local_var_macports_sources_rsync.macports.org_release_tarballs_ports_science_gnuradio/gnuradio/work/build/CMakeFiles/CMakeTmp'
  281. /opt/local/bin/cmake -E cmake_progress_report /opt/local/var/macports/build/_opt_local_var_macports_sources_rsync.macports.org_release_tarballs_ports_science_gnuradio/gnuradio/work/build/CMakeFiles/CMakeTmp/CMakeFiles 1
  282. Building CXX object CMakeFiles/cmTryCompileExec1384243177.dir/CheckIncludeFile.cxx.o
  283. /Developer/usr/bin/g++-4.2    -pipe -Os -arch x86_64  -fvisibility=hidden -Wsign-compare -Wall -Wno-uninitialized  -arch x86_64 -mmacosx-version-min=10.6   -o CMakeFiles/cmTryCompileExec1384243177.dir/CheckIncludeFile.cxx.o -c /opt/local/var/macports/build/_opt_local_var_macports_sources_rsync.macports.org_release_tarballs_ports_science_gnuradio/gnuradio/work/build/CMakeFiles/CMakeTmp/CheckIncludeFile.cxx
  284. /opt/local/var/macports/build/_opt_local_var_macports_sources_rsync.macports.org_release_tarballs_ports_science_gnuradio/gnuradio/work/build/CMakeFiles/CMakeTmp/CheckIncludeFile.cxx:1:21: error: windows.h: No such file or directory
  285. CMakeFiles/cmTryCompileExec1384243177.dir/build.make:57: recipe for target 'CMakeFiles/cmTryCompileExec1384243177.dir/CheckIncludeFile.cxx.o' failed
  286. gmake[1]: Leaving directory '/opt/local/var/macports/build/_opt_local_var_macports_sources_rsync.macports.org_release_tarballs_ports_science_gnuradio/gnuradio/work/build/CMakeFiles/CMakeTmp'
  287. gmake[1]: *** [CMakeFiles/cmTryCompileExec1384243177.dir/CheckIncludeFile.cxx.o] Error 1
  288. Makefile:117: recipe for target 'cmTryCompileExec1384243177/fast' failed
  289. gmake: *** [cmTryCompileExec1384243177/fast] Error 2
  290.  
  291.  
  292. Performing C++ SOURCE FILE Test HAVE_WNO_UNUSED_BUT_SET_VARIABLE failed with the following output:
  293. Change Dir: /opt/local/var/macports/build/_opt_local_var_macports_sources_rsync.macports.org_release_tarballs_ports_science_gnuradio/gnuradio/work/build/CMakeFiles/CMakeTmp
  294.  
  295. Run Build Command:"/opt/local/bin/gmake" "cmTryCompileExec502826975/fast"
  296. /opt/local/bin/gmake -f CMakeFiles/cmTryCompileExec502826975.dir/build.make CMakeFiles/cmTryCompileExec502826975.dir/build
  297. gmake[1]: Entering directory '/opt/local/var/macports/build/_opt_local_var_macports_sources_rsync.macports.org_release_tarballs_ports_science_gnuradio/gnuradio/work/build/CMakeFiles/CMakeTmp'
  298. /opt/local/bin/cmake -E cmake_progress_report /opt/local/var/macports/build/_opt_local_var_macports_sources_rsync.macports.org_release_tarballs_ports_science_gnuradio/gnuradio/work/build/CMakeFiles/CMakeTmp/CMakeFiles 1
  299. Building CXX object CMakeFiles/cmTryCompileExec502826975.dir/src.cxx.o
  300. /Developer/usr/bin/g++-4.2    -pipe -Os -arch x86_64  -fvisibility=hidden -Wsign-compare -Wall -Wno-uninitialized -DHAVE_WNO_UNUSED_BUT_SET_VARIABLE -arch x86_64 -mmacosx-version-min=10.6   -Wno-unused-but-set-variable -o CMakeFiles/cmTryCompileExec502826975.dir/src.cxx.o -c /opt/local/var/macports/build/_opt_local_var_macports_sources_rsync.macports.org_release_tarballs_ports_science_gnuradio/gnuradio/work/build/CMakeFiles/CMakeTmp/src.cxx
  301. cc1plus: error: unrecognized command line option "-Wno-unused-but-set-variable"
  302. CMakeFiles/cmTryCompileExec502826975.dir/build.make:57: recipe for target 'CMakeFiles/cmTryCompileExec502826975.dir/src.cxx.o' failed
  303. gmake[1]: *** [CMakeFiles/cmTryCompileExec502826975.dir/src.cxx.o] Error 1
  304. gmake[1]: Leaving directory '/opt/local/var/macports/build/_opt_local_var_macports_sources_rsync.macports.org_release_tarballs_ports_science_gnuradio/gnuradio/work/build/CMakeFiles/CMakeTmp'
  305. Makefile:117: recipe for target 'cmTryCompileExec502826975/fast' failed
  306. gmake: *** [cmTryCompileExec502826975/fast] Error 2
  307.  
  308. Source file was:
  309. int main() { return 0; }
RAW Paste Data

Adblocker detected! Please consider disabling it...

We've detected AdBlock Plus or some other adblocking software preventing Pastebin.com from fully loading.

We don't have any obnoxious sound, or popup ads, we actively block these annoying types of ads!

Please add Pastebin.com to your ad blocker whitelist or disable your adblocking software.

×