Guest User

openCV building from source [Failed]

a guest
Feb 14th, 2021
28
Never
Not a member of Pastebin yet? Sign Up, it unlocks many cool features!
  1. sam@sam-Base:~/sam/download$ git clone https://github.com/opencv/opencv.git
  2. Cloning into 'opencv'...
  3. remote: Enumerating objects: 7, done.
  4. remote: Counting objects: 100% (7/7), done.
  5. remote: Compressing objects: 100% (6/6), done.
  6. Receiving objects: 100% (287286/287286), 476.98 MiB | 7.72 MiB/s, done.
  7. remote: Total 287286 (delta 1), reused 5 (delta 1), pack-reused 287279
  8. Resolving deltas: 100% (200698/200698), done.
  9. Updating files: 100% (6726/6726), done.
  10. sam@sam-Base:~/sam/download$ cd opencv/
  11. sam@sam-Base:~/sam/download/opencv$ ls
  12. 3rdparty apps cmake CMakeLists.txt CONTRIBUTING.md COPYRIGHT data doc include LICENSE modules platforms README.md samples SECURITY.md
  13. sam@sam-Base:~/sam/download/opencv$ mkdir build
  14. sam@sam-Base:~/sam/download/opencv$ cd build/
  15. sam@sam-Base:~/sam/download/opencv/build$ cmake {...} -DPYTHON_DEFAULT_EXECUTABLE=$(which python3) ../
  16. -- The CXX compiler identification is GNU 9.3.0
  17. -- The C compiler identification is GNU 9.3.0
  18. -- Check for working CXX compiler: /usr/bin/c++
  19. -- Check for working CXX compiler: /usr/bin/c++ -- works
  20. -- Detecting CXX compiler ABI info
  21. -- Detecting CXX compiler ABI info - done
  22. -- Detecting CXX compile features
  23. -- Detecting CXX compile features - done
  24. -- Check for working C compiler: /usr/bin/cc
  25. -- Check for working C compiler: /usr/bin/cc -- works
  26. -- Detecting C compiler ABI info
  27. -- Detecting C compiler ABI info - done
  28. -- Detecting C compile features
  29. -- Detecting C compile features - done
  30. -- Detected processor: x86_64
  31. -- Found PythonInterp: /usr/bin/python2.7 (found suitable version "2.7.18", minimum required is "2.7")
  32. -- Found PythonLibs: /usr/lib/x86_64-linux-gnu/libpython2.7.so (found suitable exact version "2.7.18")
  33. -- Found PythonInterp: /usr/bin/python3 (found suitable version "3.8.5", minimum required is "3.2")
  34. -- Found PythonLibs: /usr/lib/x86_64-linux-gnu/libpython3.8.so (found suitable exact version "3.8.5")
  35. -- Looking for ccache - not found
  36. -- Performing Test HAVE_CXX_FSIGNED_CHAR
  37. -- Performing Test HAVE_CXX_FSIGNED_CHAR - Success
  38. -- Performing Test HAVE_C_FSIGNED_CHAR
  39. -- Performing Test HAVE_C_FSIGNED_CHAR - Success
  40. -- Performing Test HAVE_CXX_W
  41. -- Performing Test HAVE_CXX_W - Success
  42. -- Performing Test HAVE_C_W
  43. -- Performing Test HAVE_C_W - Success
  44. -- Performing Test HAVE_CXX_WALL
  45. -- Performing Test HAVE_CXX_WALL - Success
  46. -- Performing Test HAVE_C_WALL
  47. -- Performing Test HAVE_C_WALL - Success
  48. -- Performing Test HAVE_CXX_WERROR_RETURN_TYPE
  49. -- Performing Test HAVE_CXX_WERROR_RETURN_TYPE - Success
  50. -- Performing Test HAVE_C_WERROR_RETURN_TYPE
  51. -- Performing Test HAVE_C_WERROR_RETURN_TYPE - Success
  52. -- Performing Test HAVE_CXX_WERROR_NON_VIRTUAL_DTOR
  53. -- Performing Test HAVE_CXX_WERROR_NON_VIRTUAL_DTOR - Success
  54. -- Performing Test HAVE_C_WERROR_NON_VIRTUAL_DTOR
  55. -- Performing Test HAVE_C_WERROR_NON_VIRTUAL_DTOR - Failed
  56. -- Performing Test HAVE_CXX_WERROR_ADDRESS
  57. -- Performing Test HAVE_CXX_WERROR_ADDRESS - Success
  58. -- Performing Test HAVE_C_WERROR_ADDRESS
  59. -- Performing Test HAVE_C_WERROR_ADDRESS - Success
  60. -- Performing Test HAVE_CXX_WERROR_SEQUENCE_POINT
  61. -- Performing Test HAVE_CXX_WERROR_SEQUENCE_POINT - Success
  62. -- Performing Test HAVE_C_WERROR_SEQUENCE_POINT
  63. -- Performing Test HAVE_C_WERROR_SEQUENCE_POINT - Success
  64. -- Performing Test HAVE_CXX_WFORMAT
  65. -- Performing Test HAVE_CXX_WFORMAT - Success
  66. -- Performing Test HAVE_C_WFORMAT
  67. -- Performing Test HAVE_C_WFORMAT - Success
  68. -- Performing Test HAVE_CXX_WERROR_FORMAT_SECURITY
  69. -- Performing Test HAVE_CXX_WERROR_FORMAT_SECURITY - Success
  70. -- Performing Test HAVE_C_WERROR_FORMAT_SECURITY
  71. -- Performing Test HAVE_C_WERROR_FORMAT_SECURITY - Success
  72. -- Performing Test HAVE_CXX_WMISSING_DECLARATIONS
  73. -- Performing Test HAVE_CXX_WMISSING_DECLARATIONS - Success
  74. -- Performing Test HAVE_C_WMISSING_DECLARATIONS
  75. -- Performing Test HAVE_C_WMISSING_DECLARATIONS - Success
  76. -- Performing Test HAVE_CXX_WMISSING_PROTOTYPES
  77. -- Performing Test HAVE_CXX_WMISSING_PROTOTYPES - Failed
  78. -- Performing Test HAVE_C_WMISSING_PROTOTYPES
  79. -- Performing Test HAVE_C_WMISSING_PROTOTYPES - Success
  80. -- Performing Test HAVE_CXX_WSTRICT_PROTOTYPES
  81. -- Performing Test HAVE_CXX_WSTRICT_PROTOTYPES - Failed
  82. -- Performing Test HAVE_C_WSTRICT_PROTOTYPES
  83. -- Performing Test HAVE_C_WSTRICT_PROTOTYPES - Success
  84. -- Performing Test HAVE_CXX_WUNDEF
  85. -- Performing Test HAVE_CXX_WUNDEF - Success
  86. -- Performing Test HAVE_C_WUNDEF
  87. -- Performing Test HAVE_C_WUNDEF - Success
  88. -- Performing Test HAVE_CXX_WINIT_SELF
  89. -- Performing Test HAVE_CXX_WINIT_SELF - Success
  90. -- Performing Test HAVE_C_WINIT_SELF
  91. -- Performing Test HAVE_C_WINIT_SELF - Success
  92. -- Performing Test HAVE_CXX_WPOINTER_ARITH
  93. -- Performing Test HAVE_CXX_WPOINTER_ARITH - Success
  94. -- Performing Test HAVE_C_WPOINTER_ARITH
  95. -- Performing Test HAVE_C_WPOINTER_ARITH - Success
  96. -- Performing Test HAVE_CXX_WSHADOW
  97. -- Performing Test HAVE_CXX_WSHADOW - Success
  98. -- Performing Test HAVE_C_WSHADOW
  99. -- Performing Test HAVE_C_WSHADOW - Success
  100. -- Performing Test HAVE_CXX_WSIGN_PROMO
  101. -- Performing Test HAVE_CXX_WSIGN_PROMO - Success
  102. -- Performing Test HAVE_C_WSIGN_PROMO
  103. -- Performing Test HAVE_C_WSIGN_PROMO - Failed
  104. -- Performing Test HAVE_CXX_WUNINITIALIZED
  105. -- Performing Test HAVE_CXX_WUNINITIALIZED - Success
  106. -- Performing Test HAVE_C_WUNINITIALIZED
  107. -- Performing Test HAVE_C_WUNINITIALIZED - Success
  108. -- Performing Test HAVE_CXX_WSUGGEST_OVERRIDE
  109. -- Performing Test HAVE_CXX_WSUGGEST_OVERRIDE - Success
  110. -- Performing Test HAVE_C_WSUGGEST_OVERRIDE
  111. -- Performing Test HAVE_C_WSUGGEST_OVERRIDE - Failed
  112. -- Performing Test HAVE_CXX_WNO_DELETE_NON_VIRTUAL_DTOR
  113. -- Performing Test HAVE_CXX_WNO_DELETE_NON_VIRTUAL_DTOR - Success
  114. -- Performing Test HAVE_C_WNO_DELETE_NON_VIRTUAL_DTOR
  115. -- Performing Test HAVE_C_WNO_DELETE_NON_VIRTUAL_DTOR - Failed
  116. -- Performing Test HAVE_CXX_WNO_UNNAMED_TYPE_TEMPLATE_ARGS
  117. -- Performing Test HAVE_CXX_WNO_UNNAMED_TYPE_TEMPLATE_ARGS - Failed
  118. -- Performing Test HAVE_C_WNO_UNNAMED_TYPE_TEMPLATE_ARGS
  119. -- Performing Test HAVE_C_WNO_UNNAMED_TYPE_TEMPLATE_ARGS - Failed
  120. -- Performing Test HAVE_CXX_WNO_COMMENT
  121. -- Performing Test HAVE_CXX_WNO_COMMENT - Success
  122. -- Performing Test HAVE_C_WNO_COMMENT
  123. -- Performing Test HAVE_C_WNO_COMMENT - Success
  124. -- Performing Test HAVE_CXX_WIMPLICIT_FALLTHROUGH_3
  125. -- Performing Test HAVE_CXX_WIMPLICIT_FALLTHROUGH_3 - Success
  126. -- Performing Test HAVE_C_WIMPLICIT_FALLTHROUGH_3
  127. -- Performing Test HAVE_C_WIMPLICIT_FALLTHROUGH_3 - Success
  128. -- Performing Test HAVE_CXX_WNO_STRICT_OVERFLOW
  129. -- Performing Test HAVE_CXX_WNO_STRICT_OVERFLOW - Success
  130. -- Performing Test HAVE_C_WNO_STRICT_OVERFLOW
  131. -- Performing Test HAVE_C_WNO_STRICT_OVERFLOW - Success
  132. -- Performing Test HAVE_CXX_FDIAGNOSTICS_SHOW_OPTION
  133. -- Performing Test HAVE_CXX_FDIAGNOSTICS_SHOW_OPTION - Success
  134. -- Performing Test HAVE_C_FDIAGNOSTICS_SHOW_OPTION
  135. -- Performing Test HAVE_C_FDIAGNOSTICS_SHOW_OPTION - Success
  136. -- Performing Test HAVE_CXX_WNO_LONG_LONG
  137. -- Performing Test HAVE_CXX_WNO_LONG_LONG - Success
  138. -- Performing Test HAVE_C_WNO_LONG_LONG
  139. -- Performing Test HAVE_C_WNO_LONG_LONG - Success
  140. -- Performing Test HAVE_CXX_PTHREAD
  141. -- Performing Test HAVE_CXX_PTHREAD - Success
  142. -- Performing Test HAVE_C_PTHREAD
  143. -- Performing Test HAVE_C_PTHREAD - Success
  144. -- Performing Test HAVE_CXX_FOMIT_FRAME_POINTER
  145. -- Performing Test HAVE_CXX_FOMIT_FRAME_POINTER - Success
  146. -- Performing Test HAVE_C_FOMIT_FRAME_POINTER
  147. -- Performing Test HAVE_C_FOMIT_FRAME_POINTER - Success
  148. -- Performing Test HAVE_CXX_FFUNCTION_SECTIONS
  149. -- Performing Test HAVE_CXX_FFUNCTION_SECTIONS - Success
  150. -- Performing Test HAVE_C_FFUNCTION_SECTIONS
  151. -- Performing Test HAVE_C_FFUNCTION_SECTIONS - Success
  152. -- Performing Test HAVE_CXX_FDATA_SECTIONS
  153. -- Performing Test HAVE_CXX_FDATA_SECTIONS - Success
  154. -- Performing Test HAVE_C_FDATA_SECTIONS
  155. -- Performing Test HAVE_C_FDATA_SECTIONS - Success
  156. -- Performing Test HAVE_CXX_MSSE (check file: cmake/checks/cpu_sse.cpp)
  157. -- Performing Test HAVE_CXX_MSSE - Success
  158. -- Performing Test HAVE_CXX_MSSE2 (check file: cmake/checks/cpu_sse2.cpp)
  159. -- Performing Test HAVE_CXX_MSSE2 - Success
  160. -- Performing Test HAVE_CXX_MSSE3 (check file: cmake/checks/cpu_sse3.cpp)
  161. -- Performing Test HAVE_CXX_MSSE3 - Success
  162. -- Performing Test HAVE_CXX_MSSSE3 (check file: cmake/checks/cpu_ssse3.cpp)
  163. -- Performing Test HAVE_CXX_MSSSE3 - Success
  164. -- Performing Test HAVE_CXX_MSSE4_1 (check file: cmake/checks/cpu_sse41.cpp)
  165. -- Performing Test HAVE_CXX_MSSE4_1 - Success
  166. -- Performing Test HAVE_CXX_MPOPCNT (check file: cmake/checks/cpu_popcnt.cpp)
  167. -- Performing Test HAVE_CXX_MPOPCNT - Success
  168. -- Performing Test HAVE_CXX_MSSE4_2 (check file: cmake/checks/cpu_sse42.cpp)
  169. -- Performing Test HAVE_CXX_MSSE4_2 - Success
  170. -- Performing Test HAVE_CXX_MF16C (check file: cmake/checks/cpu_fp16.cpp)
  171. -- Performing Test HAVE_CXX_MF16C - Success
  172. -- Performing Test HAVE_CXX_MFMA
  173. -- Performing Test HAVE_CXX_MFMA - Success
  174. -- Performing Test HAVE_CXX_MAVX (check file: cmake/checks/cpu_avx.cpp)
  175. -- Performing Test HAVE_CXX_MAVX - Success
  176. -- Performing Test HAVE_CXX_MAVX2 (check file: cmake/checks/cpu_avx2.cpp)
  177. -- Performing Test HAVE_CXX_MAVX2 - Success
  178. -- Performing Test HAVE_CXX_MAVX512F (check file: cmake/checks/cpu_avx512.cpp)
  179. -- Performing Test HAVE_CXX_MAVX512F - Success
  180. -- Performing Test HAVE_CXX_MAVX512F_MAVX512CD (check file: cmake/checks/cpu_avx512common.cpp)
  181. -- Performing Test HAVE_CXX_MAVX512F_MAVX512CD - Success
  182. -- Performing Test HAVE_CXX_MAVX512F_MAVX512CD_MAVX512VL_MAVX512BW_MAVX512DQ (check file: cmake/checks/cpu_avx512skx.cpp)
  183. -- Performing Test HAVE_CXX_MAVX512F_MAVX512CD_MAVX512VL_MAVX512BW_MAVX512DQ - Success
  184. -- Performing Test HAVE_CPU_BASELINE_FLAGS
  185. -- Performing Test HAVE_CPU_BASELINE_FLAGS - Success
  186. -- Performing Test HAVE_CPU_DISPATCH_FLAGS_SSE4_1
  187. -- Performing Test HAVE_CPU_DISPATCH_FLAGS_SSE4_1 - Success
  188. -- Performing Test HAVE_CPU_DISPATCH_FLAGS_SSE4_2
  189. -- Performing Test HAVE_CPU_DISPATCH_FLAGS_SSE4_2 - Success
  190. -- Performing Test HAVE_CPU_DISPATCH_FLAGS_FP16
  191. -- Performing Test HAVE_CPU_DISPATCH_FLAGS_FP16 - Success
  192. -- Performing Test HAVE_CPU_DISPATCH_FLAGS_AVX
  193. -- Performing Test HAVE_CPU_DISPATCH_FLAGS_AVX - Success
  194. -- Performing Test HAVE_CPU_DISPATCH_FLAGS_AVX2
  195. -- Performing Test HAVE_CPU_DISPATCH_FLAGS_AVX2 - Success
  196. -- Performing Test HAVE_CPU_DISPATCH_FLAGS_AVX512_SKX
  197. -- Performing Test HAVE_CPU_DISPATCH_FLAGS_AVX512_SKX - Success
  198. -- Performing Test HAVE_CXX_FVISIBILITY_HIDDEN
  199. -- Performing Test HAVE_CXX_FVISIBILITY_HIDDEN - Success
  200. -- Performing Test HAVE_C_FVISIBILITY_HIDDEN
  201. -- Performing Test HAVE_C_FVISIBILITY_HIDDEN - Success
  202. -- Performing Test HAVE_CXX_FVISIBILITY_INLINES_HIDDEN
  203. -- Performing Test HAVE_CXX_FVISIBILITY_INLINES_HIDDEN - Success
  204. -- Performing Test HAVE_C_FVISIBILITY_INLINES_HIDDEN
  205. -- Performing Test HAVE_C_FVISIBILITY_INLINES_HIDDEN - Failed
  206. -- Performing Test HAVE_LINK_AS_NEEDED
  207. -- Performing Test HAVE_LINK_AS_NEEDED - Success
  208. -- Looking for pthread.h
  209. -- Looking for pthread.h - found
  210. -- Looking for posix_memalign
  211. -- Looking for posix_memalign - found
  212. -- Looking for malloc.h
  213. -- Looking for malloc.h - found
  214. -- Looking for memalign
  215. -- Looking for memalign - found
  216. -- Check if the system is big endian
  217. -- Searching 16 bit integer
  218. -- Looking for sys/types.h
  219. -- Looking for sys/types.h - found
  220. -- Looking for stdint.h
  221. -- Looking for stdint.h - found
  222. -- Looking for stddef.h
  223. -- Looking for stddef.h - found
  224. -- Check size of unsigned short
  225. -- Check size of unsigned short - done
  226. -- Using unsigned short
  227. -- Check if the system is big endian - little endian
  228. -- Found ZLIB: /usr/lib/x86_64-linux-gnu/libz.so (found suitable version "1.2.11", minimum required is "1.2.3")
  229. -- Found JPEG: /usr/lib/x86_64-linux-gnu/libjpeg.so (found version "80")
  230. -- Found TIFF: /usr/lib/x86_64-linux-gnu/libtiff.so (found version "4.1.0")
  231. -- Found WebP: /usr/lib/x86_64-linux-gnu/libwebp.so
  232. -- Could NOT find OpenJPEG (minimal suitable version: 2.0, recommended version >= 2.3.1). OpenJPEG will be built from sources
  233. -- Performing Test HAVE_C_WNO_IMPLICIT_CONST_INT_FLOAT_CONVERSION
  234. -- Performing Test HAVE_C_WNO_IMPLICIT_CONST_INT_FLOAT_CONVERSION - Failed
  235. -- OpenJPEG: VERSION = 2.3.1, BUILD = opencv-4.5.1-dev-openjp2-2.3.1
  236. -- Check if the system is big endian
  237. -- Searching 16 bit integer
  238. -- Using unsigned short
  239. -- Check if the system is big endian - little endian
  240. -- Looking for string.h
  241. -- Looking for string.h - found
  242. -- Looking for memory.h
  243. -- Looking for memory.h - found
  244. -- Looking for stdlib.h
  245. -- Looking for stdlib.h - found
  246. -- Looking for stdio.h
  247. -- Looking for stdio.h - found
  248. -- Looking for math.h
  249. -- Looking for math.h - found
  250. -- Looking for float.h
  251. -- Looking for float.h - found
  252. -- Looking for time.h
  253. -- Looking for time.h - found
  254. -- Looking for stdarg.h
  255. -- Looking for stdarg.h - found
  256. -- Looking for ctype.h
  257. -- Looking for ctype.h - found
  258. -- Looking for assert.h
  259. -- Looking for assert.h - found
  260. -- Looking for stdint.h
  261. -- Looking for stdint.h - found
  262. -- Looking for inttypes.h
  263. -- Looking for inttypes.h - found
  264. -- Looking for strings.h
  265. -- Looking for strings.h - found
  266. -- Looking for sys/stat.h
  267. -- Looking for sys/stat.h - found
  268. -- Looking for unistd.h
  269. -- Looking for unistd.h - found
  270. -- Looking for include file malloc.h
  271. -- Looking for include file malloc.h - found
  272. -- Looking for _aligned_malloc
  273. -- Looking for _aligned_malloc - not found
  274. -- Looking for posix_memalign
  275. -- Looking for posix_memalign - found
  276. -- Looking for memalign
  277. -- Looking for memalign - found
  278. -- Performing Test HAVE_C_WNO_UNDEF
  279. -- Performing Test HAVE_C_WNO_UNDEF - Success
  280. -- Performing Test HAVE_C_WNO_STRICT_PROTOTYPES
  281. -- Performing Test HAVE_C_WNO_STRICT_PROTOTYPES - Success
  282. -- Performing Test HAVE_C_WNO_CAST_FUNCTION_TYPE
  283. -- Performing Test HAVE_C_WNO_CAST_FUNCTION_TYPE - Success
  284. -- OpenJPEG libraries will be built from sources: libopenjp2 (version "2.3.1")
  285. -- Found ZLIB: /usr/lib/x86_64-linux-gnu/libz.so (found version "1.2.11")
  286. -- Found PNG: /usr/lib/x86_64-linux-gnu/libpng.so (found version "1.6.37")
  287. -- Looking for /usr/include/libpng/png.h
  288. -- Looking for /usr/include/libpng/png.h - found
  289. -- Found OpenEXR: /usr/lib/x86_64-linux-gnu/libIlmImf.so
  290. -- Checking for module 'gtk+-3.0'
  291. -- Found gtk+-3.0, version 3.24.20
  292. -- Checking for module 'gthread-2.0'
  293. -- Found gthread-2.0, version 2.64.6
  294. -- IPPICV: Download: ippicv_2020_lnx_intel64_20191018_general.tgz
  295. -- found Intel IPP (ICV version): 2020.0.0 [2020.0.0 Gold]
  296. -- at: /home/sam/sam/download/opencv/build/3rdparty/ippicv/ippicv_lnx/icv
  297. -- found Intel IPP Integration Wrappers sources: 2020.0.0
  298. -- at: /home/sam/sam/download/opencv/build/3rdparty/ippicv/ippicv_lnx/iw
  299. -- Could not find OpenBLAS include. Turning OpenBLAS_FOUND off
  300. -- Could not find OpenBLAS lib. Turning OpenBLAS_FOUND off
  301. -- Could NOT find Atlas (missing: Atlas_CLAPACK_INCLUDE_DIR)
  302. -- Looking for sgemm_
  303. -- Looking for sgemm_ - not found
  304. -- Found Threads: TRUE
  305. -- Looking for dgemm_
  306. -- Looking for dgemm_ - found
  307. -- Found BLAS: /usr/lib/x86_64-linux-gnu/libf77blas.so;/usr/lib/x86_64-linux-gnu/libatlas.so
  308. -- Looking for cheev_
  309. -- Looking for cheev_ - not found
  310. -- Looking for cheev_
  311. -- Looking for cheev_ - found
  312. -- A library with LAPACK API found.
  313. -- Performing Test HAVE_CXX_WNO_DEPRECATED
  314. -- Performing Test HAVE_CXX_WNO_DEPRECATED - Success
  315. -- Performing Test HAVE_CXX_WNO_MISSING_PROTOTYPES
  316. -- Performing Test HAVE_CXX_WNO_MISSING_PROTOTYPES - Failed
  317. -- Performing Test HAVE_CXX_WNO_MISSING_DECLARATIONS
  318. -- Performing Test HAVE_CXX_WNO_MISSING_DECLARATIONS - Success
  319. -- Performing Test HAVE_CXX_WNO_SHADOW
  320. -- Performing Test HAVE_CXX_WNO_SHADOW - Success
  321. -- Performing Test HAVE_CXX_WNO_UNUSED_PARAMETER
  322. -- Performing Test HAVE_CXX_WNO_UNUSED_PARAMETER - Success
  323. -- Performing Test HAVE_CXX_WNO_UNUSED_LOCAL_TYPEDEFS
  324. -- Performing Test HAVE_CXX_WNO_UNUSED_LOCAL_TYPEDEFS - Success
  325. -- Performing Test HAVE_CXX_WNO_SIGN_COMPARE
  326. -- Performing Test HAVE_CXX_WNO_SIGN_COMPARE - Success
  327. -- Performing Test HAVE_CXX_WNO_SIGN_PROMO
  328. -- Performing Test HAVE_CXX_WNO_SIGN_PROMO - Success
  329. -- Performing Test HAVE_CXX_WNO_UNDEF
  330. -- Performing Test HAVE_CXX_WNO_UNDEF - Success
  331. -- Performing Test HAVE_CXX_WNO_TAUTOLOGICAL_UNDEFINED_COMPARE
  332. -- Performing Test HAVE_CXX_WNO_TAUTOLOGICAL_UNDEFINED_COMPARE - Failed
  333. -- Performing Test HAVE_CXX_WNO_IGNORED_QUALIFIERS
  334. -- Performing Test HAVE_CXX_WNO_IGNORED_QUALIFIERS - Success
  335. -- Performing Test HAVE_CXX_WNO_EXTRA
  336. -- Performing Test HAVE_CXX_WNO_EXTRA - Success
  337. -- Performing Test HAVE_CXX_WNO_UNUSED_FUNCTION
  338. -- Performing Test HAVE_CXX_WNO_UNUSED_FUNCTION - Success
  339. -- Performing Test HAVE_CXX_WNO_UNUSED_CONST_VARIABLE
  340. -- Performing Test HAVE_CXX_WNO_UNUSED_CONST_VARIABLE - Success
  341. -- Performing Test HAVE_CXX_WNO_SHORTEN_64_TO_32
  342. -- Performing Test HAVE_CXX_WNO_SHORTEN_64_TO_32 - Failed
  343. -- Performing Test HAVE_CXX_WNO_INVALID_OFFSETOF
  344. -- Performing Test HAVE_CXX_WNO_INVALID_OFFSETOF - Success
  345. -- Performing Test HAVE_CXX_WNO_ENUM_COMPARE_SWITCH
  346. -- Performing Test HAVE_CXX_WNO_ENUM_COMPARE_SWITCH - Failed
  347. -- Performing Test HAVE_CXX_WNO_SUGGEST_OVERRIDE
  348. -- Performing Test HAVE_CXX_WNO_SUGGEST_OVERRIDE - Success
  349. -- Performing Test HAVE_CXX_WNO_INCONSISTENT_MISSING_OVERRIDE
  350. -- Performing Test HAVE_CXX_WNO_INCONSISTENT_MISSING_OVERRIDE - Failed
  351. -- Performing Test HAVE_CXX_WNO_IMPLICIT_FALLTHROUGH
  352. -- Performing Test HAVE_CXX_WNO_IMPLICIT_FALLTHROUGH - Success
  353. -- Performing Test HAVE_CXX_WNO_ARRAY_BOUNDS
  354. -- Performing Test HAVE_CXX_WNO_ARRAY_BOUNDS - Success
  355. -- Performing Test HAVE_CXX_WNO_CLASS_MEMACCESS
  356. -- Performing Test HAVE_CXX_WNO_CLASS_MEMACCESS - Success
  357. -- Found JNI: /usr/lib/jvm/default-java/lib/libjawt.so
  358. -- VTK is not found. Please set -DVTK_DIR in CMake to VTK build directory, or to VTK install subdirectory with VTKConfig.cmake file
  359. -- Performing Test HAVE_C_WNO_UNUSED_VARIABLE
  360. -- Performing Test HAVE_C_WNO_UNUSED_VARIABLE - Success
  361. -- Performing Test HAVE_C_WNO_SHADOW
  362. -- Performing Test HAVE_C_WNO_SHADOW - Success
  363. -- Looking for dlerror in dl
  364. -- Looking for dlerror in dl - found
  365. -- Performing Test HAVE_C_WNO_IMPLICIT_FALLTHROUGH
  366. -- Performing Test HAVE_C_WNO_IMPLICIT_FALLTHROUGH - Success
  367. -- Performing Test HAVE_C_WNO_SIGN_COMPARE
  368. -- Performing Test HAVE_C_WNO_SIGN_COMPARE - Success
  369. -- ADE: Download: v0.1.1f.zip
  370. -- OpenCV Python: during development append to PYTHONPATH: /home/sam/sam/download/opencv/build/python_loader
  371. -- Checking for modules 'libavcodec;libavformat;libavutil;libswscale'
  372. -- Found libavcodec, version 58.54.100
  373. -- Found libavformat, version 58.29.100
  374. -- Found libavutil, version 56.31.100
  375. -- Found libswscale, version 5.5.100
  376. -- Checking for module 'libavresample'
  377. -- No package 'libavresample' found
  378. -- Checking for module 'gstreamer-base-1.0'
  379. -- Found gstreamer-base-1.0, version 1.16.2
  380. -- Checking for module 'gstreamer-app-1.0'
  381. -- Found gstreamer-app-1.0, version 1.16.2
  382. -- Checking for module 'gstreamer-riff-1.0'
  383. -- Found gstreamer-riff-1.0, version 1.16.2
  384. -- Checking for module 'gstreamer-pbutils-1.0'
  385. -- Found gstreamer-pbutils-1.0, version 1.16.2
  386. -- Checking for module 'libdc1394-2'
  387. -- Found libdc1394-2, version 2.2.5
  388. -- Allocator metrics storage type: 'long long'
  389. -- Registering hook 'INIT_MODULE_SOURCES_opencv_dnn': /home/sam/sam/download/opencv/modules/dnn/cmake/hooks/INIT_MODULE_SOURCES_opencv_dnn.cmake
  390. -- opencv_dnn: filter out cuda4dnn source code
  391. -- Performing Test HAVE_CXX_WNO_DEPRECATED_DECLARATIONS
  392. -- Performing Test HAVE_CXX_WNO_DEPRECATED_DECLARATIONS - Success
  393. -- Performing Test HAVE_CXX_WNO_OVERLOADED_VIRTUAL
  394. -- Performing Test HAVE_CXX_WNO_OVERLOADED_VIRTUAL - Success
  395. -- Performing Test HAVE_CXX_WNO_UNUSED_PRIVATE_FIELD
  396. -- Performing Test HAVE_CXX_WNO_UNUSED_PRIVATE_FIELD - Failed
  397. --
  398. -- General configuration for OpenCV 4.5.1-dev =====================================
  399. -- Version control: 4.5.1-194-gc527b3cefd
  400. --
  401. -- Platform:
  402. -- Timestamp: 2021-02-10T07:06:57Z
  403. -- Host: Linux 5.4.0-58-generic x86_64
  404. -- CMake: 3.16.3
  405. -- CMake generator: Unix Makefiles
  406. -- CMake build tool: /usr/bin/make
  407. -- Configuration: Release
  408. --
  409. -- CPU/HW features:
  410. -- Baseline: SSE SSE2 SSE3
  411. -- requested: SSE3
  412. -- Dispatched code generation: SSE4_1 SSE4_2 FP16 AVX AVX2 AVX512_SKX
  413. -- requested: SSE4_1 SSE4_2 AVX FP16 AVX2 AVX512_SKX
  414. -- SSE4_1 (17 files): + SSSE3 SSE4_1
  415. -- SSE4_2 (2 files): + SSSE3 SSE4_1 POPCNT SSE4_2
  416. -- FP16 (1 files): + SSSE3 SSE4_1 POPCNT SSE4_2 FP16 AVX
  417. -- AVX (5 files): + SSSE3 SSE4_1 POPCNT SSE4_2 AVX
  418. -- AVX2 (31 files): + SSSE3 SSE4_1 POPCNT SSE4_2 FP16 FMA3 AVX AVX2
  419. -- AVX512_SKX (7 files): + SSSE3 SSE4_1 POPCNT SSE4_2 FP16 FMA3 AVX AVX2 AVX_512F AVX512_COMMON AVX512_SKX
  420. --
  421. -- C/C++:
  422. -- Built as dynamic libs?: YES
  423. -- C++ standard: 11
  424. -- C++ Compiler: /usr/bin/c++ (ver 9.3.0)
  425. -- C++ flags (Release): -fsigned-char -W -Wall -Werror=return-type -Werror=non-virtual-dtor -Werror=address -Werror=sequence-point -Wformat -Werror=format-security -Wmissing-declarations -Wundef -Winit-self -Wpointer-arith -Wshadow -Wsign-promo -Wuninitialized -Wsuggest-override -Wno-delete-non-virtual-dtor -Wno-comment -Wimplicit-fallthrough=3 -Wno-strict-overflow -fdiagnostics-show-option -Wno-long-long -pthread -fomit-frame-pointer -ffunction-sections -fdata-sections -msse -msse2 -msse3 -fvisibility=hidden -fvisibility-inlines-hidden -O3 -DNDEBUG -DNDEBUG
  426. -- C++ flags (Debug): -fsigned-char -W -Wall -Werror=return-type -Werror=non-virtual-dtor -Werror=address -Werror=sequence-point -Wformat -Werror=format-security -Wmissing-declarations -Wundef -Winit-self -Wpointer-arith -Wshadow -Wsign-promo -Wuninitialized -Wsuggest-override -Wno-delete-non-virtual-dtor -Wno-comment -Wimplicit-fallthrough=3 -Wno-strict-overflow -fdiagnostics-show-option -Wno-long-long -pthread -fomit-frame-pointer -ffunction-sections -fdata-sections -msse -msse2 -msse3 -fvisibility=hidden -fvisibility-inlines-hidden -g -O0 -DDEBUG -D_DEBUG
  427. -- C Compiler: /usr/bin/cc
  428. -- C flags (Release): -fsigned-char -W -Wall -Werror=return-type -Werror=address -Werror=sequence-point -Wformat -Werror=format-security -Wmissing-declarations -Wmissing-prototypes -Wstrict-prototypes -Wundef -Winit-self -Wpointer-arith -Wshadow -Wuninitialized -Wno-comment -Wimplicit-fallthrough=3 -Wno-strict-overflow -fdiagnostics-show-option -Wno-long-long -pthread -fomit-frame-pointer -ffunction-sections -fdata-sections -msse -msse2 -msse3 -fvisibility=hidden -O3 -DNDEBUG -DNDEBUG
  429. -- C flags (Debug): -fsigned-char -W -Wall -Werror=return-type -Werror=address -Werror=sequence-point -Wformat -Werror=format-security -Wmissing-declarations -Wmissing-prototypes -Wstrict-prototypes -Wundef -Winit-self -Wpointer-arith -Wshadow -Wuninitialized -Wno-comment -Wimplicit-fallthrough=3 -Wno-strict-overflow -fdiagnostics-show-option -Wno-long-long -pthread -fomit-frame-pointer -ffunction-sections -fdata-sections -msse -msse2 -msse3 -fvisibility=hidden -g -O0 -DDEBUG -D_DEBUG
  430. -- Linker flags (Release): -Wl,--exclude-libs,libippicv.a -Wl,--exclude-libs,libippiw.a -Wl,--gc-sections -Wl,--as-needed
  431. -- Linker flags (Debug): -Wl,--exclude-libs,libippicv.a -Wl,--exclude-libs,libippiw.a -Wl,--gc-sections -Wl,--as-needed
  432. -- ccache: NO
  433. -- Precompiled headers: NO
  434. -- Extra dependencies: dl m pthread rt
  435. -- 3rdparty dependencies:
  436. --
  437. -- OpenCV modules:
  438. -- To be built: calib3d core dnn features2d flann gapi highgui imgcodecs imgproc ml objdetect photo python2 python3 stitching ts video videoio
  439. -- Disabled: world
  440. -- Disabled by dependency: -
  441. -- Unavailable: java
  442. -- Applications: tests perf_tests apps
  443. -- Documentation: NO
  444. -- Non-free algorithms: NO
  445. --
  446. -- GUI:
  447. -- GTK+: YES (ver 3.24.20)
  448. -- GThread : YES (ver 2.64.6)
  449. -- GtkGlExt: NO
  450. -- VTK support: NO
  451. --
  452. -- Media I/O:
  453. -- ZLib: /usr/lib/x86_64-linux-gnu/libz.so (ver 1.2.11)
  454. -- JPEG: /usr/lib/x86_64-linux-gnu/libjpeg.so (ver 80)
  455. -- WEBP: /usr/lib/x86_64-linux-gnu/libwebp.so (ver encoder: 0x020e)
  456. -- PNG: /usr/lib/x86_64-linux-gnu/libpng.so (ver 1.6.37)
  457. -- TIFF: /usr/lib/x86_64-linux-gnu/libtiff.so (ver 42 / 4.1.0)
  458. -- JPEG 2000: build (ver 2.3.1)
  459. -- OpenEXR: /usr/lib/x86_64-linux-gnu/libImath.so /usr/lib/x86_64-linux-gnu/libIlmImf.so /usr/lib/x86_64-linux-gnu/libIex.so /usr/lib/x86_64-linux-gnu/libHalf.so /usr/lib/x86_64-linux-gnu/libIlmThread.so (ver 2_3)
  460. -- HDR: YES
  461. -- SUNRASTER: YES
  462. -- PXM: YES
  463. -- PFM: YES
  464. --
  465. -- Video I/O:
  466. -- DC1394: YES (2.2.5)
  467. -- FFMPEG: YES
  468. -- avcodec: YES (58.54.100)
  469. -- avformat: YES (58.29.100)
  470. -- avutil: YES (56.31.100)
  471. -- swscale: YES (5.5.100)
  472. -- avresample: NO
  473. -- GStreamer: YES (1.16.2)
  474. -- v4l/v4l2: YES (linux/videodev2.h)
  475. --
  476. -- Parallel framework: pthreads
  477. --
  478. -- Trace: YES (with Intel ITT)
  479. --
  480. -- Other third-party libraries:
  481. -- Intel IPP: 2020.0.0 Gold [2020.0.0]
  482. -- at: /home/sam/sam/download/opencv/build/3rdparty/ippicv/ippicv_lnx/icv
  483. -- Intel IPP IW: sources (2020.0.0)
  484. -- at: /home/sam/sam/download/opencv/build/3rdparty/ippicv/ippicv_lnx/iw
  485. -- Lapack: NO
  486. -- Eigen: NO
  487. -- Custom HAL: NO
  488. -- Protobuf: build (3.5.1)
  489. --
  490. -- OpenCL: YES (no extra features)
  491. -- Include path: /home/sam/sam/download/opencv/3rdparty/include/opencl/1.2
  492. -- Link libraries: Dynamic load
  493. --
  494. -- Python 2:
  495. -- Interpreter: /usr/bin/python2.7 (ver 2.7.18)
  496. -- Libraries: /usr/lib/x86_64-linux-gnu/libpython2.7.so (ver 2.7.18)
  497. -- numpy: /usr/lib/python2.7/dist-packages/numpy/core/include (ver 1.16.5)
  498. -- install path: lib/python2.7/dist-packages/cv2/python-2.7
  499. --
  500. -- Python 3:
  501. -- Interpreter: /usr/bin/python3 (ver 3.8.5)
  502. -- Libraries: /usr/lib/x86_64-linux-gnu/libpython3.8.so (ver 3.8.5)
  503. -- numpy: /usr/lib/python3/dist-packages/numpy/core/include (ver 1.17.4)
  504. -- install path: lib/python3.8/dist-packages/cv2/python-3.8
  505. --
  506. -- Python (for build): /usr/bin/python3
  507. --
  508. -- Java:
  509. -- ant: NO
  510. -- JNI: /usr/lib/jvm/default-java/include /usr/lib/jvm/default-java/include/linux /usr/lib/jvm/default-java/include
  511. -- Java wrappers: NO
  512. -- Java tests: NO
  513. --
  514. -- Install to: /usr/local
  515. -- -----------------------------------------------------------------
  516. --
  517. -- Configuring done
  518. -- Generating done
  519. -- Build files have been written to: /home/sam/sam/download/opencv/build
  520. sam@sam-Base:~/sam/download/opencv/build$ make
  521. Scanning dependencies of target libopenjp2
  522. [ 0%] Building C object 3rdparty/openjpeg/openjp2/CMakeFiles/libopenjp2.dir/thread.c.o
  523. [ 0%] Building C object 3rdparty/openjpeg/openjp2/CMakeFiles/libopenjp2.dir/bio.c.o
  524. [ 0%] Building C object 3rdparty/openjpeg/openjp2/CMakeFiles/libopenjp2.dir/cio.c.o
  525. [ 0%] Building C object 3rdparty/openjpeg/openjp2/CMakeFiles/libopenjp2.dir/dwt.c.o
  526. [ 0%] Building C object 3rdparty/openjpeg/openjp2/CMakeFiles/libopenjp2.dir/event.c.o
  527. [ 0%] Building C object 3rdparty/openjpeg/openjp2/CMakeFiles/libopenjp2.dir/image.c.o
  528. [ 0%] Building C object 3rdparty/openjpeg/openjp2/CMakeFiles/libopenjp2.dir/invert.c.o
  529. [ 0%] Building C object 3rdparty/openjpeg/openjp2/CMakeFiles/libopenjp2.dir/j2k.c.o
  530. [ 1%] Building C object 3rdparty/openjpeg/openjp2/CMakeFiles/libopenjp2.dir/jp2.c.o
  531. [ 1%] Building C object 3rdparty/openjpeg/openjp2/CMakeFiles/libopenjp2.dir/mct.c.o
  532. [ 1%] Building C object 3rdparty/openjpeg/openjp2/CMakeFiles/libopenjp2.dir/mqc.c.o
  533. [ 1%] Building C object 3rdparty/openjpeg/openjp2/CMakeFiles/libopenjp2.dir/openjpeg.c.o
  534. [ 1%] Building C object 3rdparty/openjpeg/openjp2/CMakeFiles/libopenjp2.dir/opj_clock.c.o
  535. [ 1%] Building C object 3rdparty/openjpeg/openjp2/CMakeFiles/libopenjp2.dir/pi.c.o
  536. [ 1%] Building C object 3rdparty/openjpeg/openjp2/CMakeFiles/libopenjp2.dir/t1.c.o
  537. [ 1%] Building C object 3rdparty/openjpeg/openjp2/CMakeFiles/libopenjp2.dir/t2.c.o
  538. [ 1%] Building C object 3rdparty/openjpeg/openjp2/CMakeFiles/libopenjp2.dir/tcd.c.o
  539. [ 1%] Building C object 3rdparty/openjpeg/openjp2/CMakeFiles/libopenjp2.dir/tgt.c.o
  540. [ 1%] Building C object 3rdparty/openjpeg/openjp2/CMakeFiles/libopenjp2.dir/function_list.c.o
  541. [ 1%] Building C object 3rdparty/openjpeg/openjp2/CMakeFiles/libopenjp2.dir/opj_malloc.c.o
  542. [ 1%] Building C object 3rdparty/openjpeg/openjp2/CMakeFiles/libopenjp2.dir/sparse_array.c.o
  543. [ 2%] Linking C static library ../../lib/liblibopenjp2.a
  544. [ 2%] Built target libopenjp2
  545. Scanning dependencies of target ade
  546. [ 2%] Building CXX object modules/CMakeFiles/ade.dir/__/3rdparty/ade/ade-0.1.1f/sources/ade/source/alloc.cpp.o
  547. [ 2%] Building CXX object modules/CMakeFiles/ade.dir/__/3rdparty/ade/ade-0.1.1f/sources/ade/source/assert.cpp.o
  548. [ 2%] Building CXX object modules/CMakeFiles/ade.dir/__/3rdparty/ade/ade-0.1.1f/sources/ade/source/check_cycles.cpp.o
  549. [ 2%] Building CXX object modules/CMakeFiles/ade.dir/__/3rdparty/ade/ade-0.1.1f/sources/ade/source/edge.cpp.o
  550. [ 2%] Building CXX object modules/CMakeFiles/ade.dir/__/3rdparty/ade/ade-0.1.1f/sources/ade/source/execution_engine.cpp.o
  551. [ 2%] Building CXX object modules/CMakeFiles/ade.dir/__/3rdparty/ade/ade-0.1.1f/sources/ade/source/graph.cpp.o
  552. [ 2%] Building CXX object modules/CMakeFiles/ade.dir/__/3rdparty/ade/ade-0.1.1f/sources/ade/source/memory_accessor.cpp.o
  553. [ 2%] Building CXX object modules/CMakeFiles/ade.dir/__/3rdparty/ade/ade-0.1.1f/sources/ade/source/memory_descriptor.cpp.o
  554. [ 2%] Building CXX object modules/CMakeFiles/ade.dir/__/3rdparty/ade/ade-0.1.1f/sources/ade/source/memory_descriptor_ref.cpp.o
  555. [ 2%] Building CXX object modules/CMakeFiles/ade.dir/__/3rdparty/ade/ade-0.1.1f/sources/ade/source/memory_descriptor_view.cpp.o
  556. [ 2%] Building CXX object modules/CMakeFiles/ade.dir/__/3rdparty/ade/ade-0.1.1f/sources/ade/source/metadata.cpp.o
  557. [ 2%] Building CXX object modules/CMakeFiles/ade.dir/__/3rdparty/ade/ade-0.1.1f/sources/ade/source/metatypes.cpp.o
  558. [ 3%] Building CXX object modules/CMakeFiles/ade.dir/__/3rdparty/ade/ade-0.1.1f/sources/ade/source/node.cpp.o
  559. [ 3%] Building CXX object modules/CMakeFiles/ade.dir/__/3rdparty/ade/ade-0.1.1f/sources/ade/source/passes/communications.cpp.o
  560. [ 3%] Building CXX object modules/CMakeFiles/ade.dir/__/3rdparty/ade/ade-0.1.1f/sources/ade/source/search.cpp.o
  561. [ 3%] Building CXX object modules/CMakeFiles/ade.dir/__/3rdparty/ade/ade-0.1.1f/sources/ade/source/subgraphs.cpp.o
  562. [ 3%] Building CXX object modules/CMakeFiles/ade.dir/__/3rdparty/ade/ade-0.1.1f/sources/ade/source/topological_sort.cpp.o
  563. [ 3%] Linking CXX static library ../lib/libade.a
  564. [ 3%] Built target ade
  565. Scanning dependencies of target opencv_videoio_plugins
  566. [ 3%] Built target opencv_videoio_plugins
  567. Scanning dependencies of target ittnotify
  568. [ 3%] Building C object 3rdparty/ittnotify/CMakeFiles/ittnotify.dir/src/ittnotify/ittnotify_static.c.o
  569. [ 3%] Building C object 3rdparty/ittnotify/CMakeFiles/ittnotify.dir/src/ittnotify/jitprofiling.c.o
  570. [ 3%] Linking C static library ../lib/libittnotify.a
  571. [ 3%] Built target ittnotify
  572. Scanning dependencies of target ippiw
  573. [ 3%] Building C object 3rdparty/ippiw/CMakeFiles/ippiw.dir/src/iw_core.c.o
  574. [ 3%] Building C object 3rdparty/ippiw/CMakeFiles/ippiw.dir/src/iw_image.c.o
  575. [ 4%] Building C object 3rdparty/ippiw/CMakeFiles/ippiw.dir/src/iw_image_color_convert_all.c.o
  576. [ 4%] Building C object 3rdparty/ippiw/CMakeFiles/ippiw.dir/src/iw_image_color_convert_rgbs.c.o
  577. [ 4%] Building C object 3rdparty/ippiw/CMakeFiles/ippiw.dir/src/iw_image_filter_bilateral.c.o
  578. [ 4%] Building C object 3rdparty/ippiw/CMakeFiles/ippiw.dir/src/iw_image_filter_box.c.o
  579. [ 4%] Building C object 3rdparty/ippiw/CMakeFiles/ippiw.dir/src/iw_image_filter_canny.c.o
  580. [ 4%] Building C object 3rdparty/ippiw/CMakeFiles/ippiw.dir/src/iw_image_filter_gaussian.c.o
  581. [ 4%] Building C object 3rdparty/ippiw/CMakeFiles/ippiw.dir/src/iw_image_filter_general.c.o
  582. [ 4%] Building C object 3rdparty/ippiw/CMakeFiles/ippiw.dir/src/iw_image_filter_laplacian.c.o
  583. [ 4%] Building C object 3rdparty/ippiw/CMakeFiles/ippiw.dir/src/iw_image_filter_morphology.c.o
  584. [ 4%] Building C object 3rdparty/ippiw/CMakeFiles/ippiw.dir/src/iw_image_filter_scharr.c.o
  585. [ 4%] Building C object 3rdparty/ippiw/CMakeFiles/ippiw.dir/src/iw_image_filter_sobel.c.o
  586. [ 4%] Building C object 3rdparty/ippiw/CMakeFiles/ippiw.dir/src/iw_image_op_copy.c.o
  587. [ 5%] Building C object 3rdparty/ippiw/CMakeFiles/ippiw.dir/src/iw_image_op_copy_channel.c.o
  588. [ 5%] Building C object 3rdparty/ippiw/CMakeFiles/ippiw.dir/src/iw_image_op_copy_make_border.c.o
  589. [ 5%] Building C object 3rdparty/ippiw/CMakeFiles/ippiw.dir/src/iw_image_op_copy_merge.c.o
  590. [ 5%] Building C object 3rdparty/ippiw/CMakeFiles/ippiw.dir/src/iw_image_op_copy_split.c.o
  591. [ 5%] Building C object 3rdparty/ippiw/CMakeFiles/ippiw.dir/src/iw_image_op_scale.c.o
  592. [ 5%] Building C object 3rdparty/ippiw/CMakeFiles/ippiw.dir/src/iw_image_op_set.c.o
  593. [ 5%] Building C object 3rdparty/ippiw/CMakeFiles/ippiw.dir/src/iw_image_op_set_channel.c.o
  594. [ 5%] Building C object 3rdparty/ippiw/CMakeFiles/ippiw.dir/src/iw_image_op_swap_channels.c.o
  595. [ 5%] Building C object 3rdparty/ippiw/CMakeFiles/ippiw.dir/src/iw_image_transform_mirror.c.o
  596. [ 5%] Building C object 3rdparty/ippiw/CMakeFiles/ippiw.dir/src/iw_image_transform_resize.c.o
  597. [ 5%] Building C object 3rdparty/ippiw/CMakeFiles/ippiw.dir/src/iw_image_transform_rotate.c.o
  598. [ 5%] Building C object 3rdparty/ippiw/CMakeFiles/ippiw.dir/src/iw_image_transform_warpaffine.c.o
  599. [ 5%] Building C object 3rdparty/ippiw/CMakeFiles/ippiw.dir/src/iw_own.c.o
  600. [ 6%] Linking C static library ../lib/libippiw.a
  601. [ 6%] Built target ippiw
  602. [ 6%] Processing OpenCL kernels (core)
  603. Scanning dependencies of target opencv_core
  604. [ 6%] Building CXX object modules/core/CMakeFiles/opencv_core.dir/src/algorithm.cpp.o
  605. [ 6%] Building CXX object modules/core/CMakeFiles/opencv_core.dir/src/alloc.cpp.o
  606. [ 6%] Building CXX object modules/core/CMakeFiles/opencv_core.dir/src/arithm.cpp.o
  607. [ 6%] Building CXX object modules/core/CMakeFiles/opencv_core.dir/src/arithm.dispatch.cpp.o
  608. [ 6%] Building CXX object modules/core/CMakeFiles/opencv_core.dir/src/array.cpp.o
  609. [ 6%] Building CXX object modules/core/CMakeFiles/opencv_core.dir/src/async.cpp.o
  610. [ 6%] Building CXX object modules/core/CMakeFiles/opencv_core.dir/src/batch_distance.cpp.o
  611. [ 6%] Building CXX object modules/core/CMakeFiles/opencv_core.dir/src/bindings_utils.cpp.o
  612. [ 6%] Building CXX object modules/core/CMakeFiles/opencv_core.dir/src/buffer_area.cpp.o
  613. [ 7%] Building CXX object modules/core/CMakeFiles/opencv_core.dir/src/channels.cpp.o
  614. [ 7%] Building CXX object modules/core/CMakeFiles/opencv_core.dir/src/check.cpp.o
  615. [ 7%] Building CXX object modules/core/CMakeFiles/opencv_core.dir/src/command_line_parser.cpp.o
  616. [ 7%] Building CXX object modules/core/CMakeFiles/opencv_core.dir/src/conjugate_gradient.cpp.o
  617. [ 7%] Building CXX object modules/core/CMakeFiles/opencv_core.dir/src/convert.dispatch.cpp.o
  618. [ 7%] Building CXX object modules/core/CMakeFiles/opencv_core.dir/src/convert_c.cpp.o
  619. [ 7%] Building CXX object modules/core/CMakeFiles/opencv_core.dir/src/convert_scale.dispatch.cpp.o
  620. [ 7%] Building CXX object modules/core/CMakeFiles/opencv_core.dir/src/copy.cpp.o
  621. [ 7%] Building CXX object modules/core/CMakeFiles/opencv_core.dir/src/count_non_zero.dispatch.cpp.o
  622. [ 7%] Building CXX object modules/core/CMakeFiles/opencv_core.dir/src/cuda_gpu_mat.cpp.o
  623. [ 7%] Building CXX object modules/core/CMakeFiles/opencv_core.dir/src/cuda_gpu_mat_nd.cpp.o
  624. [ 7%] Building CXX object modules/core/CMakeFiles/opencv_core.dir/src/cuda_host_mem.cpp.o
  625. [ 7%] Building CXX object modules/core/CMakeFiles/opencv_core.dir/src/cuda_info.cpp.o
  626. [ 8%] Building CXX object modules/core/CMakeFiles/opencv_core.dir/src/cuda_stream.cpp.o
  627. [ 8%] Building CXX object modules/core/CMakeFiles/opencv_core.dir/src/datastructs.cpp.o
  628. [ 8%] Building CXX object modules/core/CMakeFiles/opencv_core.dir/src/directx.cpp.o
  629. [ 8%] Building CXX object modules/core/CMakeFiles/opencv_core.dir/src/downhill_simplex.cpp.o
  630. [ 8%] Building CXX object modules/core/CMakeFiles/opencv_core.dir/src/dxt.cpp.o
  631. [ 8%] Building CXX object modules/core/CMakeFiles/opencv_core.dir/src/gl_core_3_1.cpp.o
  632. [ 8%] Building CXX object modules/core/CMakeFiles/opencv_core.dir/src/glob.cpp.o
  633. [ 8%] Building CXX object modules/core/CMakeFiles/opencv_core.dir/src/hal_internal.cpp.o
  634. [ 8%] Building CXX object modules/core/CMakeFiles/opencv_core.dir/src/kmeans.cpp.o
  635. [ 8%] Building CXX object modules/core/CMakeFiles/opencv_core.dir/src/lapack.cpp.o
  636. [ 8%] Building CXX object modules/core/CMakeFiles/opencv_core.dir/src/lda.cpp.o
  637. [ 8%] Building CXX object modules/core/CMakeFiles/opencv_core.dir/src/logger.cpp.o
  638. [ 9%] Building CXX object modules/core/CMakeFiles/opencv_core.dir/src/lpsolver.cpp.o
  639. [ 9%] Building CXX object modules/core/CMakeFiles/opencv_core.dir/src/lut.cpp.o
  640. [ 9%] Building CXX object modules/core/CMakeFiles/opencv_core.dir/src/mathfuncs.cpp.o
  641. [ 9%] Building CXX object modules/core/CMakeFiles/opencv_core.dir/src/mathfuncs_core.dispatch.cpp.o
  642. [ 9%] Building CXX object modules/core/CMakeFiles/opencv_core.dir/src/matmul.dispatch.cpp.o
  643. [ 9%] Building CXX object modules/core/CMakeFiles/opencv_core.dir/src/matrix.cpp.o
  644. [ 9%] Building CXX object modules/core/CMakeFiles/opencv_core.dir/src/matrix_c.cpp.o
  645. [ 9%] Building CXX object modules/core/CMakeFiles/opencv_core.dir/src/matrix_decomp.cpp.o
  646. [ 9%] Building CXX object modules/core/CMakeFiles/opencv_core.dir/src/matrix_expressions.cpp.o
  647. [ 9%] Building CXX object modules/core/CMakeFiles/opencv_core.dir/src/matrix_iterator.cpp.o
  648. [ 9%] Building CXX object modules/core/CMakeFiles/opencv_core.dir/src/matrix_operations.cpp.o
  649. [ 9%] Building CXX object modules/core/CMakeFiles/opencv_core.dir/src/matrix_sparse.cpp.o
  650. [ 9%] Building CXX object modules/core/CMakeFiles/opencv_core.dir/src/matrix_wrap.cpp.o
  651. [ 10%] Building CXX object modules/core/CMakeFiles/opencv_core.dir/src/mean.dispatch.cpp.o
  652. [ 10%] Building CXX object modules/core/CMakeFiles/opencv_core.dir/src/merge.dispatch.cpp.o
  653. [ 10%] Building CXX object modules/core/CMakeFiles/opencv_core.dir/src/minmax.cpp.o
  654. [ 10%] Building CXX object modules/core/CMakeFiles/opencv_core.dir/src/norm.cpp.o
  655. [ 10%] Building CXX object modules/core/CMakeFiles/opencv_core.dir/src/ocl.cpp.o
  656. [ 10%] Building CXX object modules/core/CMakeFiles/opencv_core.dir/src/opencl/runtime/opencl_clamdblas.cpp.o
  657. [ 10%] Building CXX object modules/core/CMakeFiles/opencv_core.dir/src/opencl/runtime/opencl_clamdfft.cpp.o
  658. [ 10%] Building CXX object modules/core/CMakeFiles/opencv_core.dir/src/opencl/runtime/opencl_core.cpp.o
  659. [ 10%] Building CXX object modules/core/CMakeFiles/opencv_core.dir/src/opengl.cpp.o
  660. [ 10%] Building CXX object modules/core/CMakeFiles/opencv_core.dir/src/out.cpp.o
  661. [ 10%] Building CXX object modules/core/CMakeFiles/opencv_core.dir/src/ovx.cpp.o
  662. [ 10%] Building CXX object modules/core/CMakeFiles/opencv_core.dir/src/parallel.cpp.o
  663. [ 11%] Building CXX object modules/core/CMakeFiles/opencv_core.dir/src/parallel_impl.cpp.o
  664. [ 11%] Building CXX object modules/core/CMakeFiles/opencv_core.dir/src/pca.cpp.o
  665. [ 11%] Building CXX object modules/core/CMakeFiles/opencv_core.dir/src/persistence.cpp.o
  666. [ 11%] Building CXX object modules/core/CMakeFiles/opencv_core.dir/src/persistence_json.cpp.o
  667. [ 11%] Building CXX object modules/core/CMakeFiles/opencv_core.dir/src/persistence_types.cpp.o
  668. [ 11%] Building CXX object modules/core/CMakeFiles/opencv_core.dir/src/persistence_xml.cpp.o
  669. [ 11%] Building CXX object modules/core/CMakeFiles/opencv_core.dir/src/persistence_yml.cpp.o
  670. [ 11%] Building CXX object modules/core/CMakeFiles/opencv_core.dir/src/rand.cpp.o
  671. [ 11%] Building CXX object modules/core/CMakeFiles/opencv_core.dir/src/softfloat.cpp.o
  672. [ 11%] Building CXX object modules/core/CMakeFiles/opencv_core.dir/src/split.dispatch.cpp.o
  673. [ 11%] Building CXX object modules/core/CMakeFiles/opencv_core.dir/src/stat.dispatch.cpp.o
  674. [ 11%] Building CXX object modules/core/CMakeFiles/opencv_core.dir/src/stat_c.cpp.o
  675. [ 11%] Building CXX object modules/core/CMakeFiles/opencv_core.dir/src/stl.cpp.o
  676. [ 12%] Building CXX object modules/core/CMakeFiles/opencv_core.dir/src/sum.dispatch.cpp.o
  677. [ 12%] Building CXX object modules/core/CMakeFiles/opencv_core.dir/src/system.cpp.o
  678. [ 12%] Building CXX object modules/core/CMakeFiles/opencv_core.dir/src/tables.cpp.o
  679. [ 12%] Building CXX object modules/core/CMakeFiles/opencv_core.dir/src/trace.cpp.o
  680. [ 12%] Building CXX object modules/core/CMakeFiles/opencv_core.dir/src/types.cpp.o
  681. [ 12%] Building CXX object modules/core/CMakeFiles/opencv_core.dir/src/umatrix.cpp.o
  682. [ 12%] Building CXX object modules/core/CMakeFiles/opencv_core.dir/src/utils/datafile.cpp.o
  683. [ 12%] Building CXX object modules/core/CMakeFiles/opencv_core.dir/src/utils/filesystem.cpp.o
  684. [ 12%] Building CXX object modules/core/CMakeFiles/opencv_core.dir/src/utils/logtagconfigparser.cpp.o
  685. [ 12%] Building CXX object modules/core/CMakeFiles/opencv_core.dir/src/utils/logtagmanager.cpp.o
  686. [ 12%] Building CXX object modules/core/CMakeFiles/opencv_core.dir/src/utils/samples.cpp.o
  687. [ 12%] Building CXX object modules/core/CMakeFiles/opencv_core.dir/src/va_intel.cpp.o
  688. [ 13%] Building CXX object modules/core/CMakeFiles/opencv_core.dir/opencl_kernels_core.cpp.o
  689. [ 13%] Building CXX object modules/core/CMakeFiles/opencv_core.dir/arithm.sse4_1.cpp.o
  690. [ 13%] Building CXX object modules/core/CMakeFiles/opencv_core.dir/matmul.sse4_1.cpp.o
  691. [ 13%] Building CXX object modules/core/CMakeFiles/opencv_core.dir/stat.sse4_2.cpp.o
  692. [ 13%] Building CXX object modules/core/CMakeFiles/opencv_core.dir/mathfuncs_core.avx.cpp.o
  693. [ 13%] Building CXX object modules/core/CMakeFiles/opencv_core.dir/mathfuncs_core.avx2.cpp.o
  694. [ 13%] Building CXX object modules/core/CMakeFiles/opencv_core.dir/stat.avx2.cpp.o
  695. [ 13%] Building CXX object modules/core/CMakeFiles/opencv_core.dir/arithm.avx2.cpp.o
  696. [ 13%] Building CXX object modules/core/CMakeFiles/opencv_core.dir/convert.avx2.cpp.o
  697. [ 13%] Building CXX object modules/core/CMakeFiles/opencv_core.dir/convert_scale.avx2.cpp.o
  698. [ 13%] Building CXX object modules/core/CMakeFiles/opencv_core.dir/count_non_zero.avx2.cpp.o
  699. [ 13%] Building CXX object modules/core/CMakeFiles/opencv_core.dir/matmul.avx2.cpp.o
  700. [ 13%] Building CXX object modules/core/CMakeFiles/opencv_core.dir/mean.avx2.cpp.o
  701. [ 14%] Building CXX object modules/core/CMakeFiles/opencv_core.dir/merge.avx2.cpp.o
  702. [ 14%] Building CXX object modules/core/CMakeFiles/opencv_core.dir/split.avx2.cpp.o
  703. [ 14%] Building CXX object modules/core/CMakeFiles/opencv_core.dir/sum.avx2.cpp.o
  704. [ 14%] Building CXX object modules/core/CMakeFiles/opencv_core.dir/matmul.avx512_skx.cpp.o
  705. [ 14%] Linking CXX shared library ../../lib/libopencv_core.so
  706. [ 14%] Built target opencv_core
  707. [ 14%] Processing OpenCL kernels (imgproc)
  708. Scanning dependencies of target opencv_imgproc
  709. [ 14%] Building CXX object modules/imgproc/CMakeFiles/opencv_imgproc.dir/src/accum.cpp.o
  710. [ 14%] Building CXX object modules/imgproc/CMakeFiles/opencv_imgproc.dir/src/accum.dispatch.cpp.o
  711. [ 14%] Building CXX object modules/imgproc/CMakeFiles/opencv_imgproc.dir/src/approx.cpp.o
  712. [ 14%] Building CXX object modules/imgproc/CMakeFiles/opencv_imgproc.dir/src/bilateral_filter.dispatch.cpp.o
  713. [ 14%] Building CXX object modules/imgproc/CMakeFiles/opencv_imgproc.dir/src/blend.cpp.o
  714. [ 14%] Building CXX object modules/imgproc/CMakeFiles/opencv_imgproc.dir/src/box_filter.dispatch.cpp.o
  715. [ 14%] Building CXX object modules/imgproc/CMakeFiles/opencv_imgproc.dir/src/canny.cpp.o
  716. [ 14%] Building CXX object modules/imgproc/CMakeFiles/opencv_imgproc.dir/src/clahe.cpp.o
  717. [ 14%] Building CXX object modules/imgproc/CMakeFiles/opencv_imgproc.dir/src/color.cpp.o
  718. [ 14%] Building CXX object modules/imgproc/CMakeFiles/opencv_imgproc.dir/src/color_hsv.dispatch.cpp.o
  719. [ 15%] Building CXX object modules/imgproc/CMakeFiles/opencv_imgproc.dir/src/color_lab.cpp.o
  720. [ 15%] Building CXX object modules/imgproc/CMakeFiles/opencv_imgproc.dir/src/color_rgb.dispatch.cpp.o
  721. [ 15%] Building CXX object modules/imgproc/CMakeFiles/opencv_imgproc.dir/src/color_yuv.dispatch.cpp.o
  722. [ 15%] Building CXX object modules/imgproc/CMakeFiles/opencv_imgproc.dir/src/colormap.cpp.o
  723. [ 15%] Building CXX object modules/imgproc/CMakeFiles/opencv_imgproc.dir/src/connectedcomponents.cpp.o
  724. [ 15%] Building CXX object modules/imgproc/CMakeFiles/opencv_imgproc.dir/src/contours.cpp.o
  725. [ 15%] Building CXX object modules/imgproc/CMakeFiles/opencv_imgproc.dir/src/convhull.cpp.o
  726. [ 15%] Building CXX object modules/imgproc/CMakeFiles/opencv_imgproc.dir/src/corner.cpp.o
  727. [ 15%] Building CXX object modules/imgproc/CMakeFiles/opencv_imgproc.dir/src/cornersubpix.cpp.o
  728. [ 15%] Building CXX object modules/imgproc/CMakeFiles/opencv_imgproc.dir/src/demosaicing.cpp.o
  729. [ 15%] Building CXX object modules/imgproc/CMakeFiles/opencv_imgproc.dir/src/deriv.cpp.o
  730. [ 15%] Building CXX object modules/imgproc/CMakeFiles/opencv_imgproc.dir/src/distransform.cpp.o
  731. [ 15%] Building CXX object modules/imgproc/CMakeFiles/opencv_imgproc.dir/src/drawing.cpp.o
  732. [ 16%] Building CXX object modules/imgproc/CMakeFiles/opencv_imgproc.dir/src/emd.cpp.o
  733. [ 16%] Building CXX object modules/imgproc/CMakeFiles/opencv_imgproc.dir/src/featureselect.cpp.o
  734. [ 16%] Building CXX object modules/imgproc/CMakeFiles/opencv_imgproc.dir/src/filter.dispatch.cpp.o
  735. [ 16%] Building CXX object modules/imgproc/CMakeFiles/opencv_imgproc.dir/src/floodfill.cpp.o
  736. [ 16%] Building CXX object modules/imgproc/CMakeFiles/opencv_imgproc.dir/src/gabor.cpp.o
  737. [ 16%] Building CXX object modules/imgproc/CMakeFiles/opencv_imgproc.dir/src/generalized_hough.cpp.o
  738. [ 16%] Building CXX object modules/imgproc/CMakeFiles/opencv_imgproc.dir/src/geometry.cpp.o
  739. [ 16%] Building CXX object modules/imgproc/CMakeFiles/opencv_imgproc.dir/src/grabcut.cpp.o
  740. [ 16%] Building CXX object modules/imgproc/CMakeFiles/opencv_imgproc.dir/src/hershey_fonts.cpp.o
  741. [ 16%] Building CXX object modules/imgproc/CMakeFiles/opencv_imgproc.dir/src/histogram.cpp.o
  742. [ 16%] Building CXX object modules/imgproc/CMakeFiles/opencv_imgproc.dir/src/hough.cpp.o
  743. [ 16%] Building CXX object modules/imgproc/CMakeFiles/opencv_imgproc.dir/src/imgwarp.cpp.o
  744. [ 17%] Building CXX object modules/imgproc/CMakeFiles/opencv_imgproc.dir/src/intelligent_scissors.cpp.o
  745. [ 17%] Building CXX object modules/imgproc/CMakeFiles/opencv_imgproc.dir/src/intersection.cpp.o
  746. [ 17%] Building CXX object modules/imgproc/CMakeFiles/opencv_imgproc.dir/src/linefit.cpp.o
  747. [ 17%] Building CXX object modules/imgproc/CMakeFiles/opencv_imgproc.dir/src/lsd.cpp.o
  748. [ 17%] Building CXX object modules/imgproc/CMakeFiles/opencv_imgproc.dir/src/main.cpp.o
  749. [ 17%] Building CXX object modules/imgproc/CMakeFiles/opencv_imgproc.dir/src/matchcontours.cpp.o
  750. [ 17%] Building CXX object modules/imgproc/CMakeFiles/opencv_imgproc.dir/src/median_blur.dispatch.cpp.o
  751. [ 17%] Building CXX object modules/imgproc/CMakeFiles/opencv_imgproc.dir/src/min_enclosing_triangle.cpp.o
  752. [ 17%] Building CXX object modules/imgproc/CMakeFiles/opencv_imgproc.dir/src/moments.cpp.o
  753. [ 17%] Building CXX object modules/imgproc/CMakeFiles/opencv_imgproc.dir/src/morph.dispatch.cpp.o
  754. [ 17%] Building CXX object modules/imgproc/CMakeFiles/opencv_imgproc.dir/src/phasecorr.cpp.o
  755. [ 17%] Building CXX object modules/imgproc/CMakeFiles/opencv_imgproc.dir/src/pyramids.cpp.o
  756. [ 17%] Building CXX object modules/imgproc/CMakeFiles/opencv_imgproc.dir/src/resize.cpp.o
  757. [ 18%] Building CXX object modules/imgproc/CMakeFiles/opencv_imgproc.dir/src/rotcalipers.cpp.o
  758. [ 18%] Building CXX object modules/imgproc/CMakeFiles/opencv_imgproc.dir/src/samplers.cpp.o
  759. [ 18%] Building CXX object modules/imgproc/CMakeFiles/opencv_imgproc.dir/src/segmentation.cpp.o
  760. [ 18%] Building CXX object modules/imgproc/CMakeFiles/opencv_imgproc.dir/src/shapedescr.cpp.o
  761. [ 18%] Building CXX object modules/imgproc/CMakeFiles/opencv_imgproc.dir/src/smooth.dispatch.cpp.o
  762. [ 18%] Building CXX object modules/imgproc/CMakeFiles/opencv_imgproc.dir/src/spatialgradient.cpp.o
  763. [ 18%] Building CXX object modules/imgproc/CMakeFiles/opencv_imgproc.dir/src/subdivision2d.cpp.o
  764. [ 18%] Building CXX object modules/imgproc/CMakeFiles/opencv_imgproc.dir/src/sumpixels.dispatch.cpp.o
  765. [ 18%] Building CXX object modules/imgproc/CMakeFiles/opencv_imgproc.dir/src/tables.cpp.o
  766. [ 18%] Building CXX object modules/imgproc/CMakeFiles/opencv_imgproc.dir/src/templmatch.cpp.o
  767. [ 18%] Building CXX object modules/imgproc/CMakeFiles/opencv_imgproc.dir/src/thresh.cpp.o
  768. [ 18%] Building CXX object modules/imgproc/CMakeFiles/opencv_imgproc.dir/src/utils.cpp.o
  769. [ 19%] Building CXX object modules/imgproc/CMakeFiles/opencv_imgproc.dir/opencl_kernels_imgproc.cpp.o
  770. [ 19%] Building CXX object modules/imgproc/CMakeFiles/opencv_imgproc.dir/src/imgwarp.sse4_1.cpp.o
  771. [ 19%] Building CXX object modules/imgproc/CMakeFiles/opencv_imgproc.dir/src/resize.sse4_1.cpp.o
  772. [ 19%] Building CXX object modules/imgproc/CMakeFiles/opencv_imgproc.dir/accum.sse4_1.cpp.o
  773. [ 19%] Building CXX object modules/imgproc/CMakeFiles/opencv_imgproc.dir/box_filter.sse4_1.cpp.o
  774. [ 19%] Building CXX object modules/imgproc/CMakeFiles/opencv_imgproc.dir/filter.sse4_1.cpp.o
  775. [ 19%] Building CXX object modules/imgproc/CMakeFiles/opencv_imgproc.dir/color_hsv.sse4_1.cpp.o
  776. [ 19%] Building CXX object modules/imgproc/CMakeFiles/opencv_imgproc.dir/color_rgb.sse4_1.cpp.o
  777. [ 19%] Building CXX object modules/imgproc/CMakeFiles/opencv_imgproc.dir/color_yuv.sse4_1.cpp.o
  778. [ 19%] Building CXX object modules/imgproc/CMakeFiles/opencv_imgproc.dir/median_blur.sse4_1.cpp.o
  779. [ 19%] Building CXX object modules/imgproc/CMakeFiles/opencv_imgproc.dir/morph.sse4_1.cpp.o
  780. [ 19%] Building CXX object modules/imgproc/CMakeFiles/opencv_imgproc.dir/smooth.sse4_1.cpp.o
  781. [ 19%] Building CXX object modules/imgproc/CMakeFiles/opencv_imgproc.dir/src/corner.avx.cpp.o
  782. [ 20%] Building CXX object modules/imgproc/CMakeFiles/opencv_imgproc.dir/accum.avx.cpp.o
  783. [ 20%] Building CXX object modules/imgproc/CMakeFiles/opencv_imgproc.dir/src/imgwarp.avx2.cpp.o
  784. [ 20%] Building CXX object modules/imgproc/CMakeFiles/opencv_imgproc.dir/src/resize.avx2.cpp.o
  785. [ 20%] Building CXX object modules/imgproc/CMakeFiles/opencv_imgproc.dir/accum.avx2.cpp.o
  786. [ 20%] Building CXX object modules/imgproc/CMakeFiles/opencv_imgproc.dir/bilateral_filter.avx2.cpp.o
  787. [ 20%] Building CXX object modules/imgproc/CMakeFiles/opencv_imgproc.dir/box_filter.avx2.cpp.o
  788. [ 20%] Building CXX object modules/imgproc/CMakeFiles/opencv_imgproc.dir/filter.avx2.cpp.o
  789. [ 20%] Building CXX object modules/imgproc/CMakeFiles/opencv_imgproc.dir/color_hsv.avx2.cpp.o
  790. [ 20%] Building CXX object modules/imgproc/CMakeFiles/opencv_imgproc.dir/color_rgb.avx2.cpp.o
  791. [ 20%] Building CXX object modules/imgproc/CMakeFiles/opencv_imgproc.dir/color_yuv.avx2.cpp.o
  792. [ 20%] Building CXX object modules/imgproc/CMakeFiles/opencv_imgproc.dir/median_blur.avx2.cpp.o
  793. [ 20%] Building CXX object modules/imgproc/CMakeFiles/opencv_imgproc.dir/morph.avx2.cpp.o
  794. [ 20%] Building CXX object modules/imgproc/CMakeFiles/opencv_imgproc.dir/smooth.avx2.cpp.o
  795. [ 21%] Building CXX object modules/imgproc/CMakeFiles/opencv_imgproc.dir/sumpixels.avx2.cpp.o
  796. [ 21%] Building CXX object modules/imgproc/CMakeFiles/opencv_imgproc.dir/sumpixels.avx512_skx.cpp.o
  797. [ 21%] Linking CXX shared library ../../lib/libopencv_imgproc.so
  798. [ 21%] Built target opencv_imgproc
  799. Scanning dependencies of target opencv_imgcodecs
  800. [ 21%] Building CXX object modules/imgcodecs/CMakeFiles/opencv_imgcodecs.dir/src/loadsave.cpp.o
  801. [ 21%] Building CXX object modules/imgcodecs/CMakeFiles/opencv_imgcodecs.dir/src/utils.cpp.o
  802. [ 21%] Building CXX object modules/imgcodecs/CMakeFiles/opencv_imgcodecs.dir/src/grfmt_base.cpp.o
  803. [ 21%] Building CXX object modules/imgcodecs/CMakeFiles/opencv_imgcodecs.dir/src/grfmt_bmp.cpp.o
  804. [ 21%] Building CXX object modules/imgcodecs/CMakeFiles/opencv_imgcodecs.dir/src/grfmt_exr.cpp.o
  805. [ 21%] Building CXX object modules/imgcodecs/CMakeFiles/opencv_imgcodecs.dir/src/grfmt_gdal.cpp.o
  806. [ 21%] Building CXX object modules/imgcodecs/CMakeFiles/opencv_imgcodecs.dir/src/grfmt_gdcm.cpp.o
  807. [ 21%] Building CXX object modules/imgcodecs/CMakeFiles/opencv_imgcodecs.dir/src/grfmt_hdr.cpp.o
  808. [ 22%] Building CXX object modules/imgcodecs/CMakeFiles/opencv_imgcodecs.dir/src/grfmt_jpeg.cpp.o
  809. [ 22%] Building CXX object modules/imgcodecs/CMakeFiles/opencv_imgcodecs.dir/src/grfmt_jpeg2000.cpp.o
  810. [ 22%] Building CXX object modules/imgcodecs/CMakeFiles/opencv_imgcodecs.dir/src/grfmt_jpeg2000_openjpeg.cpp.o
  811. [ 22%] Building CXX object modules/imgcodecs/CMakeFiles/opencv_imgcodecs.dir/src/grfmt_pam.cpp.o
  812. [ 22%] Building CXX object modules/imgcodecs/CMakeFiles/opencv_imgcodecs.dir/src/grfmt_pfm.cpp.o
  813. [ 22%] Building CXX object modules/imgcodecs/CMakeFiles/opencv_imgcodecs.dir/src/grfmt_png.cpp.o
  814. [ 22%] Building CXX object modules/imgcodecs/CMakeFiles/opencv_imgcodecs.dir/src/grfmt_pxm.cpp.o
  815. [ 22%] Building CXX object modules/imgcodecs/CMakeFiles/opencv_imgcodecs.dir/src/grfmt_sunras.cpp.o
  816. [ 22%] Building CXX object modules/imgcodecs/CMakeFiles/opencv_imgcodecs.dir/src/grfmt_tiff.cpp.o
  817. [ 22%] Building CXX object modules/imgcodecs/CMakeFiles/opencv_imgcodecs.dir/src/grfmt_webp.cpp.o
  818. [ 22%] Building CXX object modules/imgcodecs/CMakeFiles/opencv_imgcodecs.dir/src/bitstrm.cpp.o
  819. [ 22%] Building CXX object modules/imgcodecs/CMakeFiles/opencv_imgcodecs.dir/src/rgbe.cpp.o
  820. [ 22%] Building CXX object modules/imgcodecs/CMakeFiles/opencv_imgcodecs.dir/src/exif.cpp.o
  821. [ 23%] Linking CXX shared library ../../lib/libopencv_imgcodecs.so
  822. [ 23%] Built target opencv_imgcodecs
  823. Scanning dependencies of target opencv_videoio
  824. [ 23%] Building CXX object modules/videoio/CMakeFiles/opencv_videoio.dir/src/videoio_registry.cpp.o
  825. [ 23%] Building CXX object modules/videoio/CMakeFiles/opencv_videoio.dir/src/videoio_c.cpp.o
  826. [ 23%] Building CXX object modules/videoio/CMakeFiles/opencv_videoio.dir/src/cap.cpp.o
  827. [ 23%] Building CXX object modules/videoio/CMakeFiles/opencv_videoio.dir/src/cap_images.cpp.o
  828. [ 23%] Building CXX object modules/videoio/CMakeFiles/opencv_videoio.dir/src/cap_mjpeg_encoder.cpp.o
  829. [ 23%] Building CXX object modules/videoio/CMakeFiles/opencv_videoio.dir/src/cap_mjpeg_decoder.cpp.o
  830. [ 23%] Building CXX object modules/videoio/CMakeFiles/opencv_videoio.dir/src/backend_plugin.cpp.o
  831. [ 24%] Building CXX object modules/videoio/CMakeFiles/opencv_videoio.dir/src/backend_static.cpp.o
  832. [ 24%] Building CXX object modules/videoio/CMakeFiles/opencv_videoio.dir/src/container_avi.cpp.o
  833. [ 24%] Building CXX object modules/videoio/CMakeFiles/opencv_videoio.dir/src/cap_dc1394_v2.cpp.o
  834. [ 24%] Building CXX object modules/videoio/CMakeFiles/opencv_videoio.dir/src/cap_gstreamer.cpp.o
  835. [ 24%] Building CXX object modules/videoio/CMakeFiles/opencv_videoio.dir/src/cap_v4l.cpp.o
  836. [ 24%] Building CXX object modules/videoio/CMakeFiles/opencv_videoio.dir/src/cap_ffmpeg.cpp.o
  837. [ 24%] Linking CXX shared library ../../lib/libopencv_videoio.so
  838. [ 24%] Built target opencv_videoio
  839. Scanning dependencies of target opencv_highgui
  840. [ 25%] Building CXX object modules/highgui/CMakeFiles/opencv_highgui.dir/src/window.cpp.o
  841. [ 25%] Building CXX object modules/highgui/CMakeFiles/opencv_highgui.dir/src/roiSelector.cpp.o
  842. [ 25%] Building CXX object modules/highgui/CMakeFiles/opencv_highgui.dir/src/window_gtk.cpp.o
  843. [ 25%] Linking CXX shared library ../../lib/libopencv_highgui.so
  844. [ 25%] Built target opencv_highgui
  845. Scanning dependencies of target opencv_ts
  846. [ 25%] Building CXX object modules/ts/CMakeFiles/opencv_ts.dir/src/cuda_perf.cpp.o
  847. [ 25%] Building CXX object modules/ts/CMakeFiles/opencv_ts.dir/src/cuda_test.cpp.o
  848. [ 25%] Building CXX object modules/ts/CMakeFiles/opencv_ts.dir/src/ocl_perf.cpp.o
  849. [ 25%] Building CXX object modules/ts/CMakeFiles/opencv_ts.dir/src/ocl_test.cpp.o
  850. [ 25%] Building CXX object modules/ts/CMakeFiles/opencv_ts.dir/src/ts.cpp.o
  851. [ 25%] Building CXX object modules/ts/CMakeFiles/opencv_ts.dir/src/ts_arrtest.cpp.o
  852. [ 25%] Building CXX object modules/ts/CMakeFiles/opencv_ts.dir/src/ts_func.cpp.o
  853. [ 25%] Building CXX object modules/ts/CMakeFiles/opencv_ts.dir/src/ts_gtest.cpp.o
  854. [ 26%] Building CXX object modules/ts/CMakeFiles/opencv_ts.dir/src/ts_perf.cpp.o
  855. [ 26%] Building CXX object modules/ts/CMakeFiles/opencv_ts.dir/src/ts_tags.cpp.o
  856. [ 26%] Linking CXX static library ../../lib/libopencv_ts.a
  857. [ 26%] Built target opencv_ts
  858. Scanning dependencies of target opencv_perf_core
  859. [ 26%] Building CXX object modules/core/CMakeFiles/opencv_perf_core.dir/perf/cuda/perf_gpumat.cpp.o
  860. [ 26%] Building CXX object modules/core/CMakeFiles/opencv_perf_core.dir/perf/opencl/perf_arithm.cpp.o
  861. [ 26%] Building CXX object modules/core/CMakeFiles/opencv_perf_core.dir/perf/opencl/perf_bufferpool.cpp.o
  862. [ 26%] Building CXX object modules/core/CMakeFiles/opencv_perf_core.dir/perf/opencl/perf_channels.cpp.o
  863. [ 26%] Building CXX object modules/core/CMakeFiles/opencv_perf_core.dir/perf/opencl/perf_dxt.cpp.o
  864. [ 26%] Building CXX object modules/core/CMakeFiles/opencv_perf_core.dir/perf/opencl/perf_gemm.cpp.o
  865. [ 26%] Building CXX object modules/core/CMakeFiles/opencv_perf_core.dir/perf/opencl/perf_matop.cpp.o
  866. [ 27%] Building CXX object modules/core/CMakeFiles/opencv_perf_core.dir/perf/opencl/perf_usage_flags.cpp.o
  867. [ 27%] Building CXX object modules/core/CMakeFiles/opencv_perf_core.dir/perf/perf_abs.cpp.o
  868. [ 27%] Building CXX object modules/core/CMakeFiles/opencv_perf_core.dir/perf/perf_addWeighted.cpp.o
  869. [ 27%] Building CXX object modules/core/CMakeFiles/opencv_perf_core.dir/perf/perf_allocation.cpp.o
  870. [ 27%] Building CXX object modules/core/CMakeFiles/opencv_perf_core.dir/perf/perf_arithm.cpp.o
  871. [ 27%] Building CXX object modules/core/CMakeFiles/opencv_perf_core.dir/perf/perf_bitwise.cpp.o
  872. [ 27%] Building CXX object modules/core/CMakeFiles/opencv_perf_core.dir/perf/perf_compare.cpp.o
  873. [ 27%] Building CXX object modules/core/CMakeFiles/opencv_perf_core.dir/perf/perf_convertTo.cpp.o
  874. [ 27%] Building CXX object modules/core/CMakeFiles/opencv_perf_core.dir/perf/perf_cvround.cpp.o
  875. [ 27%] Building CXX object modules/core/CMakeFiles/opencv_perf_core.dir/perf/perf_dft.cpp.o
  876. [ 27%] Building CXX object modules/core/CMakeFiles/opencv_perf_core.dir/perf/perf_dot.cpp.o
  877. [ 27%] Building CXX object modules/core/CMakeFiles/opencv_perf_core.dir/perf/perf_inRange.cpp.o
  878. [ 28%] Building CXX object modules/core/CMakeFiles/opencv_perf_core.dir/perf/perf_io_base64.cpp.o
  879. [ 28%] Building CXX object modules/core/CMakeFiles/opencv_perf_core.dir/perf/perf_lut.cpp.o
  880. [ 28%] Building CXX object modules/core/CMakeFiles/opencv_perf_core.dir/perf/perf_main.cpp.o
  881. [ 28%] Building CXX object modules/core/CMakeFiles/opencv_perf_core.dir/perf/perf_mat.cpp.o
  882. [ 28%] Building CXX object modules/core/CMakeFiles/opencv_perf_core.dir/perf/perf_math.cpp.o
  883. [ 28%] Building CXX object modules/core/CMakeFiles/opencv_perf_core.dir/perf/perf_merge.cpp.o
  884. [ 28%] Building CXX object modules/core/CMakeFiles/opencv_perf_core.dir/perf/perf_minmaxloc.cpp.o
  885. [ 28%] Building CXX object modules/core/CMakeFiles/opencv_perf_core.dir/perf/perf_norm.cpp.o
  886. [ 28%] Building CXX object modules/core/CMakeFiles/opencv_perf_core.dir/perf/perf_reduce.cpp.o
  887. [ 28%] Building CXX object modules/core/CMakeFiles/opencv_perf_core.dir/perf/perf_sort.cpp.o
  888. [ 28%] Building CXX object modules/core/CMakeFiles/opencv_perf_core.dir/perf/perf_split.cpp.o
  889. [ 28%] Building CXX object modules/core/CMakeFiles/opencv_perf_core.dir/perf/perf_stat.cpp.o
  890. [ 28%] Building CXX object modules/core/CMakeFiles/opencv_perf_core.dir/perf/perf_umat.cpp.o
  891. [ 29%] Linking CXX executable ../../bin/opencv_perf_core
  892. [ 29%] Built target opencv_perf_core
  893. Scanning dependencies of target opencv_test_core
  894. [ 29%] Building CXX object modules/core/CMakeFiles/opencv_test_core.dir/test/ocl/test_arithm.cpp.o
  895. [ 29%] Building CXX object modules/core/CMakeFiles/opencv_test_core.dir/test/ocl/test_channels.cpp.o
  896. [ 29%] Building CXX object modules/core/CMakeFiles/opencv_test_core.dir/test/ocl/test_dft.cpp.o
  897. [ 29%] Building CXX object modules/core/CMakeFiles/opencv_test_core.dir/test/ocl/test_gemm.cpp.o
  898. [ 29%] Building CXX object modules/core/CMakeFiles/opencv_test_core.dir/test/ocl/test_image2d.cpp.o
  899. [ 29%] Building CXX object modules/core/CMakeFiles/opencv_test_core.dir/test/ocl/test_matrix_expr.cpp.o
  900. [ 29%] Building CXX object modules/core/CMakeFiles/opencv_test_core.dir/test/ocl/test_matrix_operation.cpp.o
  901. [ 29%] Building CXX object modules/core/CMakeFiles/opencv_test_core.dir/test/ocl/test_opencl.cpp.o
  902. [ 30%] Building CXX object modules/core/CMakeFiles/opencv_test_core.dir/test/test_arithm.cpp.o
  903. [ 30%] Building CXX object modules/core/CMakeFiles/opencv_test_core.dir/test/test_async.cpp.o
  904. [ 30%] Building CXX object modules/core/CMakeFiles/opencv_test_core.dir/test/test_concatenation.cpp.o
  905. [ 30%] Building CXX object modules/core/CMakeFiles/opencv_test_core.dir/test/test_conjugate_gradient.cpp.o
  906. [ 30%] Building CXX object modules/core/CMakeFiles/opencv_test_core.dir/test/test_countnonzero.cpp.o
  907. [ 30%] Building CXX object modules/core/CMakeFiles/opencv_test_core.dir/test/test_cuda.cpp.o
  908. [ 30%] Building CXX object modules/core/CMakeFiles/opencv_test_core.dir/test/test_downhill_simplex.cpp.o
  909. [ 30%] Building CXX object modules/core/CMakeFiles/opencv_test_core.dir/test/test_ds.cpp.o
  910. [ 30%] Building CXX object modules/core/CMakeFiles/opencv_test_core.dir/test/test_dxt.cpp.o
  911. [ 30%] Building CXX object modules/core/CMakeFiles/opencv_test_core.dir/test/test_eigen.cpp.o
  912. [ 30%] Building CXX object modules/core/CMakeFiles/opencv_test_core.dir/test/test_hal_core.cpp.o
  913. [ 30%] Building CXX object modules/core/CMakeFiles/opencv_test_core.dir/test/test_intrin.cpp.o
  914. [ 30%] Building CXX object modules/core/CMakeFiles/opencv_test_core.dir/test/test_intrin_emulator.cpp.o
  915. [ 31%] Building CXX object modules/core/CMakeFiles/opencv_test_core.dir/test/test_io.cpp.o
  916. [ 31%] Building CXX object modules/core/CMakeFiles/opencv_test_core.dir/test/test_logtagconfigparser.cpp.o
  917. [ 31%] Building CXX object modules/core/CMakeFiles/opencv_test_core.dir/test/test_logtagmanager.cpp.o
  918. [ 31%] Building CXX object modules/core/CMakeFiles/opencv_test_core.dir/test/test_lpsolver.cpp.o
  919. [ 31%] Building CXX object modules/core/CMakeFiles/opencv_test_core.dir/test/test_main.cpp.o
  920. [ 31%] Building CXX object modules/core/CMakeFiles/opencv_test_core.dir/test/test_mat.cpp.o
  921. [ 31%] Building CXX object modules/core/CMakeFiles/opencv_test_core.dir/test/test_math.cpp.o
  922. [ 31%] Building CXX object modules/core/CMakeFiles/opencv_test_core.dir/test/test_misc.cpp.o
  923. [ 31%] Building CXX object modules/core/CMakeFiles/opencv_test_core.dir/test/test_opencl.cpp.o
  924. [ 31%] Building CXX object modules/core/CMakeFiles/opencv_test_core.dir/test/test_operations.cpp.o
  925. [ 31%] Building CXX object modules/core/CMakeFiles/opencv_test_core.dir/test/test_ptr.cpp.o
  926. [ 31%] Building CXX object modules/core/CMakeFiles/opencv_test_core.dir/test/test_quaternion.cpp.o
  927. [ 32%] Building CXX object modules/core/CMakeFiles/opencv_test_core.dir/test/test_rand.cpp.o
  928. [ 32%] Building CXX object modules/core/CMakeFiles/opencv_test_core.dir/test/test_rotatedrect.cpp.o
  929. [ 32%] Building CXX object modules/core/CMakeFiles/opencv_test_core.dir/test/test_umat.cpp.o
  930. [ 32%] Building CXX object modules/core/CMakeFiles/opencv_test_core.dir/test/test_utils.cpp.o
  931. [ 32%] Building CXX object modules/core/CMakeFiles/opencv_test_core.dir/test/test_intrin128.sse2.cpp.o
  932. [ 32%] Building CXX object modules/core/CMakeFiles/opencv_test_core.dir/test/test_intrin128.sse3.cpp.o
  933. [ 32%] Building CXX object modules/core/CMakeFiles/opencv_test_core.dir/test/test_intrin128.ssse3.cpp.o
  934. [ 32%] Building CXX object modules/core/CMakeFiles/opencv_test_core.dir/test/test_intrin128.sse4_1.cpp.o
  935. [ 32%] Building CXX object modules/core/CMakeFiles/opencv_test_core.dir/test/test_intrin128.sse4_2.cpp.o
  936. [ 32%] Building CXX object modules/core/CMakeFiles/opencv_test_core.dir/test/test_intrin128.fp16.cpp.o
  937. [ 32%] Building CXX object modules/core/CMakeFiles/opencv_test_core.dir/test/test_intrin128.avx.cpp.o
  938. [ 32%] Building CXX object modules/core/CMakeFiles/opencv_test_core.dir/test/test_intrin128.avx2.cpp.o
  939. [ 32%] Building CXX object modules/core/CMakeFiles/opencv_test_core.dir/test/test_intrin256.avx2.cpp.o
  940. [ 33%] Building CXX object modules/core/CMakeFiles/opencv_test_core.dir/test/test_intrin128.avx512_skx.cpp.o
  941. [ 33%] Building CXX object modules/core/CMakeFiles/opencv_test_core.dir/test/test_intrin256.avx512_skx.cpp.o
  942. [ 33%] Building CXX object modules/core/CMakeFiles/opencv_test_core.dir/test/test_intrin512.avx512_skx.cpp.o
  943. [ 33%] Linking CXX executable ../../bin/opencv_test_core
  944. [ 33%] Built target opencv_test_core
  945. Scanning dependencies of target opencv_flann
  946. [ 33%] Building CXX object modules/flann/CMakeFiles/opencv_flann.dir/src/flann.cpp.o
  947. [ 33%] Building CXX object modules/flann/CMakeFiles/opencv_flann.dir/src/miniflann.cpp.o
  948. [ 33%] Linking CXX shared library ../../lib/libopencv_flann.so
  949. [ 33%] Built target opencv_flann
  950. Scanning dependencies of target opencv_test_flann
  951. [ 33%] Building CXX object modules/flann/CMakeFiles/opencv_test_flann.dir/test/test_lshtable_badarg.cpp.o
  952. [ 33%] Building CXX object modules/flann/CMakeFiles/opencv_test_flann.dir/test/test_main.cpp.o
  953. [ 33%] Linking CXX executable ../../bin/opencv_test_flann
  954. [ 33%] Built target opencv_test_flann
  955. Scanning dependencies of target opencv_perf_imgproc
  956. [ 33%] Building CXX object modules/imgproc/CMakeFiles/opencv_perf_imgproc.dir/perf/opencl/perf_3vs4.cpp.o
  957. [ 33%] Building CXX object modules/imgproc/CMakeFiles/opencv_perf_imgproc.dir/perf/opencl/perf_accumulate.cpp.o
  958. [ 33%] Building CXX object modules/imgproc/CMakeFiles/opencv_perf_imgproc.dir/perf/opencl/perf_blend.cpp.o
  959. [ 34%] Building CXX object modules/imgproc/CMakeFiles/opencv_perf_imgproc.dir/perf/opencl/perf_color.cpp.o
  960. [ 34%] Building CXX object modules/imgproc/CMakeFiles/opencv_perf_imgproc.dir/perf/opencl/perf_filters.cpp.o
  961. [ 34%] Building CXX object modules/imgproc/CMakeFiles/opencv_perf_imgproc.dir/perf/opencl/perf_gftt.cpp.o
  962. [ 34%] Building CXX object modules/imgproc/CMakeFiles/opencv_perf_imgproc.dir/perf/opencl/perf_houghlines.cpp.o
  963. [ 34%] Building CXX object modules/imgproc/CMakeFiles/opencv_perf_imgproc.dir/perf/opencl/perf_imgproc.cpp.o
  964. [ 34%] Building CXX object modules/imgproc/CMakeFiles/opencv_perf_imgproc.dir/perf/opencl/perf_imgwarp.cpp.o
  965. [ 34%] Building CXX object modules/imgproc/CMakeFiles/opencv_perf_imgproc.dir/perf/opencl/perf_matchTemplate.cpp.o
  966. [ 34%] Building CXX object modules/imgproc/CMakeFiles/opencv_perf_imgproc.dir/perf/opencl/perf_moments.cpp.o
  967. [ 34%] Building CXX object modules/imgproc/CMakeFiles/opencv_perf_imgproc.dir/perf/opencl/perf_pyramid.cpp.o
  968. [ 34%] Building CXX object modules/imgproc/CMakeFiles/opencv_perf_imgproc.dir/perf/perf_accumulate.cpp.o
  969. [ 34%] Building CXX object modules/imgproc/CMakeFiles/opencv_perf_imgproc.dir/perf/perf_bilateral.cpp.o
  970. [ 34%] Building CXX object modules/imgproc/CMakeFiles/opencv_perf_imgproc.dir/perf/perf_blur.cpp.o
  971. [ 34%] Building CXX object modules/imgproc/CMakeFiles/opencv_perf_imgproc.dir/perf/perf_canny.cpp.o
  972. [ 35%] Building CXX object modules/imgproc/CMakeFiles/opencv_perf_imgproc.dir/perf/perf_contours.cpp.o
  973. [ 35%] Building CXX object modules/imgproc/CMakeFiles/opencv_perf_imgproc.dir/perf/perf_corners.cpp.o
  974. [ 35%] Building CXX object modules/imgproc/CMakeFiles/opencv_perf_imgproc.dir/perf/perf_cvt_color.cpp.o
  975. [ 35%] Building CXX object modules/imgproc/CMakeFiles/opencv_perf_imgproc.dir/perf/perf_distanceTransform.cpp.o
  976. [ 35%] Building CXX object modules/imgproc/CMakeFiles/opencv_perf_imgproc.dir/perf/perf_filter2d.cpp.o
  977. [ 35%] Building CXX object modules/imgproc/CMakeFiles/opencv_perf_imgproc.dir/perf/perf_floodfill.cpp.o
  978. [ 35%] Building CXX object modules/imgproc/CMakeFiles/opencv_perf_imgproc.dir/perf/perf_goodFeaturesToTrack.cpp.o
  979. [ 35%] Building CXX object modules/imgproc/CMakeFiles/opencv_perf_imgproc.dir/perf/perf_histogram.cpp.o
  980. [ 35%] Building CXX object modules/imgproc/CMakeFiles/opencv_perf_imgproc.dir/perf/perf_houghcircles.cpp.o
  981. [ 35%] Building CXX object modules/imgproc/CMakeFiles/opencv_perf_imgproc.dir/perf/perf_houghlines.cpp.o
  982. [ 35%] Building CXX object modules/imgproc/CMakeFiles/opencv_perf_imgproc.dir/perf/perf_integral.cpp.o
  983. [ 35%] Building CXX object modules/imgproc/CMakeFiles/opencv_perf_imgproc.dir/perf/perf_main.cpp.o
  984. [ 36%] Building CXX object modules/imgproc/CMakeFiles/opencv_perf_imgproc.dir/perf/perf_matchTemplate.cpp.o
  985. [ 36%] Building CXX object modules/imgproc/CMakeFiles/opencv_perf_imgproc.dir/perf/perf_moments.cpp.o
  986. [ 36%] Building CXX object modules/imgproc/CMakeFiles/opencv_perf_imgproc.dir/perf/perf_morph.cpp.o
  987. [ 36%] Building CXX object modules/imgproc/CMakeFiles/opencv_perf_imgproc.dir/perf/perf_phasecorr.cpp.o
  988. [ 36%] Building CXX object modules/imgproc/CMakeFiles/opencv_perf_imgproc.dir/perf/perf_pyramids.cpp.o
  989. [ 36%] Building CXX object modules/imgproc/CMakeFiles/opencv_perf_imgproc.dir/perf/perf_remap.cpp.o
  990. [ 36%] Building CXX object modules/imgproc/CMakeFiles/opencv_perf_imgproc.dir/perf/perf_resize.cpp.o
  991. [ 36%] Building CXX object modules/imgproc/CMakeFiles/opencv_perf_imgproc.dir/perf/perf_sepfilters.cpp.o
  992. [ 36%] Building CXX object modules/imgproc/CMakeFiles/opencv_perf_imgproc.dir/perf/perf_spatialgradient.cpp.o
  993. [ 36%] Building CXX object modules/imgproc/CMakeFiles/opencv_perf_imgproc.dir/perf/perf_threshold.cpp.o
  994. [ 36%] Building CXX object modules/imgproc/CMakeFiles/opencv_perf_imgproc.dir/perf/perf_warp.cpp.o
  995. [ 36%] Linking CXX executable ../../bin/opencv_perf_imgproc
  996. [ 36%] Built target opencv_perf_imgproc
  997. Scanning dependencies of target opencv_test_imgproc
  998. [ 36%] Building CXX object modules/imgproc/CMakeFiles/opencv_test_imgproc.dir/test/ocl/test_accumulate.cpp.o
  999. [ 36%] Building CXX object modules/imgproc/CMakeFiles/opencv_test_imgproc.dir/test/ocl/test_blend.cpp.o
  1000. [ 37%] Building CXX object modules/imgproc/CMakeFiles/opencv_test_imgproc.dir/test/ocl/test_boxfilter.cpp.o
  1001. [ 37%] Building CXX object modules/imgproc/CMakeFiles/opencv_test_imgproc.dir/test/ocl/test_canny.cpp.o
  1002. [ 37%] Building CXX object modules/imgproc/CMakeFiles/opencv_test_imgproc.dir/test/ocl/test_color.cpp.o
  1003. [ 37%] Building CXX object modules/imgproc/CMakeFiles/opencv_test_imgproc.dir/test/ocl/test_filter2d.cpp.o
  1004. [ 37%] Building CXX object modules/imgproc/CMakeFiles/opencv_test_imgproc.dir/test/ocl/test_filters.cpp.o
  1005. [ 37%] Building CXX object modules/imgproc/CMakeFiles/opencv_test_imgproc.dir/test/ocl/test_gftt.cpp.o
  1006. [ 37%] Building CXX object modules/imgproc/CMakeFiles/opencv_test_imgproc.dir/test/ocl/test_histogram.cpp.o
  1007. [ 37%] Building CXX object modules/imgproc/CMakeFiles/opencv_test_imgproc.dir/test/ocl/test_houghlines.cpp.o
  1008. [ 37%] Building CXX object modules/imgproc/CMakeFiles/opencv_test_imgproc.dir/test/ocl/test_imgproc.cpp.o
  1009. [ 37%] Building CXX object modules/imgproc/CMakeFiles/opencv_test_imgproc.dir/test/ocl/test_match_template.cpp.o
  1010. [ 37%] Building CXX object modules/imgproc/CMakeFiles/opencv_test_imgproc.dir/test/ocl/test_medianfilter.cpp.o
  1011. [ 37%] Building CXX object modules/imgproc/CMakeFiles/opencv_test_imgproc.dir/test/ocl/test_pyramids.cpp.o
  1012. [ 37%] Building CXX object modules/imgproc/CMakeFiles/opencv_test_imgproc.dir/test/ocl/test_sepfilter2d.cpp.o
  1013. [ 38%] Building CXX object modules/imgproc/CMakeFiles/opencv_test_imgproc.dir/test/ocl/test_warp.cpp.o
  1014. [ 38%] Building CXX object modules/imgproc/CMakeFiles/opencv_test_imgproc.dir/test/test_approxpoly.cpp.o
  1015. [ 38%] Building CXX object modules/imgproc/CMakeFiles/opencv_test_imgproc.dir/test/test_bilateral_filter.cpp.o
  1016. [ 38%] Building CXX object modules/imgproc/CMakeFiles/opencv_test_imgproc.dir/test/test_boundingrect.cpp.o
  1017. [ 38%] Building CXX object modules/imgproc/CMakeFiles/opencv_test_imgproc.dir/test/test_canny.cpp.o
  1018. [ 38%] Building CXX object modules/imgproc/CMakeFiles/opencv_test_imgproc.dir/test/test_color.cpp.o
  1019. [ 38%] Building CXX object modules/imgproc/CMakeFiles/opencv_test_imgproc.dir/test/test_connectedcomponents.cpp.o
  1020. [ 38%] Building CXX object modules/imgproc/CMakeFiles/opencv_test_imgproc.dir/test/test_contours.cpp.o
  1021. [ 38%] Building CXX object modules/imgproc/CMakeFiles/opencv_test_imgproc.dir/test/test_convhull.cpp.o
  1022. [ 38%] Building CXX object modules/imgproc/CMakeFiles/opencv_test_imgproc.dir/test/test_cvtyuv.cpp.o
  1023. [ 38%] Building CXX object modules/imgproc/CMakeFiles/opencv_test_imgproc.dir/test/test_distancetransform.cpp.o
  1024. [ 38%] Building CXX object modules/imgproc/CMakeFiles/opencv_test_imgproc.dir/test/test_drawing.cpp.o
  1025. [ 39%] Building CXX object modules/imgproc/CMakeFiles/opencv_test_imgproc.dir/test/test_emd.cpp.o
  1026. [ 39%] Building CXX object modules/imgproc/CMakeFiles/opencv_test_imgproc.dir/test/test_filter.cpp.o
  1027. [ 39%] Building CXX object modules/imgproc/CMakeFiles/opencv_test_imgproc.dir/test/test_fitellipse.cpp.o
  1028. [ 39%] Building CXX object modules/imgproc/CMakeFiles/opencv_test_imgproc.dir/test/test_fitellipse_ams.cpp.o
  1029. [ 39%] Building CXX object modules/imgproc/CMakeFiles/opencv_test_imgproc.dir/test/test_fitellipse_direct.cpp.o
  1030. [ 39%] Building CXX object modules/imgproc/CMakeFiles/opencv_test_imgproc.dir/test/test_floodfill.cpp.o
  1031. [ 39%] Building CXX object modules/imgproc/CMakeFiles/opencv_test_imgproc.dir/test/test_goodfeaturetotrack.cpp.o
  1032. [ 39%] Building CXX object modules/imgproc/CMakeFiles/opencv_test_imgproc.dir/test/test_grabcut.cpp.o
  1033. [ 39%] Building CXX object modules/imgproc/CMakeFiles/opencv_test_imgproc.dir/test/test_histograms.cpp.o
  1034. [ 39%] Building CXX object modules/imgproc/CMakeFiles/opencv_test_imgproc.dir/test/test_houghcircles.cpp.o
  1035. [ 39%] Building CXX object modules/imgproc/CMakeFiles/opencv_test_imgproc.dir/test/test_houghlines.cpp.o
  1036. [ 39%] Building CXX object modules/imgproc/CMakeFiles/opencv_test_imgproc.dir/test/test_imgproc_umat.cpp.o
  1037. [ 39%] Building CXX object modules/imgproc/CMakeFiles/opencv_test_imgproc.dir/test/test_imgwarp.cpp.o
  1038. [ 40%] Building CXX object modules/imgproc/CMakeFiles/opencv_test_imgproc.dir/test/test_imgwarp_strict.cpp.o
  1039. [ 40%] Building CXX object modules/imgproc/CMakeFiles/opencv_test_imgproc.dir/test/test_intelligent_scissors.cpp.o
  1040. [ 40%] Building CXX object modules/imgproc/CMakeFiles/opencv_test_imgproc.dir/test/test_intersectconvexconvex.cpp.o
  1041. [ 40%] Building CXX object modules/imgproc/CMakeFiles/opencv_test_imgproc.dir/test/test_intersection.cpp.o
  1042. [ 40%] Building CXX object modules/imgproc/CMakeFiles/opencv_test_imgproc.dir/test/test_lsd.cpp.o
  1043. [ 40%] Building CXX object modules/imgproc/CMakeFiles/opencv_test_imgproc.dir/test/test_main.cpp.o
  1044. [ 40%] Building CXX object modules/imgproc/CMakeFiles/opencv_test_imgproc.dir/test/test_moments.cpp.o
  1045. [ 40%] Building CXX object modules/imgproc/CMakeFiles/opencv_test_imgproc.dir/test/test_pc.cpp.o
  1046. [ 40%] Building CXX object modules/imgproc/CMakeFiles/opencv_test_imgproc.dir/test/test_resize_bitexact.cpp.o
  1047. [ 40%] Building CXX object modules/imgproc/CMakeFiles/opencv_test_imgproc.dir/test/test_smooth_bitexact.cpp.o
  1048. [ 40%] Building CXX object modules/imgproc/CMakeFiles/opencv_test_imgproc.dir/test/test_subdivision2d.cpp.o
  1049. [ 40%] Building CXX object modules/imgproc/CMakeFiles/opencv_test_imgproc.dir/test/test_templmatch.cpp.o
  1050. [ 41%] Building CXX object modules/imgproc/CMakeFiles/opencv_test_imgproc.dir/test/test_templmatchmask.cpp.o
  1051. [ 41%] Building CXX object modules/imgproc/CMakeFiles/opencv_test_imgproc.dir/test/test_thresh.cpp.o
  1052. [ 41%] Building CXX object modules/imgproc/CMakeFiles/opencv_test_imgproc.dir/test/test_watershed.cpp.o
  1053. [ 41%] Linking CXX executable ../../bin/opencv_test_imgproc
  1054. [ 41%] Built target opencv_test_imgproc
  1055. Scanning dependencies of target opencv_ml
  1056. [ 41%] Building CXX object modules/ml/CMakeFiles/opencv_ml.dir/src/ann_mlp.cpp.o
  1057. [ 41%] Building CXX object modules/ml/CMakeFiles/opencv_ml.dir/src/boost.cpp.o
  1058. [ 42%] Building CXX object modules/ml/CMakeFiles/opencv_ml.dir/src/data.cpp.o
  1059. [ 42%] Building CXX object modules/ml/CMakeFiles/opencv_ml.dir/src/em.cpp.o
  1060. [ 42%] Building CXX object modules/ml/CMakeFiles/opencv_ml.dir/src/gbt.cpp.o
  1061. [ 42%] Building CXX object modules/ml/CMakeFiles/opencv_ml.dir/src/inner_functions.cpp.o
  1062. [ 42%] Building CXX object modules/ml/CMakeFiles/opencv_ml.dir/src/kdtree.cpp.o
  1063. [ 42%] Building CXX object modules/ml/CMakeFiles/opencv_ml.dir/src/knearest.cpp.o
  1064. [ 42%] Building CXX object modules/ml/CMakeFiles/opencv_ml.dir/src/lr.cpp.o
  1065. [ 42%] Building CXX object modules/ml/CMakeFiles/opencv_ml.dir/src/nbayes.cpp.o
  1066. [ 42%] Building CXX object modules/ml/CMakeFiles/opencv_ml.dir/src/rtrees.cpp.o
  1067. [ 42%] Building CXX object modules/ml/CMakeFiles/opencv_ml.dir/src/svm.cpp.o
  1068. [ 42%] Building CXX object modules/ml/CMakeFiles/opencv_ml.dir/src/svmsgd.cpp.o
  1069. [ 42%] Building CXX object modules/ml/CMakeFiles/opencv_ml.dir/src/testset.cpp.o
  1070. [ 42%] Building CXX object modules/ml/CMakeFiles/opencv_ml.dir/src/tree.cpp.o
  1071. [ 43%] Linking CXX shared library ../../lib/libopencv_ml.so
  1072. [ 43%] Built target opencv_ml
  1073. Scanning dependencies of target opencv_test_ml
  1074. [ 43%] Building CXX object modules/ml/CMakeFiles/opencv_test_ml.dir/test/test_ann.cpp.o
  1075. [ 43%] Building CXX object modules/ml/CMakeFiles/opencv_test_ml.dir/test/test_bayes.cpp.o
  1076. [ 43%] Building CXX object modules/ml/CMakeFiles/opencv_test_ml.dir/test/test_em.cpp.o
  1077. [ 43%] Building CXX object modules/ml/CMakeFiles/opencv_test_ml.dir/test/test_kmeans.cpp.o
  1078. [ 43%] Building CXX object modules/ml/CMakeFiles/opencv_test_ml.dir/test/test_knearest.cpp.o
  1079. [ 43%] Building CXX object modules/ml/CMakeFiles/opencv_test_ml.dir/test/test_lr.cpp.o
  1080. [ 43%] Building CXX object modules/ml/CMakeFiles/opencv_test_ml.dir/test/test_main.cpp.o
  1081. [ 43%] Building CXX object modules/ml/CMakeFiles/opencv_test_ml.dir/test/test_mltests.cpp.o
  1082. [ 43%] Building CXX object modules/ml/CMakeFiles/opencv_test_ml.dir/test/test_rtrees.cpp.o
  1083. [ 44%] Building CXX object modules/ml/CMakeFiles/opencv_test_ml.dir/test/test_save_load.cpp.o
  1084. [ 44%] Building CXX object modules/ml/CMakeFiles/opencv_test_ml.dir/test/test_svmsgd.cpp.o
  1085. [ 44%] Building CXX object modules/ml/CMakeFiles/opencv_test_ml.dir/test/test_svmtrainauto.cpp.o
  1086. [ 44%] Building CXX object modules/ml/CMakeFiles/opencv_test_ml.dir/test/test_utils.cpp.o
  1087. [ 44%] Linking CXX executable ../../bin/opencv_test_ml
  1088. [ 44%] Built target opencv_test_ml
  1089. [ 44%] Processing OpenCL kernels (photo)
  1090. Scanning dependencies of target opencv_photo
  1091. [ 44%] Building CXX object modules/photo/CMakeFiles/opencv_photo.dir/src/align.cpp.o
  1092. [ 45%] Building CXX object modules/photo/CMakeFiles/opencv_photo.dir/src/calibrate.cpp.o
  1093. [ 45%] Building CXX object modules/photo/CMakeFiles/opencv_photo.dir/src/contrast_preserve.cpp.o
  1094. [ 45%] Building CXX object modules/photo/CMakeFiles/opencv_photo.dir/src/denoise_tvl1.cpp.o
  1095. [ 45%] Building CXX object modules/photo/CMakeFiles/opencv_photo.dir/src/denoising.cpp.o
  1096. [ 45%] Building CXX object modules/photo/CMakeFiles/opencv_photo.dir/src/denoising.cuda.cpp.o
  1097. [ 45%] Building CXX object modules/photo/CMakeFiles/opencv_photo.dir/src/hdr_common.cpp.o
  1098. [ 45%] Building CXX object modules/photo/CMakeFiles/opencv_photo.dir/src/inpaint.cpp.o
  1099. [ 45%] Building CXX object modules/photo/CMakeFiles/opencv_photo.dir/src/merge.cpp.o
  1100. [ 45%] Building CXX object modules/photo/CMakeFiles/opencv_photo.dir/src/npr.cpp.o
  1101. [ 45%] Building CXX object modules/photo/CMakeFiles/opencv_photo.dir/src/seamless_cloning.cpp.o
  1102. [ 45%] Building CXX object modules/photo/CMakeFiles/opencv_photo.dir/src/seamless_cloning_impl.cpp.o
  1103. [ 45%] Building CXX object modules/photo/CMakeFiles/opencv_photo.dir/src/tonemap.cpp.o
  1104. [ 45%] Building CXX object modules/photo/CMakeFiles/opencv_photo.dir/opencl_kernels_photo.cpp.o
  1105. [ 46%] Linking CXX shared library ../../lib/libopencv_photo.so
  1106. [ 46%] Built target opencv_photo
  1107. Scanning dependencies of target opencv_perf_photo
  1108. [ 46%] Building CXX object modules/photo/CMakeFiles/opencv_perf_photo.dir/perf/opencl/perf_denoising.cpp.o
  1109. [ 46%] Building CXX object modules/photo/CMakeFiles/opencv_perf_photo.dir/perf/perf_cuda.cpp.o
  1110. [ 46%] Building CXX object modules/photo/CMakeFiles/opencv_perf_photo.dir/perf/perf_inpaint.cpp.o
  1111. [ 46%] Building CXX object modules/photo/CMakeFiles/opencv_perf_photo.dir/perf/perf_main.cpp.o
  1112. [ 46%] Linking CXX executable ../../bin/opencv_perf_photo
  1113. [ 46%] Built target opencv_perf_photo
  1114. Scanning dependencies of target opencv_test_photo
  1115. [ 46%] Building CXX object modules/photo/CMakeFiles/opencv_test_photo.dir/test/ocl/test_denoising.cpp.o
  1116. [ 46%] Building CXX object modules/photo/CMakeFiles/opencv_test_photo.dir/test/test_cloning.cpp.o
  1117. [ 47%] Building CXX object modules/photo/CMakeFiles/opencv_test_photo.dir/test/test_decolor.cpp.o
  1118. [ 47%] Building CXX object modules/photo/CMakeFiles/opencv_test_photo.dir/test/test_denoise_tvl1.cpp.o
  1119. [ 47%] Building CXX object modules/photo/CMakeFiles/opencv_test_photo.dir/test/test_denoising.cpp.o
  1120. [ 47%] Building CXX object modules/photo/CMakeFiles/opencv_test_photo.dir/test/test_denoising.cuda.cpp.o
  1121. [ 47%] Building CXX object modules/photo/CMakeFiles/opencv_test_photo.dir/test/test_hdr.cpp.o
  1122. [ 47%] Building CXX object modules/photo/CMakeFiles/opencv_test_photo.dir/test/test_inpaint.cpp.o
  1123. [ 47%] Building CXX object modules/photo/CMakeFiles/opencv_test_photo.dir/test/test_main.cpp.o
  1124. [ 47%] Building CXX object modules/photo/CMakeFiles/opencv_test_photo.dir/test/test_npr.cpp.o
  1125. [ 47%] Linking CXX executable ../../bin/opencv_test_photo
  1126. [ 47%] Built target opencv_test_photo
  1127. Scanning dependencies of target libprotobuf
  1128. [ 47%] Building CXX object 3rdparty/protobuf/CMakeFiles/libprotobuf.dir/src/google/protobuf/arena.cc.o
  1129. [ 47%] Building CXX object 3rdparty/protobuf/CMakeFiles/libprotobuf.dir/src/google/protobuf/arenastring.cc.o
  1130. [ 47%] Building CXX object 3rdparty/protobuf/CMakeFiles/libprotobuf.dir/src/google/protobuf/extension_set.cc.o
  1131. [ 47%] Building CXX object 3rdparty/protobuf/CMakeFiles/libprotobuf.dir/src/google/protobuf/generated_message_table_driven_lite.cc.o
  1132. [ 47%] Building CXX object 3rdparty/protobuf/CMakeFiles/libprotobuf.dir/src/google/protobuf/generated_message_util.cc.o
  1133. [ 47%] Building CXX object 3rdparty/protobuf/CMakeFiles/libprotobuf.dir/src/google/protobuf/io/coded_stream.cc.o
  1134. [ 47%] Building CXX object 3rdparty/protobuf/CMakeFiles/libprotobuf.dir/src/google/protobuf/io/zero_copy_stream.cc.o
  1135. [ 47%] Building CXX object 3rdparty/protobuf/CMakeFiles/libprotobuf.dir/src/google/protobuf/io/zero_copy_stream_impl_lite.cc.o
  1136. [ 47%] Building CXX object 3rdparty/protobuf/CMakeFiles/libprotobuf.dir/src/google/protobuf/message_lite.cc.o
  1137. [ 47%] Building CXX object 3rdparty/protobuf/CMakeFiles/libprotobuf.dir/src/google/protobuf/repeated_field.cc.o
  1138. [ 47%] Building CXX object 3rdparty/protobuf/CMakeFiles/libprotobuf.dir/src/google/protobuf/stubs/atomicops_internals_x86_gcc.cc.o
  1139. [ 48%] Building CXX object 3rdparty/protobuf/CMakeFiles/libprotobuf.dir/src/google/protobuf/stubs/bytestream.cc.o
  1140. [ 48%] Building CXX object 3rdparty/protobuf/CMakeFiles/libprotobuf.dir/src/google/protobuf/stubs/common.cc.o
  1141. [ 48%] Building CXX object 3rdparty/protobuf/CMakeFiles/libprotobuf.dir/src/google/protobuf/stubs/int128.cc.o
  1142. [ 48%] Building CXX object 3rdparty/protobuf/CMakeFiles/libprotobuf.dir/src/google/protobuf/stubs/io_win32.cc.o
  1143. [ 48%] Building CXX object 3rdparty/protobuf/CMakeFiles/libprotobuf.dir/src/google/protobuf/stubs/once.cc.o
  1144. [ 48%] Building CXX object 3rdparty/protobuf/CMakeFiles/libprotobuf.dir/src/google/protobuf/stubs/status.cc.o
  1145. [ 48%] Building CXX object 3rdparty/protobuf/CMakeFiles/libprotobuf.dir/src/google/protobuf/stubs/statusor.cc.o
  1146. [ 48%] Building CXX object 3rdparty/protobuf/CMakeFiles/libprotobuf.dir/src/google/protobuf/stubs/stringpiece.cc.o
  1147. [ 48%] Building CXX object 3rdparty/protobuf/CMakeFiles/libprotobuf.dir/src/google/protobuf/stubs/stringprintf.cc.o
  1148. [ 48%] Building CXX object 3rdparty/protobuf/CMakeFiles/libprotobuf.dir/src/google/protobuf/stubs/structurally_valid.cc.o
  1149. [ 48%] Building CXX object 3rdparty/protobuf/CMakeFiles/libprotobuf.dir/src/google/protobuf/stubs/strutil.cc.o
  1150. [ 48%] Building CXX object 3rdparty/protobuf/CMakeFiles/libprotobuf.dir/src/google/protobuf/stubs/time.cc.o
  1151. [ 48%] Building CXX object 3rdparty/protobuf/CMakeFiles/libprotobuf.dir/src/google/protobuf/wire_format_lite.cc.o
  1152. [ 49%] Building CXX object 3rdparty/protobuf/CMakeFiles/libprotobuf.dir/src/google/protobuf/any.cc.o
  1153. [ 49%] Building CXX object 3rdparty/protobuf/CMakeFiles/libprotobuf.dir/src/google/protobuf/any.pb.cc.o
  1154. [ 49%] Building CXX object 3rdparty/protobuf/CMakeFiles/libprotobuf.dir/src/google/protobuf/api.pb.cc.o
  1155. [ 49%] Building CXX object 3rdparty/protobuf/CMakeFiles/libprotobuf.dir/src/google/protobuf/descriptor.cc.o
  1156. [ 49%] Building CXX object 3rdparty/protobuf/CMakeFiles/libprotobuf.dir/src/google/protobuf/descriptor.pb.cc.o
  1157. [ 49%] Building CXX object 3rdparty/protobuf/CMakeFiles/libprotobuf.dir/src/google/protobuf/descriptor_database.cc.o
  1158. [ 49%] Building CXX object 3rdparty/protobuf/CMakeFiles/libprotobuf.dir/src/google/protobuf/duration.pb.cc.o
  1159. [ 49%] Building CXX object 3rdparty/protobuf/CMakeFiles/libprotobuf.dir/src/google/protobuf/dynamic_message.cc.o
  1160. [ 49%] Building CXX object 3rdparty/protobuf/CMakeFiles/libprotobuf.dir/src/google/protobuf/empty.pb.cc.o
  1161. [ 49%] Building CXX object 3rdparty/protobuf/CMakeFiles/libprotobuf.dir/src/google/protobuf/extension_set_heavy.cc.o
  1162. [ 49%] Building CXX object 3rdparty/protobuf/CMakeFiles/libprotobuf.dir/src/google/protobuf/field_mask.pb.cc.o
  1163. [ 49%] Building CXX object 3rdparty/protobuf/CMakeFiles/libprotobuf.dir/src/google/protobuf/generated_message_reflection.cc.o
  1164. [ 50%] Building CXX object 3rdparty/protobuf/CMakeFiles/libprotobuf.dir/src/google/protobuf/generated_message_table_driven.cc.o
  1165. [ 50%] Building CXX object 3rdparty/protobuf/CMakeFiles/libprotobuf.dir/src/google/protobuf/io/gzip_stream.cc.o
  1166. [ 50%] Building CXX object 3rdparty/protobuf/CMakeFiles/libprotobuf.dir/src/google/protobuf/io/printer.cc.o
  1167. [ 50%] Building CXX object 3rdparty/protobuf/CMakeFiles/libprotobuf.dir/src/google/protobuf/io/strtod.cc.o
  1168. [ 50%] Building CXX object 3rdparty/protobuf/CMakeFiles/libprotobuf.dir/src/google/protobuf/io/tokenizer.cc.o
  1169. [ 50%] Building CXX object 3rdparty/protobuf/CMakeFiles/libprotobuf.dir/src/google/protobuf/io/zero_copy_stream_impl.cc.o
  1170. [ 50%] Building CXX object 3rdparty/protobuf/CMakeFiles/libprotobuf.dir/src/google/protobuf/map_field.cc.o
  1171. [ 50%] Building CXX object 3rdparty/protobuf/CMakeFiles/libprotobuf.dir/src/google/protobuf/message.cc.o
  1172. [ 50%] Building CXX object 3rdparty/protobuf/CMakeFiles/libprotobuf.dir/src/google/protobuf/reflection_ops.cc.o
  1173. [ 50%] Building CXX object 3rdparty/protobuf/CMakeFiles/libprotobuf.dir/src/google/protobuf/service.cc.o
  1174. [ 50%] Building CXX object 3rdparty/protobuf/CMakeFiles/libprotobuf.dir/src/google/protobuf/source_context.pb.cc.o
  1175. [ 50%] Building CXX object 3rdparty/protobuf/CMakeFiles/libprotobuf.dir/src/google/protobuf/struct.pb.cc.o
  1176. [ 50%] Building CXX object 3rdparty/protobuf/CMakeFiles/libprotobuf.dir/src/google/protobuf/stubs/mathlimits.cc.o
  1177. [ 51%] Building CXX object 3rdparty/protobuf/CMakeFiles/libprotobuf.dir/src/google/protobuf/stubs/substitute.cc.o
  1178. [ 51%] Building CXX object 3rdparty/protobuf/CMakeFiles/libprotobuf.dir/src/google/protobuf/text_format.cc.o
  1179. [ 51%] Building CXX object 3rdparty/protobuf/CMakeFiles/libprotobuf.dir/src/google/protobuf/timestamp.pb.cc.o
  1180. [ 51%] Building CXX object 3rdparty/protobuf/CMakeFiles/libprotobuf.dir/src/google/protobuf/type.pb.cc.o
  1181. [ 51%] Building CXX object 3rdparty/protobuf/CMakeFiles/libprotobuf.dir/src/google/protobuf/unknown_field_set.cc.o
  1182. [ 51%] Building CXX object 3rdparty/protobuf/CMakeFiles/libprotobuf.dir/src/google/protobuf/util/delimited_message_util.cc.o
  1183. [ 51%] Building CXX object 3rdparty/protobuf/CMakeFiles/libprotobuf.dir/src/google/protobuf/util/field_comparator.cc.o
  1184. [ 51%] Building CXX object 3rdparty/protobuf/CMakeFiles/libprotobuf.dir/src/google/protobuf/util/field_mask_util.cc.o
  1185. [ 51%] Building CXX object 3rdparty/protobuf/CMakeFiles/libprotobuf.dir/src/google/protobuf/util/internal/datapiece.cc.o
  1186. [ 51%] Building CXX object 3rdparty/protobuf/CMakeFiles/libprotobuf.dir/src/google/protobuf/util/internal/default_value_objectwriter.cc.o
  1187. [ 51%] Building CXX object 3rdparty/protobuf/CMakeFiles/libprotobuf.dir/src/google/protobuf/util/internal/field_mask_utility.cc.o
  1188. [ 51%] Building CXX object 3rdparty/protobuf/CMakeFiles/libprotobuf.dir/src/google/protobuf/util/internal/json_escaping.cc.o
  1189. [ 52%] Building CXX object 3rdparty/protobuf/CMakeFiles/libprotobuf.dir/src/google/protobuf/util/internal/json_objectwriter.cc.o
  1190. [ 52%] Building CXX object 3rdparty/protobuf/CMakeFiles/libprotobuf.dir/src/google/protobuf/util/internal/json_stream_parser.cc.o
  1191. [ 52%] Building CXX object 3rdparty/protobuf/CMakeFiles/libprotobuf.dir/src/google/protobuf/util/internal/object_writer.cc.o
  1192. [ 52%] Building CXX object 3rdparty/protobuf/CMakeFiles/libprotobuf.dir/src/google/protobuf/util/internal/proto_writer.cc.o
  1193. [ 52%] Building CXX object 3rdparty/protobuf/CMakeFiles/libprotobuf.dir/src/google/protobuf/util/internal/protostream_objectsource.cc.o
  1194. [ 52%] Building CXX object 3rdparty/protobuf/CMakeFiles/libprotobuf.dir/src/google/protobuf/util/internal/protostream_objectwriter.cc.o
  1195. [ 52%] Building CXX object 3rdparty/protobuf/CMakeFiles/libprotobuf.dir/src/google/protobuf/util/internal/type_info.cc.o
  1196. [ 52%] Building CXX object 3rdparty/protobuf/CMakeFiles/libprotobuf.dir/src/google/protobuf/util/internal/utility.cc.o
  1197. [ 52%] Building CXX object 3rdparty/protobuf/CMakeFiles/libprotobuf.dir/src/google/protobuf/util/json_util.cc.o
  1198. [ 52%] Building CXX object 3rdparty/protobuf/CMakeFiles/libprotobuf.dir/src/google/protobuf/util/message_differencer.cc.o
  1199. [ 52%] Building CXX object 3rdparty/protobuf/CMakeFiles/libprotobuf.dir/src/google/protobuf/util/time_util.cc.o
  1200. [ 52%] Building CXX object 3rdparty/protobuf/CMakeFiles/libprotobuf.dir/src/google/protobuf/util/type_resolver_util.cc.o
  1201. [ 52%] Building CXX object 3rdparty/protobuf/CMakeFiles/libprotobuf.dir/src/google/protobuf/wire_format.cc.o
  1202. [ 53%] Building CXX object 3rdparty/protobuf/CMakeFiles/libprotobuf.dir/src/google/protobuf/wrappers.pb.cc.o
  1203. [ 53%] Linking CXX static library ../lib/liblibprotobuf.a
  1204. [ 53%] Built target libprotobuf
  1205. [ 53%] Processing OpenCL kernels (dnn)
  1206. Scanning dependencies of target opencv_dnn
  1207. [ 53%] Building CXX object modules/dnn/CMakeFiles/opencv_dnn.dir/misc/caffe/opencv-caffe.pb.cc.o
  1208. [ 53%] Building CXX object modules/dnn/CMakeFiles/opencv_dnn.dir/misc/onnx/opencv-onnx.pb.cc.o
  1209. [ 53%] Building CXX object modules/dnn/CMakeFiles/opencv_dnn.dir/misc/tensorflow/attr_value.pb.cc.o
  1210. [ 53%] Building CXX object modules/dnn/CMakeFiles/opencv_dnn.dir/misc/tensorflow/function.pb.cc.o
  1211. [ 53%] Building CXX object modules/dnn/CMakeFiles/opencv_dnn.dir/misc/tensorflow/graph.pb.cc.o
  1212. [ 53%] Building CXX object modules/dnn/CMakeFiles/opencv_dnn.dir/misc/tensorflow/op_def.pb.cc.o
  1213. [ 54%] Building CXX object modules/dnn/CMakeFiles/opencv_dnn.dir/misc/tensorflow/tensor.pb.cc.o
  1214. [ 54%] Building CXX object modules/dnn/CMakeFiles/opencv_dnn.dir/misc/tensorflow/tensor_shape.pb.cc.o
  1215. [ 54%] Building CXX object modules/dnn/CMakeFiles/opencv_dnn.dir/misc/tensorflow/types.pb.cc.o
  1216. [ 54%] Building CXX object modules/dnn/CMakeFiles/opencv_dnn.dir/misc/tensorflow/versions.pb.cc.o
  1217. [ 54%] Building CXX object modules/dnn/CMakeFiles/opencv_dnn.dir/src/caffe/caffe_importer.cpp.o
  1218. [ 54%] Building CXX object modules/dnn/CMakeFiles/opencv_dnn.dir/src/caffe/caffe_io.cpp.o
  1219. [ 54%] Building CXX object modules/dnn/CMakeFiles/opencv_dnn.dir/src/caffe/caffe_shrinker.cpp.o
  1220. [ 54%] Building CXX object modules/dnn/CMakeFiles/opencv_dnn.dir/src/darknet/darknet_importer.cpp.o
  1221. [ 54%] Building CXX object modules/dnn/CMakeFiles/opencv_dnn.dir/src/darknet/darknet_io.cpp.o
  1222. [ 54%] Building CXX object modules/dnn/CMakeFiles/opencv_dnn.dir/src/dnn.cpp.o
  1223. [ 54%] Building CXX object modules/dnn/CMakeFiles/opencv_dnn.dir/src/graph_simplifier.cpp.o
  1224. [ 54%] Building CXX object modules/dnn/CMakeFiles/opencv_dnn.dir/src/halide_scheduler.cpp.o
  1225. [ 54%] Building CXX object modules/dnn/CMakeFiles/opencv_dnn.dir/src/ie_ngraph.cpp.o
  1226. [ 55%] Building CXX object modules/dnn/CMakeFiles/opencv_dnn.dir/src/init.cpp.o
  1227. [ 55%] Building CXX object modules/dnn/CMakeFiles/opencv_dnn.dir/src/layers/accum_layer.cpp.o
  1228. [ 55%] Building CXX object modules/dnn/CMakeFiles/opencv_dnn.dir/src/layers/batch_norm_layer.cpp.o
  1229. [ 55%] Building CXX object modules/dnn/CMakeFiles/opencv_dnn.dir/src/layers/blank_layer.cpp.o
  1230. [ 55%] Building CXX object modules/dnn/CMakeFiles/opencv_dnn.dir/src/layers/concat_layer.cpp.o
  1231. [ 55%] Building CXX object modules/dnn/CMakeFiles/opencv_dnn.dir/src/layers/const_layer.cpp.o
  1232. [ 55%] Building CXX object modules/dnn/CMakeFiles/opencv_dnn.dir/src/layers/convolution_layer.cpp.o
  1233. [ 55%] Building CXX object modules/dnn/CMakeFiles/opencv_dnn.dir/src/layers/correlation_layer.cpp.o
  1234. [ 55%] Building CXX object modules/dnn/CMakeFiles/opencv_dnn.dir/src/layers/crop_and_resize_layer.cpp.o
  1235. [ 55%] Building CXX object modules/dnn/CMakeFiles/opencv_dnn.dir/src/layers/detection_output_layer.cpp.o
  1236. [ 55%] Building CXX object modules/dnn/CMakeFiles/opencv_dnn.dir/src/layers/elementwise_layers.cpp.o
  1237. [ 55%] Building CXX object modules/dnn/CMakeFiles/opencv_dnn.dir/src/layers/eltwise_layer.cpp.o
  1238. [ 56%] Building CXX object modules/dnn/CMakeFiles/opencv_dnn.dir/src/layers/flatten_layer.cpp.o
  1239. [ 56%] Building CXX object modules/dnn/CMakeFiles/opencv_dnn.dir/src/layers/flow_warp_layer.cpp.o
  1240. [ 56%] Building CXX object modules/dnn/CMakeFiles/opencv_dnn.dir/src/layers/fully_connected_layer.cpp.o
  1241. [ 56%] Building CXX object modules/dnn/CMakeFiles/opencv_dnn.dir/src/layers/layers_common.cpp.o
  1242. [ 56%] Building CXX object modules/dnn/CMakeFiles/opencv_dnn.dir/src/layers/lrn_layer.cpp.o
  1243. [ 56%] Building CXX object modules/dnn/CMakeFiles/opencv_dnn.dir/src/layers/max_unpooling_layer.cpp.o
  1244. [ 56%] Building CXX object modules/dnn/CMakeFiles/opencv_dnn.dir/src/layers/mvn_layer.cpp.o
  1245. [ 56%] Building CXX object modules/dnn/CMakeFiles/opencv_dnn.dir/src/layers/normalize_bbox_layer.cpp.o
  1246. [ 56%] Building CXX object modules/dnn/CMakeFiles/opencv_dnn.dir/src/layers/padding_layer.cpp.o
  1247. [ 56%] Building CXX object modules/dnn/CMakeFiles/opencv_dnn.dir/src/layers/permute_layer.cpp.o
  1248. [ 56%] Building CXX object modules/dnn/CMakeFiles/opencv_dnn.dir/src/layers/pooling_layer.cpp.o
  1249. [ 56%] Building CXX object modules/dnn/CMakeFiles/opencv_dnn.dir/src/layers/prior_box_layer.cpp.o
  1250. [ 56%] Building CXX object modules/dnn/CMakeFiles/opencv_dnn.dir/src/layers/proposal_layer.cpp.o
  1251. [ 57%] Building CXX object modules/dnn/CMakeFiles/opencv_dnn.dir/src/layers/recurrent_layers.cpp.o
  1252. [ 57%] Building CXX object modules/dnn/CMakeFiles/opencv_dnn.dir/src/layers/region_layer.cpp.o
  1253. [ 57%] Building CXX object modules/dnn/CMakeFiles/opencv_dnn.dir/src/layers/reorg_layer.cpp.o
  1254. [ 57%] Building CXX object modules/dnn/CMakeFiles/opencv_dnn.dir/src/layers/reshape_layer.cpp.o
  1255. [ 57%] Building CXX object modules/dnn/CMakeFiles/opencv_dnn.dir/src/layers/resize_layer.cpp.o
  1256. [ 57%] Building CXX object modules/dnn/CMakeFiles/opencv_dnn.dir/src/layers/scale_layer.cpp.o
  1257. [ 57%] Building CXX object modules/dnn/CMakeFiles/opencv_dnn.dir/src/layers/shuffle_channel_layer.cpp.o
  1258. [ 57%] Building CXX object modules/dnn/CMakeFiles/opencv_dnn.dir/src/layers/slice_layer.cpp.o
  1259. [ 57%] Building CXX object modules/dnn/CMakeFiles/opencv_dnn.dir/src/layers/softmax_layer.cpp.o
  1260. [ 57%] Building CXX object modules/dnn/CMakeFiles/opencv_dnn.dir/src/layers/split_layer.cpp.o
  1261. [ 57%] Building CXX object modules/dnn/CMakeFiles/opencv_dnn.dir/src/model.cpp.o
  1262. [ 57%] Building CXX object modules/dnn/CMakeFiles/opencv_dnn.dir/src/nms.cpp.o
  1263. [ 58%] Building CXX object modules/dnn/CMakeFiles/opencv_dnn.dir/src/ocl4dnn/src/common.cpp.o
  1264. [ 58%] Building CXX object modules/dnn/CMakeFiles/opencv_dnn.dir/src/ocl4dnn/src/math_functions.cpp.o
  1265. [ 58%] Building CXX object modules/dnn/CMakeFiles/opencv_dnn.dir/src/ocl4dnn/src/ocl4dnn_conv_spatial.cpp.o
  1266. [ 58%] Building CXX object modules/dnn/CMakeFiles/opencv_dnn.dir/src/ocl4dnn/src/ocl4dnn_inner_product.cpp.o
  1267. [ 58%] Building CXX object modules/dnn/CMakeFiles/opencv_dnn.dir/src/ocl4dnn/src/ocl4dnn_lrn.cpp.o
  1268. [ 58%] Building CXX object modules/dnn/CMakeFiles/opencv_dnn.dir/src/ocl4dnn/src/ocl4dnn_pool.cpp.o
  1269. [ 58%] Building CXX object modules/dnn/CMakeFiles/opencv_dnn.dir/src/ocl4dnn/src/ocl4dnn_softmax.cpp.o
  1270. [ 58%] Building CXX object modules/dnn/CMakeFiles/opencv_dnn.dir/src/onnx/onnx_graph_simplifier.cpp.o
  1271. [ 58%] Building CXX object modules/dnn/CMakeFiles/opencv_dnn.dir/src/onnx/onnx_importer.cpp.o
  1272. [ 58%] Building CXX object modules/dnn/CMakeFiles/opencv_dnn.dir/src/op_halide.cpp.o
  1273. [ 58%] Building CXX object modules/dnn/CMakeFiles/opencv_dnn.dir/src/op_inf_engine.cpp.o
  1274. [ 58%] Building CXX object modules/dnn/CMakeFiles/opencv_dnn.dir/src/op_vkcom.cpp.o
  1275. [ 58%] Building CXX object modules/dnn/CMakeFiles/opencv_dnn.dir/src/tengine4dnn/src/tengine_graph_convolution.cpp.o
  1276. [ 59%] Building CXX object modules/dnn/CMakeFiles/opencv_dnn.dir/src/tensorflow/tf_graph_simplifier.cpp.o
  1277. [ 59%] Building CXX object modules/dnn/CMakeFiles/opencv_dnn.dir/src/tensorflow/tf_importer.cpp.o
  1278. [ 59%] Building CXX object modules/dnn/CMakeFiles/opencv_dnn.dir/src/tensorflow/tf_io.cpp.o
  1279. [ 59%] Building CXX object modules/dnn/CMakeFiles/opencv_dnn.dir/src/torch/THDiskFile.cpp.o
  1280. [ 59%] Building CXX object modules/dnn/CMakeFiles/opencv_dnn.dir/src/torch/THFile.cpp.o
  1281. [ 59%] Building CXX object modules/dnn/CMakeFiles/opencv_dnn.dir/src/torch/THGeneral.cpp.o
  1282. [ 59%] Building CXX object modules/dnn/CMakeFiles/opencv_dnn.dir/src/torch/torch_importer.cpp.o
  1283. [ 59%] Building CXX object modules/dnn/CMakeFiles/opencv_dnn.dir/src/vkcom/shader/avg_pool_spv.cpp.o
  1284. [ 59%] Building CXX object modules/dnn/CMakeFiles/opencv_dnn.dir/src/vkcom/shader/concat_spv.cpp.o
  1285. [ 59%] Building CXX object modules/dnn/CMakeFiles/opencv_dnn.dir/src/vkcom/shader/conv48_spv.cpp.o
  1286. [ 59%] Building CXX object modules/dnn/CMakeFiles/opencv_dnn.dir/src/vkcom/shader/conv_spv.cpp.o
  1287. [ 59%] Building CXX object modules/dnn/CMakeFiles/opencv_dnn.dir/src/vkcom/shader/dw_conv_spv.cpp.o
  1288. [ 60%] Building CXX object modules/dnn/CMakeFiles/opencv_dnn.dir/src/vkcom/shader/lrn_spv.cpp.o
  1289. [ 60%] Building CXX object modules/dnn/CMakeFiles/opencv_dnn.dir/src/vkcom/shader/max_pool_spv.cpp.o
  1290. [ 60%] Building CXX object modules/dnn/CMakeFiles/opencv_dnn.dir/src/vkcom/shader/permute_spv.cpp.o
  1291. [ 60%] Building CXX object modules/dnn/CMakeFiles/opencv_dnn.dir/src/vkcom/shader/prior_box_spv.cpp.o
  1292. [ 60%] Building CXX object modules/dnn/CMakeFiles/opencv_dnn.dir/src/vkcom/shader/relu_spv.cpp.o
  1293. [ 60%] Building CXX object modules/dnn/CMakeFiles/opencv_dnn.dir/src/vkcom/shader/softmax_spv.cpp.o
  1294. [ 60%] Building CXX object modules/dnn/CMakeFiles/opencv_dnn.dir/src/vkcom/src/buffer.cpp.o
  1295. [ 60%] Building CXX object modules/dnn/CMakeFiles/opencv_dnn.dir/src/vkcom/src/context.cpp.o
  1296. [ 60%] Building CXX object modules/dnn/CMakeFiles/opencv_dnn.dir/src/vkcom/src/internal.cpp.o
  1297. [ 60%] Building CXX object modules/dnn/CMakeFiles/opencv_dnn.dir/src/vkcom/src/op_base.cpp.o
  1298. [ 60%] Building CXX object modules/dnn/CMakeFiles/opencv_dnn.dir/src/vkcom/src/op_concat.cpp.o
  1299. [ 60%] Building CXX object modules/dnn/CMakeFiles/opencv_dnn.dir/src/vkcom/src/op_conv.cpp.o
  1300. [ 60%] Building CXX object modules/dnn/CMakeFiles/opencv_dnn.dir/src/vkcom/src/op_lrn.cpp.o
  1301. [ 61%] Building CXX object modules/dnn/CMakeFiles/opencv_dnn.dir/src/vkcom/src/op_permute.cpp.o
  1302. [ 61%] Building CXX object modules/dnn/CMakeFiles/opencv_dnn.dir/src/vkcom/src/op_pool.cpp.o
  1303. [ 61%] Building CXX object modules/dnn/CMakeFiles/opencv_dnn.dir/src/vkcom/src/op_prior_box.cpp.o
  1304. [ 61%] Building CXX object modules/dnn/CMakeFiles/opencv_dnn.dir/src/vkcom/src/op_relu.cpp.o
  1305. [ 61%] Building CXX object modules/dnn/CMakeFiles/opencv_dnn.dir/src/vkcom/src/op_softmax.cpp.o
  1306. [ 61%] Building CXX object modules/dnn/CMakeFiles/opencv_dnn.dir/src/vkcom/src/tensor.cpp.o
  1307. [ 61%] Building CXX object modules/dnn/CMakeFiles/opencv_dnn.dir/src/vkcom/vulkan/vk_functions.cpp.o
  1308. [ 61%] Building CXX object modules/dnn/CMakeFiles/opencv_dnn.dir/src/vkcom/vulkan/vk_loader.cpp.o
  1309. [ 61%] Building CXX object modules/dnn/CMakeFiles/opencv_dnn.dir/opencl_kernels_dnn.cpp.o
  1310. [ 61%] Building CXX object modules/dnn/CMakeFiles/opencv_dnn.dir/layers/layers_common.avx.cpp.o
  1311. [ 61%] Building CXX object modules/dnn/CMakeFiles/opencv_dnn.dir/layers/layers_common.avx2.cpp.o
  1312. [ 61%] Building CXX object modules/dnn/CMakeFiles/opencv_dnn.dir/layers/layers_common.avx512_skx.cpp.o
  1313. [ 62%] Linking CXX shared library ../../lib/libopencv_dnn.so
  1314. [ 62%] Built target opencv_dnn
  1315. Scanning dependencies of target opencv_perf_dnn
  1316. [ 62%] Building CXX object modules/dnn/CMakeFiles/opencv_perf_dnn.dir/perf/perf_caffe.cpp.o
  1317. [ 62%] Building CXX object modules/dnn/CMakeFiles/opencv_perf_dnn.dir/perf/perf_common.cpp.o
  1318. [ 62%] Building CXX object modules/dnn/CMakeFiles/opencv_perf_dnn.dir/perf/perf_convolution.cpp.o
  1319. [ 62%] Building CXX object modules/dnn/CMakeFiles/opencv_perf_dnn.dir/perf/perf_convolution1d.cpp.o
  1320. [ 62%] Building CXX object modules/dnn/CMakeFiles/opencv_perf_dnn.dir/perf/perf_convolution3d.cpp.o
  1321. [ 62%] Building CXX object modules/dnn/CMakeFiles/opencv_perf_dnn.dir/perf/perf_layer.cpp.o
  1322. [ 62%] Building CXX object modules/dnn/CMakeFiles/opencv_perf_dnn.dir/perf/perf_main.cpp.o
  1323. [ 62%] Building CXX object modules/dnn/CMakeFiles/opencv_perf_dnn.dir/perf/perf_net.cpp.o
  1324. [ 62%] Linking CXX executable ../../bin/opencv_perf_dnn
  1325. [ 62%] Built target opencv_perf_dnn
  1326. Scanning dependencies of target opencv_test_dnn
  1327. [ 62%] Building CXX object modules/dnn/CMakeFiles/opencv_test_dnn.dir/test/npy_blob.cpp.o
  1328. [ 62%] Building CXX object modules/dnn/CMakeFiles/opencv_test_dnn.dir/test/test_backends.cpp.o
  1329. [ 62%] Building CXX object modules/dnn/CMakeFiles/opencv_test_dnn.dir/test/test_caffe_importer.cpp.o
  1330. [ 62%] Building CXX object modules/dnn/CMakeFiles/opencv_test_dnn.dir/test/test_common.cpp.o
  1331. [ 62%] Building CXX object modules/dnn/CMakeFiles/opencv_test_dnn.dir/test/test_darknet_importer.cpp.o
  1332. [ 62%] Building CXX object modules/dnn/CMakeFiles/opencv_test_dnn.dir/test/test_googlenet.cpp.o
  1333. [ 62%] Building CXX object modules/dnn/CMakeFiles/opencv_test_dnn.dir/test/test_halide_layers.cpp.o
  1334. [ 62%] Building CXX object modules/dnn/CMakeFiles/opencv_test_dnn.dir/test/test_ie_models.cpp.o
  1335. [ 63%] Building CXX object modules/dnn/CMakeFiles/opencv_test_dnn.dir/test/test_layers.cpp.o
  1336. [ 63%] Building CXX object modules/dnn/CMakeFiles/opencv_test_dnn.dir/test/test_main.cpp.o
  1337. [ 63%] Building CXX object modules/dnn/CMakeFiles/opencv_test_dnn.dir/test/test_misc.cpp.o
  1338. [ 63%] Building CXX object modules/dnn/CMakeFiles/opencv_test_dnn.dir/test/test_model.cpp.o
  1339. [ 63%] Building CXX object modules/dnn/CMakeFiles/opencv_test_dnn.dir/test/test_nms.cpp.o
  1340. [ 63%] Building CXX object modules/dnn/CMakeFiles/opencv_test_dnn.dir/test/test_onnx_importer.cpp.o
  1341. [ 63%] Building CXX object modules/dnn/CMakeFiles/opencv_test_dnn.dir/test/test_tf_importer.cpp.o
  1342. [ 63%] Building CXX object modules/dnn/CMakeFiles/opencv_test_dnn.dir/test/test_torch_importer.cpp.o
  1343. [ 63%] Linking CXX executable ../../bin/opencv_test_dnn
  1344. [ 63%] Built target opencv_test_dnn
  1345. [ 63%] Processing OpenCL kernels (features2d)
  1346. Scanning dependencies of target opencv_features2d
  1347. [ 63%] Building CXX object modules/features2d/CMakeFiles/opencv_features2d.dir/src/affine_feature.cpp.o
  1348. [ 63%] Building CXX object modules/features2d/CMakeFiles/opencv_features2d.dir/src/agast.cpp.o
  1349. [ 63%] Building CXX object modules/features2d/CMakeFiles/opencv_features2d.dir/src/agast_score.cpp.o
  1350. [ 63%] Building CXX object modules/features2d/CMakeFiles/opencv_features2d.dir/src/akaze.cpp.o
  1351. [ 63%] Building CXX object modules/features2d/CMakeFiles/opencv_features2d.dir/src/bagofwords.cpp.o
  1352. [ 63%] Building CXX object modules/features2d/CMakeFiles/opencv_features2d.dir/src/blobdetector.cpp.o
  1353. [ 63%] Building CXX object modules/features2d/CMakeFiles/opencv_features2d.dir/src/brisk.cpp.o
  1354. [ 63%] Building CXX object modules/features2d/CMakeFiles/opencv_features2d.dir/src/draw.cpp.o
  1355. [ 63%] Building CXX object modules/features2d/CMakeFiles/opencv_features2d.dir/src/dynamic.cpp.o
  1356. [ 63%] Building CXX object modules/features2d/CMakeFiles/opencv_features2d.dir/src/evaluation.cpp.o
  1357. [ 63%] Building CXX object modules/features2d/CMakeFiles/opencv_features2d.dir/src/fast.cpp.o
  1358. [ 64%] Building CXX object modules/features2d/CMakeFiles/opencv_features2d.dir/src/fast_score.cpp.o
  1359. [ 64%] Building CXX object modules/features2d/CMakeFiles/opencv_features2d.dir/src/feature2d.cpp.o
  1360. [ 64%] Building CXX object modules/features2d/CMakeFiles/opencv_features2d.dir/src/gftt.cpp.o
  1361. [ 64%] Building CXX object modules/features2d/CMakeFiles/opencv_features2d.dir/src/kaze.cpp.o
  1362. [ 64%] Building CXX object modules/features2d/CMakeFiles/opencv_features2d.dir/src/kaze/AKAZEFeatures.cpp.o
  1363. [ 64%] Building CXX object modules/features2d/CMakeFiles/opencv_features2d.dir/src/kaze/KAZEFeatures.cpp.o
  1364. [ 64%] Building CXX object modules/features2d/CMakeFiles/opencv_features2d.dir/src/kaze/fed.cpp.o
  1365. [ 64%] Building CXX object modules/features2d/CMakeFiles/opencv_features2d.dir/src/kaze/nldiffusion_functions.cpp.o
  1366. [ 64%] Building CXX object modules/features2d/CMakeFiles/opencv_features2d.dir/src/keypoint.cpp.o
  1367. [ 64%] Building CXX object modules/features2d/CMakeFiles/opencv_features2d.dir/src/main.cpp.o
  1368. [ 64%] Building CXX object modules/features2d/CMakeFiles/opencv_features2d.dir/src/matchers.cpp.o
  1369. [ 64%] Building CXX object modules/features2d/CMakeFiles/opencv_features2d.dir/src/mser.cpp.o
  1370. [ 65%] Building CXX object modules/features2d/CMakeFiles/opencv_features2d.dir/src/orb.cpp.o
  1371. [ 65%] Building CXX object modules/features2d/CMakeFiles/opencv_features2d.dir/src/sift.dispatch.cpp.o
  1372. [ 65%] Building CXX object modules/features2d/CMakeFiles/opencv_features2d.dir/opencl_kernels_features2d.cpp.o
  1373. [ 65%] Building CXX object modules/features2d/CMakeFiles/opencv_features2d.dir/sift.sse4_1.cpp.o
  1374. [ 65%] Building CXX object modules/features2d/CMakeFiles/opencv_features2d.dir/src/fast.avx2.cpp.o
  1375. [ 65%] Building CXX object modules/features2d/CMakeFiles/opencv_features2d.dir/sift.avx2.cpp.o
  1376. [ 65%] Building CXX object modules/features2d/CMakeFiles/opencv_features2d.dir/sift.avx512_skx.cpp.o
  1377. [ 65%] Linking CXX shared library ../../lib/libopencv_features2d.so
  1378. [ 65%] Built target opencv_features2d
  1379. Scanning dependencies of target opencv_perf_features2d
  1380. [ 65%] Building CXX object modules/features2d/CMakeFiles/opencv_perf_features2d.dir/perf/opencl/perf_brute_force_matcher.cpp.o
  1381. [ 65%] Building CXX object modules/features2d/CMakeFiles/opencv_perf_features2d.dir/perf/opencl/perf_feature2d.cpp.o
  1382. [ 66%] Building CXX object modules/features2d/CMakeFiles/opencv_perf_features2d.dir/perf/perf_batchDistance.cpp.o
  1383. [ 66%] Building CXX object modules/features2d/CMakeFiles/opencv_perf_features2d.dir/perf/perf_feature2d.cpp.o
  1384. [ 66%] Building CXX object modules/features2d/CMakeFiles/opencv_perf_features2d.dir/perf/perf_main.cpp.o
  1385. [ 66%] Linking CXX executable ../../bin/opencv_perf_features2d
  1386. [ 66%] Built target opencv_perf_features2d
  1387. Scanning dependencies of target opencv_test_features2d
  1388. [ 66%] Building CXX object modules/features2d/CMakeFiles/opencv_test_features2d.dir/test/ocl/test_brute_force_matcher.cpp.o
  1389. [ 66%] Building CXX object modules/features2d/CMakeFiles/opencv_test_features2d.dir/test/ocl/test_feature2d.cpp.o
  1390. [ 66%] Building CXX object modules/features2d/CMakeFiles/opencv_test_features2d.dir/test/test_affine_feature.cpp.o
  1391. [ 66%] Building CXX object modules/features2d/CMakeFiles/opencv_test_features2d.dir/test/test_agast.cpp.o
  1392. [ 67%] Building CXX object modules/features2d/CMakeFiles/opencv_test_features2d.dir/test/test_akaze.cpp.o
  1393. [ 67%] Building CXX object modules/features2d/CMakeFiles/opencv_test_features2d.dir/test/test_brisk.cpp.o
  1394. [ 67%] Building CXX object modules/features2d/CMakeFiles/opencv_test_features2d.dir/test/test_descriptors_invariance.cpp.o
  1395. [ 67%] Building CXX object modules/features2d/CMakeFiles/opencv_test_features2d.dir/test/test_descriptors_regression.cpp.o
  1396. [ 67%] Building CXX object modules/features2d/CMakeFiles/opencv_test_features2d.dir/test/test_detectors_invariance.cpp.o
  1397. [ 67%] Building CXX object modules/features2d/CMakeFiles/opencv_test_features2d.dir/test/test_detectors_regression.cpp.o
  1398. [ 67%] Building CXX object modules/features2d/CMakeFiles/opencv_test_features2d.dir/test/test_drawing.cpp.o
  1399. [ 67%] Building CXX object modules/features2d/CMakeFiles/opencv_test_features2d.dir/test/test_fast.cpp.o
  1400. [ 67%] Building CXX object modules/features2d/CMakeFiles/opencv_test_features2d.dir/test/test_keypoints.cpp.o
  1401. [ 67%] Building CXX object modules/features2d/CMakeFiles/opencv_test_features2d.dir/test/test_main.cpp.o
  1402. [ 67%] Building CXX object modules/features2d/CMakeFiles/opencv_test_features2d.dir/test/test_matchers_algorithmic.cpp.o
  1403. [ 67%] Building CXX object modules/features2d/CMakeFiles/opencv_test_features2d.dir/test/test_mser.cpp.o
  1404. [ 68%] Building CXX object modules/features2d/CMakeFiles/opencv_test_features2d.dir/test/test_nearestneighbors.cpp.o
  1405. [ 68%] Building CXX object modules/features2d/CMakeFiles/opencv_test_features2d.dir/test/test_orb.cpp.o
  1406. [ 68%] Building CXX object modules/features2d/CMakeFiles/opencv_test_features2d.dir/test/test_sift.cpp.o
  1407. [ 68%] Building CXX object modules/features2d/CMakeFiles/opencv_test_features2d.dir/test/test_utils.cpp.o
  1408. [ 68%] Linking CXX executable ../../bin/opencv_test_features2d
  1409. [ 68%] Built target opencv_test_features2d
  1410. Scanning dependencies of target opencv_perf_imgcodecs
  1411. [ 68%] Building CXX object modules/imgcodecs/CMakeFiles/opencv_perf_imgcodecs.dir/perf/perf_main.cpp.o
  1412. [ 68%] Linking CXX executable ../../bin/opencv_perf_imgcodecs
  1413. [ 68%] Built target opencv_perf_imgcodecs
  1414. Scanning dependencies of target opencv_test_imgcodecs
  1415. [ 68%] Building CXX object modules/imgcodecs/CMakeFiles/opencv_test_imgcodecs.dir/test/test_common.cpp.o
  1416. [ 68%] Building CXX object modules/imgcodecs/CMakeFiles/opencv_test_imgcodecs.dir/test/test_grfmt.cpp.o
  1417. [ 68%] Building CXX object modules/imgcodecs/CMakeFiles/opencv_test_imgcodecs.dir/test/test_jpeg.cpp.o
  1418. [ 68%] Building CXX object modules/imgcodecs/CMakeFiles/opencv_test_imgcodecs.dir/test/test_main.cpp.o
  1419. [ 68%] Building CXX object modules/imgcodecs/CMakeFiles/opencv_test_imgcodecs.dir/test/test_png.cpp.o
  1420. [ 68%] Building CXX object modules/imgcodecs/CMakeFiles/opencv_test_imgcodecs.dir/test/test_read_write.cpp.o
  1421. [ 68%] Building CXX object modules/imgcodecs/CMakeFiles/opencv_test_imgcodecs.dir/test/test_tiff.cpp.o
  1422. [ 68%] Building CXX object modules/imgcodecs/CMakeFiles/opencv_test_imgcodecs.dir/test/test_webp.cpp.o
  1423. [ 68%] Linking CXX executable ../../bin/opencv_test_imgcodecs
  1424. [ 68%] Built target opencv_test_imgcodecs
  1425. Scanning dependencies of target opencv_perf_videoio
  1426. [ 68%] Building CXX object modules/videoio/CMakeFiles/opencv_perf_videoio.dir/perf/perf_input.cpp.o
  1427. [ 68%] Building CXX object modules/videoio/CMakeFiles/opencv_perf_videoio.dir/perf/perf_main.cpp.o
  1428. [ 68%] Building CXX object modules/videoio/CMakeFiles/opencv_perf_videoio.dir/perf/perf_output.cpp.o
  1429. [ 68%] Linking CXX executable ../../bin/opencv_perf_videoio
  1430. [ 68%] Built target opencv_perf_videoio
  1431. Scanning dependencies of target opencv_test_videoio
  1432. [ 68%] Building CXX object modules/videoio/CMakeFiles/opencv_test_videoio.dir/test/test_camera.cpp.o
  1433. [ 68%] Building CXX object modules/videoio/CMakeFiles/opencv_test_videoio.dir/test/test_container_avi.cpp.o
  1434. [ 68%] Building CXX object modules/videoio/CMakeFiles/opencv_test_videoio.dir/test/test_dynamic.cpp.o
  1435. [ 68%] Building CXX object modules/videoio/CMakeFiles/opencv_test_videoio.dir/test/test_ffmpeg.cpp.o
  1436. [ 68%] Building CXX object modules/videoio/CMakeFiles/opencv_test_videoio.dir/test/test_gstreamer.cpp.o
  1437. [ 69%] Building CXX object modules/videoio/CMakeFiles/opencv_test_videoio.dir/test/test_main.cpp.o
  1438. [ 69%] Building CXX object modules/videoio/CMakeFiles/opencv_test_videoio.dir/test/test_mfx.cpp.o
  1439. [ 69%] Building CXX object modules/videoio/CMakeFiles/opencv_test_videoio.dir/test/test_video_io.cpp.o
  1440. [ 69%] Linking CXX executable ../../bin/opencv_test_videoio
  1441. [ 69%] Built target opencv_test_videoio
  1442. [ 69%] Processing OpenCL kernels (calib3d)
  1443. Scanning dependencies of target opencv_calib3d
  1444. [ 69%] Building CXX object modules/calib3d/CMakeFiles/opencv_calib3d.dir/src/ap3p.cpp.o
  1445. [ 69%] Building CXX object modules/calib3d/CMakeFiles/opencv_calib3d.dir/src/calibinit.cpp.o
  1446. [ 69%] Building CXX object modules/calib3d/CMakeFiles/opencv_calib3d.dir/src/calibration.cpp.o
  1447. [ 69%] Building CXX object modules/calib3d/CMakeFiles/opencv_calib3d.dir/src/calibration_handeye.cpp.o
  1448. [ 69%] Building CXX object modules/calib3d/CMakeFiles/opencv_calib3d.dir/src/checkchessboard.cpp.o
  1449. [ 69%] Building CXX object modules/calib3d/CMakeFiles/opencv_calib3d.dir/src/chessboard.cpp.o
  1450. [ 69%] Building CXX object modules/calib3d/CMakeFiles/opencv_calib3d.dir/src/circlesgrid.cpp.o
  1451. [ 70%] Building CXX object modules/calib3d/CMakeFiles/opencv_calib3d.dir/src/compat_ptsetreg.cpp.o
  1452. [ 70%] Building CXX object modules/calib3d/CMakeFiles/opencv_calib3d.dir/src/dls.cpp.o
  1453. [ 70%] Building CXX object modules/calib3d/CMakeFiles/opencv_calib3d.dir/src/epnp.cpp.o
  1454. [ 70%] Building CXX object modules/calib3d/CMakeFiles/opencv_calib3d.dir/src/fisheye.cpp.o
  1455. [ 70%] Building CXX object modules/calib3d/CMakeFiles/opencv_calib3d.dir/src/five-point.cpp.o
  1456. [ 70%] Building CXX object modules/calib3d/CMakeFiles/opencv_calib3d.dir/src/fundam.cpp.o
  1457. [ 70%] Building CXX object modules/calib3d/CMakeFiles/opencv_calib3d.dir/src/homography_decomp.cpp.o
  1458. [ 70%] Building CXX object modules/calib3d/CMakeFiles/opencv_calib3d.dir/src/ippe.cpp.o
  1459. [ 70%] Building CXX object modules/calib3d/CMakeFiles/opencv_calib3d.dir/src/levmarq.cpp.o
  1460. [ 70%] Building CXX object modules/calib3d/CMakeFiles/opencv_calib3d.dir/src/main.cpp.o
  1461. [ 70%] Building CXX object modules/calib3d/CMakeFiles/opencv_calib3d.dir/src/p3p.cpp.o
  1462. [ 70%] Building CXX object modules/calib3d/CMakeFiles/opencv_calib3d.dir/src/polynom_solver.cpp.o
  1463. [ 70%] Building CXX object modules/calib3d/CMakeFiles/opencv_calib3d.dir/src/posit.cpp.o
  1464. [ 71%] Building CXX object modules/calib3d/CMakeFiles/opencv_calib3d.dir/src/ptsetreg.cpp.o
  1465. [ 71%] Building CXX object modules/calib3d/CMakeFiles/opencv_calib3d.dir/src/quadsubpix.cpp.o
  1466. [ 71%] Building CXX object modules/calib3d/CMakeFiles/opencv_calib3d.dir/src/rho.cpp.o
  1467. [ 71%] Building CXX object modules/calib3d/CMakeFiles/opencv_calib3d.dir/src/solvepnp.cpp.o
  1468. [ 71%] Building CXX object modules/calib3d/CMakeFiles/opencv_calib3d.dir/src/sqpnp.cpp.o
  1469. [ 71%] Building CXX object modules/calib3d/CMakeFiles/opencv_calib3d.dir/src/stereobm.cpp.o
  1470. [ 71%] Building CXX object modules/calib3d/CMakeFiles/opencv_calib3d.dir/src/stereosgbm.cpp.o
  1471. [ 71%] Building CXX object modules/calib3d/CMakeFiles/opencv_calib3d.dir/src/triangulate.cpp.o
  1472. [ 71%] Building CXX object modules/calib3d/CMakeFiles/opencv_calib3d.dir/src/undistort.dispatch.cpp.o
  1473. [ 71%] Building CXX object modules/calib3d/CMakeFiles/opencv_calib3d.dir/src/upnp.cpp.o
  1474. [ 71%] Building CXX object modules/calib3d/CMakeFiles/opencv_calib3d.dir/src/usac/degeneracy.cpp.o
  1475. [ 71%] Building CXX object modules/calib3d/CMakeFiles/opencv_calib3d.dir/src/usac/dls_solver.cpp.o
  1476. [ 72%] Building CXX object modules/calib3d/CMakeFiles/opencv_calib3d.dir/src/usac/essential_solver.cpp.o
  1477. [ 72%] Building CXX object modules/calib3d/CMakeFiles/opencv_calib3d.dir/src/usac/estimator.cpp.o
  1478. [ 72%] Building CXX object modules/calib3d/CMakeFiles/opencv_calib3d.dir/src/usac/fundamental_solver.cpp.o
  1479. [ 72%] Building CXX object modules/calib3d/CMakeFiles/opencv_calib3d.dir/src/usac/gamma_values.cpp.o
  1480. [ 72%] Building CXX object modules/calib3d/CMakeFiles/opencv_calib3d.dir/src/usac/homography_solver.cpp.o
  1481. [ 72%] Building CXX object modules/calib3d/CMakeFiles/opencv_calib3d.dir/src/usac/local_optimization.cpp.o
  1482. [ 72%] Building CXX object modules/calib3d/CMakeFiles/opencv_calib3d.dir/src/usac/pnp_solver.cpp.o
  1483. [ 72%] Building CXX object modules/calib3d/CMakeFiles/opencv_calib3d.dir/src/usac/quality.cpp.o
  1484. [ 72%] Building CXX object modules/calib3d/CMakeFiles/opencv_calib3d.dir/src/usac/ransac_solvers.cpp.o
  1485. [ 72%] Building CXX object modules/calib3d/CMakeFiles/opencv_calib3d.dir/src/usac/sampler.cpp.o
  1486. [ 72%] Building CXX object modules/calib3d/CMakeFiles/opencv_calib3d.dir/src/usac/termination.cpp.o
  1487. [ 72%] Building CXX object modules/calib3d/CMakeFiles/opencv_calib3d.dir/src/usac/utils.cpp.o
  1488. [ 72%] Building CXX object modules/calib3d/CMakeFiles/opencv_calib3d.dir/opencl_kernels_calib3d.cpp.o
  1489. [ 73%] Building CXX object modules/calib3d/CMakeFiles/opencv_calib3d.dir/undistort.avx2.cpp.o
  1490. [ 73%] Linking CXX shared library ../../lib/libopencv_calib3d.so
  1491. [ 73%] Built target opencv_calib3d
  1492. Scanning dependencies of target opencv_perf_calib3d
  1493. [ 73%] Building CXX object modules/calib3d/CMakeFiles/opencv_perf_calib3d.dir/perf/opencl/perf_stereobm.cpp.o
  1494. [ 73%] Building CXX object modules/calib3d/CMakeFiles/opencv_perf_calib3d.dir/perf/perf_affine2d.cpp.o
  1495. [ 74%] Building CXX object modules/calib3d/CMakeFiles/opencv_perf_calib3d.dir/perf/perf_cicrlesGrid.cpp.o
  1496. [ 74%] Building CXX object modules/calib3d/CMakeFiles/opencv_perf_calib3d.dir/perf/perf_main.cpp.o
  1497. [ 74%] Building CXX object modules/calib3d/CMakeFiles/opencv_perf_calib3d.dir/perf/perf_pnp.cpp.o
  1498. [ 74%] Building CXX object modules/calib3d/CMakeFiles/opencv_perf_calib3d.dir/perf/perf_stereosgbm.cpp.o
  1499. [ 74%] Building CXX object modules/calib3d/CMakeFiles/opencv_perf_calib3d.dir/perf/perf_undistort.cpp.o
  1500. [ 74%] Linking CXX executable ../../bin/opencv_perf_calib3d
  1501. [ 74%] Built target opencv_perf_calib3d
  1502. Scanning dependencies of target opencv_test_calib3d
  1503. [ 74%] Building CXX object modules/calib3d/CMakeFiles/opencv_test_calib3d.dir/test/opencl/test_stereobm.cpp.o
  1504. [ 74%] Building CXX object modules/calib3d/CMakeFiles/opencv_test_calib3d.dir/test/test_affine2d_estimator.cpp.o
  1505. [ 74%] Building CXX object modules/calib3d/CMakeFiles/opencv_test_calib3d.dir/test/test_affine3.cpp.o
  1506. [ 74%] Building CXX object modules/calib3d/CMakeFiles/opencv_test_calib3d.dir/test/test_affine3d_estimator.cpp.o
  1507. [ 74%] Building CXX object modules/calib3d/CMakeFiles/opencv_test_calib3d.dir/test/test_affine_partial2d_estimator.cpp.o
  1508. [ 75%] Building CXX object modules/calib3d/CMakeFiles/opencv_test_calib3d.dir/test/test_calibration_hand_eye.cpp.o
  1509. [ 75%] Building CXX object modules/calib3d/CMakeFiles/opencv_test_calib3d.dir/test/test_cameracalibration.cpp.o
  1510. [ 75%] Building CXX object modules/calib3d/CMakeFiles/opencv_test_calib3d.dir/test/test_cameracalibration_artificial.cpp.o
  1511. [ 75%] Building CXX object modules/calib3d/CMakeFiles/opencv_test_calib3d.dir/test/test_cameracalibration_badarg.cpp.o
  1512. [ 75%] Building CXX object modules/calib3d/CMakeFiles/opencv_test_calib3d.dir/test/test_cameracalibration_tilt.cpp.o
  1513. [ 75%] Building CXX object modules/calib3d/CMakeFiles/opencv_test_calib3d.dir/test/test_chessboardgenerator.cpp.o
  1514. [ 75%] Building CXX object modules/calib3d/CMakeFiles/opencv_test_calib3d.dir/test/test_chesscorners.cpp.o
  1515. [ 75%] Building CXX object modules/calib3d/CMakeFiles/opencv_test_calib3d.dir/test/test_chesscorners_badarg.cpp.o
  1516. [ 75%] Building CXX object modules/calib3d/CMakeFiles/opencv_test_calib3d.dir/test/test_chesscorners_timing.cpp.o
  1517. [ 75%] Building CXX object modules/calib3d/CMakeFiles/opencv_test_calib3d.dir/test/test_compose_rt.cpp.o
  1518. [ 75%] Building CXX object modules/calib3d/CMakeFiles/opencv_test_calib3d.dir/test/test_cornerssubpix.cpp.o
  1519. [ 75%] Building CXX object modules/calib3d/CMakeFiles/opencv_test_calib3d.dir/test/test_decompose_projection.cpp.o
  1520. [ 76%] Building CXX object modules/calib3d/CMakeFiles/opencv_test_calib3d.dir/test/test_filter_homography_decomp.cpp.o
  1521. [ 76%] Building CXX object modules/calib3d/CMakeFiles/opencv_test_calib3d.dir/test/test_fisheye.cpp.o
  1522. [ 76%] Building CXX object modules/calib3d/CMakeFiles/opencv_test_calib3d.dir/test/test_fundam.cpp.o
  1523. [ 76%] Building CXX object modules/calib3d/CMakeFiles/opencv_test_calib3d.dir/test/test_homography.cpp.o
  1524. [ 76%] Building CXX object modules/calib3d/CMakeFiles/opencv_test_calib3d.dir/test/test_homography_decomp.cpp.o
  1525. [ 76%] Building CXX object modules/calib3d/CMakeFiles/opencv_test_calib3d.dir/test/test_main.cpp.o
  1526. [ 76%] Building CXX object modules/calib3d/CMakeFiles/opencv_test_calib3d.dir/test/test_modelest.cpp.o
  1527. [ 76%] Building CXX object modules/calib3d/CMakeFiles/opencv_test_calib3d.dir/test/test_posit.cpp.o
  1528. [ 76%] Building CXX object modules/calib3d/CMakeFiles/opencv_test_calib3d.dir/test/test_reproject_image_to_3d.cpp.o
  1529. [ 76%] Building CXX object modules/calib3d/CMakeFiles/opencv_test_calib3d.dir/test/test_solvepnp_ransac.cpp.o
  1530. [ 76%] Building CXX object modules/calib3d/CMakeFiles/opencv_test_calib3d.dir/test/test_stereomatching.cpp.o
  1531. [ 76%] Building CXX object modules/calib3d/CMakeFiles/opencv_test_calib3d.dir/test/test_translation3d_estimator.cpp.o
  1532. [ 76%] Building CXX object modules/calib3d/CMakeFiles/opencv_test_calib3d.dir/test/test_undistort.cpp.o
  1533. [ 77%] Building CXX object modules/calib3d/CMakeFiles/opencv_test_calib3d.dir/test/test_undistort_badarg.cpp.o
  1534. [ 77%] Building CXX object modules/calib3d/CMakeFiles/opencv_test_calib3d.dir/test/test_undistort_points.cpp.o
  1535. [ 77%] Building CXX object modules/calib3d/CMakeFiles/opencv_test_calib3d.dir/test/test_usac.cpp.o
  1536. [ 77%] Linking CXX executable ../../bin/opencv_test_calib3d
  1537. [ 77%] Built target opencv_test_calib3d
  1538. Scanning dependencies of target opencv_test_highgui
  1539. [ 77%] Building CXX object modules/highgui/CMakeFiles/opencv_test_highgui.dir/test/test_gui.cpp.o
  1540. [ 77%] Building CXX object modules/highgui/CMakeFiles/opencv_test_highgui.dir/test/test_main.cpp.o
  1541. [ 78%] Linking CXX executable ../../bin/opencv_test_highgui
  1542. [ 78%] Built target opencv_test_highgui
  1543. Scanning dependencies of target quirc
  1544. [ 78%] Building C object 3rdparty/quirc/CMakeFiles/quirc.dir/src/decode.c.o
  1545. [ 78%] Building C object 3rdparty/quirc/CMakeFiles/quirc.dir/src/quirc.c.o
  1546. [ 78%] Building C object 3rdparty/quirc/CMakeFiles/quirc.dir/src/version_db.c.o
  1547. [ 79%] Linking C static library ../lib/libquirc.a
  1548. [ 79%] Built target quirc
  1549. [ 79%] Processing OpenCL kernels (objdetect)
  1550. Scanning dependencies of target opencv_objdetect
  1551. [ 79%] Building CXX object modules/objdetect/CMakeFiles/opencv_objdetect.dir/src/cascadedetect.cpp.o
  1552. [ 79%] Building CXX object modules/objdetect/CMakeFiles/opencv_objdetect.dir/src/cascadedetect_convert.cpp.o
  1553. [ 79%] Building CXX object modules/objdetect/CMakeFiles/opencv_objdetect.dir/src/detection_based_tracker.cpp.o
  1554. [ 79%] Building CXX object modules/objdetect/CMakeFiles/opencv_objdetect.dir/src/hog.cpp.o
  1555. [ 79%] Building CXX object modules/objdetect/CMakeFiles/opencv_objdetect.dir/src/main.cpp.o
  1556. [ 79%] Building CXX object modules/objdetect/CMakeFiles/opencv_objdetect.dir/src/qrcode.cpp.o
  1557. [ 79%] Building CXX object modules/objdetect/CMakeFiles/opencv_objdetect.dir/opencl_kernels_objdetect.cpp.o
  1558. [ 79%] Linking CXX shared library ../../lib/libopencv_objdetect.so
  1559. [ 79%] Built target opencv_objdetect
  1560. Scanning dependencies of target opencv_perf_objdetect
  1561. [ 79%] Building CXX object modules/objdetect/CMakeFiles/opencv_perf_objdetect.dir/perf/opencl/perf_cascades.cpp.o
  1562. [ 80%] Building CXX object modules/objdetect/CMakeFiles/opencv_perf_objdetect.dir/perf/opencl/perf_hogdetect.cpp.o
  1563. [ 80%] Building CXX object modules/objdetect/CMakeFiles/opencv_perf_objdetect.dir/perf/perf_main.cpp.o
  1564. [ 80%] Building CXX object modules/objdetect/CMakeFiles/opencv_perf_objdetect.dir/perf/perf_qrcode_pipeline.cpp.o
  1565. [ 80%] Linking CXX executable ../../bin/opencv_perf_objdetect
  1566. [ 80%] Built target opencv_perf_objdetect
  1567. Scanning dependencies of target opencv_test_objdetect
  1568. [ 80%] Building CXX object modules/objdetect/CMakeFiles/opencv_test_objdetect.dir/test/opencl/test_hogdetector.cpp.o
  1569. [ 80%] Building CXX object modules/objdetect/CMakeFiles/opencv_test_objdetect.dir/test/test_cascadeandhog.cpp.o
  1570. [ 80%] Building CXX object modules/objdetect/CMakeFiles/opencv_test_objdetect.dir/test/test_main.cpp.o
  1571. [ 80%] Building CXX object modules/objdetect/CMakeFiles/opencv_test_objdetect.dir/test/test_qrcode.cpp.o
  1572. [ 80%] Linking CXX executable ../../bin/opencv_test_objdetect
  1573. [ 80%] Built target opencv_test_objdetect
  1574. [ 80%] Processing OpenCL kernels (stitching)
  1575. Scanning dependencies of target opencv_stitching
  1576. [ 80%] Building CXX object modules/stitching/CMakeFiles/opencv_stitching.dir/src/autocalib.cpp.o
  1577. [ 80%] Building CXX object modules/stitching/CMakeFiles/opencv_stitching.dir/src/blenders.cpp.o
  1578. [ 80%] Building CXX object modules/stitching/CMakeFiles/opencv_stitching.dir/src/camera.cpp.o
  1579. [ 80%] Building CXX object modules/stitching/CMakeFiles/opencv_stitching.dir/src/exposure_compensate.cpp.o
  1580. [ 80%] Building CXX object modules/stitching/CMakeFiles/opencv_stitching.dir/src/matchers.cpp.o
  1581. [ 80%] Building CXX object modules/stitching/CMakeFiles/opencv_stitching.dir/src/motion_estimators.cpp.o
  1582. [ 81%] Building CXX object modules/stitching/CMakeFiles/opencv_stitching.dir/src/seam_finders.cpp.o
  1583. [ 81%] Building CXX object modules/stitching/CMakeFiles/opencv_stitching.dir/src/stitcher.cpp.o
  1584. [ 81%] Building CXX object modules/stitching/CMakeFiles/opencv_stitching.dir/src/timelapsers.cpp.o
  1585. [ 81%] Building CXX object modules/stitching/CMakeFiles/opencv_stitching.dir/src/util.cpp.o
  1586. [ 81%] Building CXX object modules/stitching/CMakeFiles/opencv_stitching.dir/src/warpers.cpp.o
  1587. [ 81%] Building CXX object modules/stitching/CMakeFiles/opencv_stitching.dir/src/warpers_cuda.cpp.o
  1588. [ 81%] Building CXX object modules/stitching/CMakeFiles/opencv_stitching.dir/opencl_kernels_stitching.cpp.o
  1589. [ 81%] Linking CXX shared library ../../lib/libopencv_stitching.so
  1590. [ 81%] Built target opencv_stitching
  1591. Scanning dependencies of target opencv_perf_stitching
  1592. [ 81%] Building CXX object modules/stitching/CMakeFiles/opencv_perf_stitching.dir/perf/opencl/perf_stitch.cpp.o
  1593. [ 81%] Building CXX object modules/stitching/CMakeFiles/opencv_perf_stitching.dir/perf/opencl/perf_warpers.cpp.o
  1594. [ 81%] Building CXX object modules/stitching/CMakeFiles/opencv_perf_stitching.dir/perf/perf_estimators.cpp.o
  1595. [ 82%] Building CXX object modules/stitching/CMakeFiles/opencv_perf_stitching.dir/perf/perf_main.cpp.o
  1596. [ 82%] Building CXX object modules/stitching/CMakeFiles/opencv_perf_stitching.dir/perf/perf_matchers.cpp.o
  1597. [ 82%] Building CXX object modules/stitching/CMakeFiles/opencv_perf_stitching.dir/perf/perf_stich.cpp.o
  1598. [ 82%] Linking CXX executable ../../bin/opencv_perf_stitching
  1599. [ 82%] Built target opencv_perf_stitching
  1600. Scanning dependencies of target opencv_test_stitching
  1601. [ 82%] Building CXX object modules/stitching/CMakeFiles/opencv_test_stitching.dir/test/ocl/test_warpers.cpp.o
  1602. [ 82%] Building CXX object modules/stitching/CMakeFiles/opencv_test_stitching.dir/test/test_blenders.cpp.o
  1603. [ 82%] Building CXX object modules/stitching/CMakeFiles/opencv_test_stitching.dir/test/test_blenders.cuda.cpp.o
  1604. [ 82%] Building CXX object modules/stitching/CMakeFiles/opencv_test_stitching.dir/test/test_exposure_compensate.cpp.o
  1605. [ 83%] Building CXX object modules/stitching/CMakeFiles/opencv_test_stitching.dir/test/test_main.cpp.o
  1606. [ 83%] Building CXX object modules/stitching/CMakeFiles/opencv_test_stitching.dir/test/test_matchers.cpp.o
  1607. [ 83%] Building CXX object modules/stitching/CMakeFiles/opencv_test_stitching.dir/test/test_reprojection.cpp.o
  1608. [ 83%] Building CXX object modules/stitching/CMakeFiles/opencv_test_stitching.dir/test/test_wave_correction.cpp.o
  1609. [ 83%] Linking CXX executable ../../bin/opencv_test_stitching
  1610. [ 83%] Built target opencv_test_stitching
  1611. [ 83%] Processing OpenCL kernels (video)
  1612. Scanning dependencies of target opencv_video
  1613. [ 83%] Building CXX object modules/video/CMakeFiles/opencv_video.dir/src/bgfg_KNN.cpp.o
  1614. [ 83%] Building CXX object modules/video/CMakeFiles/opencv_video.dir/src/bgfg_gaussmix2.cpp.o
  1615. [ 83%] Building CXX object modules/video/CMakeFiles/opencv_video.dir/src/camshift.cpp.o
  1616. [ 83%] Building CXX object modules/video/CMakeFiles/opencv_video.dir/src/dis_flow.cpp.o
  1617. [ 83%] Building CXX object modules/video/CMakeFiles/opencv_video.dir/src/ecc.cpp.o
  1618. [ 83%] Building CXX object modules/video/CMakeFiles/opencv_video.dir/src/kalman.cpp.o
  1619. [ 83%] Building CXX object modules/video/CMakeFiles/opencv_video.dir/src/lkpyramid.cpp.o
  1620. [ 84%] Building CXX object modules/video/CMakeFiles/opencv_video.dir/src/optflowgf.cpp.o
  1621. [ 84%] Building CXX object modules/video/CMakeFiles/opencv_video.dir/src/optical_flow_io.cpp.o
  1622. [ 84%] Building CXX object modules/video/CMakeFiles/opencv_video.dir/src/tracking/detail/tracker_feature.cpp.o
  1623. [ 84%] Building CXX object modules/video/CMakeFiles/opencv_video.dir/src/tracking/detail/tracker_feature_set.cpp.o
  1624. [ 84%] Building CXX object modules/video/CMakeFiles/opencv_video.dir/src/tracking/detail/tracker_mil_model.cpp.o
  1625. [ 84%] Building CXX object modules/video/CMakeFiles/opencv_video.dir/src/tracking/detail/tracker_mil_state.cpp.o
  1626. [ 84%] Building CXX object modules/video/CMakeFiles/opencv_video.dir/src/tracking/detail/tracker_model.cpp.o
  1627. [ 84%] Building CXX object modules/video/CMakeFiles/opencv_video.dir/src/tracking/detail/tracker_sampler.cpp.o
  1628. [ 84%] Building CXX object modules/video/CMakeFiles/opencv_video.dir/src/tracking/detail/tracker_sampler_algorithm.cpp.o
  1629. [ 84%] Building CXX object modules/video/CMakeFiles/opencv_video.dir/src/tracking/detail/tracker_state_estimator.cpp.o
  1630. [ 84%] Building CXX object modules/video/CMakeFiles/opencv_video.dir/src/tracking/detail/tracking_feature.cpp.o
  1631. [ 84%] Building CXX object modules/video/CMakeFiles/opencv_video.dir/src/tracking/detail/tracking_online_mil.cpp.o
  1632. [ 85%] Building CXX object modules/video/CMakeFiles/opencv_video.dir/src/tracking/tracker.cpp.o
  1633. [ 85%] Building CXX object modules/video/CMakeFiles/opencv_video.dir/src/tracking/tracker_goturn.cpp.o
  1634. [ 85%] Building CXX object modules/video/CMakeFiles/opencv_video.dir/src/tracking/tracker_mil.cpp.o
  1635. [ 85%] Building CXX object modules/video/CMakeFiles/opencv_video.dir/src/variational_refinement.cpp.o
  1636. [ 85%] Building CXX object modules/video/CMakeFiles/opencv_video.dir/opencl_kernels_video.cpp.o
  1637. [ 85%] Linking CXX shared library ../../lib/libopencv_video.so
  1638. [ 85%] Built target opencv_video
  1639. Scanning dependencies of target opencv_perf_video
  1640. [ 85%] Building CXX object modules/video/CMakeFiles/opencv_perf_video.dir/perf/opencl/perf_bgfg_knn.cpp.o
  1641. [ 85%] Building CXX object modules/video/CMakeFiles/opencv_perf_video.dir/perf/opencl/perf_bgfg_mog2.cpp.o
  1642. [ 85%] Building CXX object modules/video/CMakeFiles/opencv_perf_video.dir/perf/opencl/perf_dis_optflow.cpp.o
  1643. [ 85%] Building CXX object modules/video/CMakeFiles/opencv_perf_video.dir/perf/opencl/perf_motempl.cpp.o
  1644. [ 85%] Building CXX object modules/video/CMakeFiles/opencv_perf_video.dir/perf/opencl/perf_optflow_farneback.cpp.o
  1645. [ 85%] Building CXX object modules/video/CMakeFiles/opencv_perf_video.dir/perf/opencl/perf_optflow_pyrlk.cpp.o
  1646. [ 85%] Building CXX object modules/video/CMakeFiles/opencv_perf_video.dir/perf/perf_bgfg_knn.cpp.o
  1647. [ 85%] Building CXX object modules/video/CMakeFiles/opencv_perf_video.dir/perf/perf_bgfg_mog2.cpp.o
  1648. [ 85%] Building CXX object modules/video/CMakeFiles/opencv_perf_video.dir/perf/perf_disflow.cpp.o
  1649. [ 86%] Building CXX object modules/video/CMakeFiles/opencv_perf_video.dir/perf/perf_ecc.cpp.o
  1650. [ 86%] Building CXX object modules/video/CMakeFiles/opencv_perf_video.dir/perf/perf_main.cpp.o
  1651. [ 86%] Building CXX object modules/video/CMakeFiles/opencv_perf_video.dir/perf/perf_optflowpyrlk.cpp.o
  1652. [ 86%] Building CXX object modules/video/CMakeFiles/opencv_perf_video.dir/perf/perf_trackers.cpp.o
  1653. [ 86%] Building CXX object modules/video/CMakeFiles/opencv_perf_video.dir/perf/perf_variational_refinement.cpp.o
  1654. [ 86%] Linking CXX executable ../../bin/opencv_perf_video
  1655. [ 86%] Built target opencv_perf_video
  1656. Scanning dependencies of target opencv_test_video
  1657. [ 86%] Building CXX object modules/video/CMakeFiles/opencv_test_video.dir/test/ocl/test_bgfg_mog2.cpp.o
  1658. [ 86%] Building CXX object modules/video/CMakeFiles/opencv_test_video.dir/test/ocl/test_dis.cpp.o
  1659. [ 86%] Building CXX object modules/video/CMakeFiles/opencv_test_video.dir/test/ocl/test_optflow_farneback.cpp.o
  1660. [ 86%] Building CXX object modules/video/CMakeFiles/opencv_test_video.dir/test/ocl/test_optflowpyrlk.cpp.o
  1661. [ 86%] Building CXX object modules/video/CMakeFiles/opencv_test_video.dir/test/test_OF_accuracy.cpp.o
  1662. [ 86%] Building CXX object modules/video/CMakeFiles/opencv_test_video.dir/test/test_OF_reproducibility.cpp.o
  1663. [ 86%] Building CXX object modules/video/CMakeFiles/opencv_test_video.dir/test/test_accum.cpp.o
  1664. [ 87%] Building CXX object modules/video/CMakeFiles/opencv_test_video.dir/test/test_camshift.cpp.o
  1665. [ 87%] Building CXX object modules/video/CMakeFiles/opencv_test_video.dir/test/test_ecc.cpp.o
  1666. [ 87%] Building CXX object modules/video/CMakeFiles/opencv_test_video.dir/test/test_estimaterigid.cpp.o
  1667. [ 87%] Building CXX object modules/video/CMakeFiles/opencv_test_video.dir/test/test_kalman.cpp.o
  1668. [ 87%] Building CXX object modules/video/CMakeFiles/opencv_test_video.dir/test/test_main.cpp.o
  1669. [ 87%] Building CXX object modules/video/CMakeFiles/opencv_test_video.dir/test/test_optflowpyrlk.cpp.o
  1670. [ 87%] Building CXX object modules/video/CMakeFiles/opencv_test_video.dir/test/test_trackers.cpp.o
  1671. [ 87%] Linking CXX executable ../../bin/opencv_test_video
  1672. [ 87%] Built target opencv_test_video
  1673. Scanning dependencies of target opencv_gapi
  1674. [ 87%] Building CXX object modules/gapi/CMakeFiles/opencv_gapi.dir/src/api/grunarg.cpp.o
  1675. [ 87%] Building CXX object modules/gapi/CMakeFiles/opencv_gapi.dir/src/api/gorigin.cpp.o
  1676. [ 88%] Building CXX object modules/gapi/CMakeFiles/opencv_gapi.dir/src/api/gmat.cpp.o
  1677. [ 88%] Building CXX object modules/gapi/CMakeFiles/opencv_gapi.dir/src/api/garray.cpp.o
  1678. [ 88%] Building CXX object modules/gapi/CMakeFiles/opencv_gapi.dir/src/api/gopaque.cpp.o
  1679. [ 88%] Building CXX object modules/gapi/CMakeFiles/opencv_gapi.dir/src/api/gscalar.cpp.o
  1680. [ 88%] Building CXX object modules/gapi/CMakeFiles/opencv_gapi.dir/src/api/gframe.cpp.o
  1681. [ 88%] Building CXX object modules/gapi/CMakeFiles/opencv_gapi.dir/src/api/gkernel.cpp.o
  1682. [ 88%] Building CXX object modules/gapi/CMakeFiles/opencv_gapi.dir/src/api/gbackend.cpp.o
  1683. [ 88%] Building CXX object modules/gapi/CMakeFiles/opencv_gapi.dir/src/api/gproto.cpp.o
  1684. [ 88%] Building CXX object modules/gapi/CMakeFiles/opencv_gapi.dir/src/api/gnode.cpp.o
  1685. [ 88%] Building CXX object modules/gapi/CMakeFiles/opencv_gapi.dir/src/api/gcall.cpp.o
  1686. [ 88%] Building CXX object modules/gapi/CMakeFiles/opencv_gapi.dir/src/api/gcomputation.cpp.o
  1687. [ 88%] Building CXX object modules/gapi/CMakeFiles/opencv_gapi.dir/src/api/operators.cpp.o
  1688. [ 89%] Building CXX object modules/gapi/CMakeFiles/opencv_gapi.dir/src/api/kernels_core.cpp.o
  1689. [ 89%] Building CXX object modules/gapi/CMakeFiles/opencv_gapi.dir/src/api/kernels_imgproc.cpp.o
  1690. [ 89%] Building CXX object modules/gapi/CMakeFiles/opencv_gapi.dir/src/api/kernels_video.cpp.o
  1691. [ 89%] Building CXX object modules/gapi/CMakeFiles/opencv_gapi.dir/src/api/kernels_nnparsers.cpp.o
  1692. [ 89%] Building CXX object modules/gapi/CMakeFiles/opencv_gapi.dir/src/api/kernels_streaming.cpp.o
  1693. [ 89%] Building CXX object modules/gapi/CMakeFiles/opencv_gapi.dir/src/api/render.cpp.o
  1694. [ 89%] Building CXX object modules/gapi/CMakeFiles/opencv_gapi.dir/src/api/render_ocv.cpp.o
  1695. [ 89%] Building CXX object modules/gapi/CMakeFiles/opencv_gapi.dir/src/api/ginfer.cpp.o
  1696. [ 89%] Building CXX object modules/gapi/CMakeFiles/opencv_gapi.dir/src/api/media.cpp.o
  1697. [ 89%] Building CXX object modules/gapi/CMakeFiles/opencv_gapi.dir/src/api/rmat.cpp.o
  1698. [ 89%] Building CXX object modules/gapi/CMakeFiles/opencv_gapi.dir/src/compiler/gmodel.cpp.o
  1699. [ 89%] Building CXX object modules/gapi/CMakeFiles/opencv_gapi.dir/src/compiler/gmodelbuilder.cpp.o
  1700. [ 89%] Building CXX object modules/gapi/CMakeFiles/opencv_gapi.dir/src/compiler/gislandmodel.cpp.o
  1701. [ 90%] Building CXX object modules/gapi/CMakeFiles/opencv_gapi.dir/src/compiler/gcompiler.cpp.o
  1702. [ 90%] Building CXX object modules/gapi/CMakeFiles/opencv_gapi.dir/src/compiler/gcompiled.cpp.o
  1703. [ 90%] Building CXX object modules/gapi/CMakeFiles/opencv_gapi.dir/src/compiler/gstreaming.cpp.o
  1704. [ 90%] Building CXX object modules/gapi/CMakeFiles/opencv_gapi.dir/src/compiler/passes/helpers.cpp.o
  1705. [ 90%] Building CXX object modules/gapi/CMakeFiles/opencv_gapi.dir/src/compiler/passes/dump_dot.cpp.o
  1706. [ 90%] Building CXX object modules/gapi/CMakeFiles/opencv_gapi.dir/src/compiler/passes/islands.cpp.o
  1707. [ 90%] Building CXX object modules/gapi/CMakeFiles/opencv_gapi.dir/src/compiler/passes/meta.cpp.o
  1708. [ 90%] Building CXX object modules/gapi/CMakeFiles/opencv_gapi.dir/src/compiler/passes/kernels.cpp.o
  1709. [ 90%] Building CXX object modules/gapi/CMakeFiles/opencv_gapi.dir/src/compiler/passes/exec.cpp.o
  1710. [ 90%] Building CXX object modules/gapi/CMakeFiles/opencv_gapi.dir/src/compiler/passes/transformations.cpp.o
  1711. [ 90%] Building CXX object modules/gapi/CMakeFiles/opencv_gapi.dir/src/compiler/passes/pattern_matching.cpp.o
  1712. [ 90%] Building CXX object modules/gapi/CMakeFiles/opencv_gapi.dir/src/compiler/passes/perform_substitution.cpp.o
  1713. [ 91%] Building CXX object modules/gapi/CMakeFiles/opencv_gapi.dir/src/compiler/passes/streaming.cpp.o
  1714. [ 91%] Building CXX object modules/gapi/CMakeFiles/opencv_gapi.dir/src/compiler/passes/intrin.cpp.o
  1715. [ 91%] Building CXX object modules/gapi/CMakeFiles/opencv_gapi.dir/src/executor/gexecutor.cpp.o
  1716. [ 91%] Building CXX object modules/gapi/CMakeFiles/opencv_gapi.dir/src/executor/gtbbexecutor.cpp.o
  1717. [ 91%] Building CXX object modules/gapi/CMakeFiles/opencv_gapi.dir/src/executor/gstreamingexecutor.cpp.o
  1718. [ 91%] Building CXX object modules/gapi/CMakeFiles/opencv_gapi.dir/src/executor/gasync.cpp.o
  1719. [ 91%] Building CXX object modules/gapi/CMakeFiles/opencv_gapi.dir/src/backends/cpu/gcpubackend.cpp.o
  1720. [ 91%] Building CXX object modules/gapi/CMakeFiles/opencv_gapi.dir/src/backends/cpu/gcpukernel.cpp.o
  1721. [ 91%] Building CXX object modules/gapi/CMakeFiles/opencv_gapi.dir/src/backends/cpu/gcpuimgproc.cpp.o
  1722. [ 91%] Building CXX object modules/gapi/CMakeFiles/opencv_gapi.dir/src/backends/cpu/gcpuvideo.cpp.o
  1723. [ 91%] Building CXX object modules/gapi/CMakeFiles/opencv_gapi.dir/src/backends/cpu/gcpucore.cpp.o
  1724. [ 91%] Building CXX object modules/gapi/CMakeFiles/opencv_gapi.dir/src/backends/cpu/gnnparsers.cpp.o
  1725. [ 91%] Building CXX object modules/gapi/CMakeFiles/opencv_gapi.dir/src/backends/fluid/gfluidbuffer.cpp.o
  1726. [ 92%] Building CXX object modules/gapi/CMakeFiles/opencv_gapi.dir/src/backends/fluid/gfluidbackend.cpp.o
  1727. [ 92%] Building CXX object modules/gapi/CMakeFiles/opencv_gapi.dir/src/backends/fluid/gfluidimgproc.cpp.o
  1728. [ 92%] Building CXX object modules/gapi/CMakeFiles/opencv_gapi.dir/src/backends/fluid/gfluidimgproc_func.dispatch.cpp.o
  1729. [ 92%] Building CXX object modules/gapi/CMakeFiles/opencv_gapi.dir/src/backends/fluid/gfluidcore.cpp.o
  1730. [ 92%] Building CXX object modules/gapi/CMakeFiles/opencv_gapi.dir/src/backends/ocl/goclbackend.cpp.o
  1731. [ 92%] Building CXX object modules/gapi/CMakeFiles/opencv_gapi.dir/src/backends/ocl/goclkernel.cpp.o
  1732. [ 92%] Building CXX object modules/gapi/CMakeFiles/opencv_gapi.dir/src/backends/ocl/goclimgproc.cpp.o
  1733. [ 92%] Building CXX object modules/gapi/CMakeFiles/opencv_gapi.dir/src/backends/ocl/goclcore.cpp.o
  1734. [ 92%] Building CXX object modules/gapi/CMakeFiles/opencv_gapi.dir/src/backends/ie/giebackend.cpp.o
  1735. [ 92%] Building CXX object modules/gapi/CMakeFiles/opencv_gapi.dir/src/backends/ie/giebackend/giewrapper.cpp.o
  1736. [ 92%] Building CXX object modules/gapi/CMakeFiles/opencv_gapi.dir/src/backends/onnx/gonnxbackend.cpp.o
  1737. [ 92%] Building CXX object modules/gapi/CMakeFiles/opencv_gapi.dir/src/backends/render/grenderocv.cpp.o
  1738. [ 93%] Building CXX object modules/gapi/CMakeFiles/opencv_gapi.dir/src/backends/render/ft_render.cpp.o
  1739. [ 93%] Building CXX object modules/gapi/CMakeFiles/opencv_gapi.dir/src/backends/plaidml/gplaidmlcore.cpp.o
  1740. [ 93%] Building CXX object modules/gapi/CMakeFiles/opencv_gapi.dir/src/backends/plaidml/gplaidmlbackend.cpp.o
  1741. [ 93%] Building CXX object modules/gapi/CMakeFiles/opencv_gapi.dir/src/backends/common/gmetabackend.cpp.o
  1742. [ 93%] Building CXX object modules/gapi/CMakeFiles/opencv_gapi.dir/src/backends/common/gcompoundbackend.cpp.o
  1743. [ 93%] Building CXX object modules/gapi/CMakeFiles/opencv_gapi.dir/src/backends/common/gcompoundkernel.cpp.o
  1744. [ 93%] Building CXX object modules/gapi/CMakeFiles/opencv_gapi.dir/src/api/s11n.cpp.o
  1745. [ 93%] Building CXX object modules/gapi/CMakeFiles/opencv_gapi.dir/src/backends/common/serialization.cpp.o
  1746. [ 93%] Building CXX object modules/gapi/CMakeFiles/opencv_gapi.dir/src/backends/streaming/gstreamingbackend.cpp.o
  1747. [ 93%] Building CXX object modules/gapi/CMakeFiles/opencv_gapi.dir/src/backends/ie/bindings_ie.cpp.o
  1748. [ 93%] Building CXX object modules/gapi/CMakeFiles/opencv_gapi.dir/backends/fluid/gfluidimgproc_func.sse4_1.cpp.o
  1749. [ 93%] Building CXX object modules/gapi/CMakeFiles/opencv_gapi.dir/backends/fluid/gfluidimgproc_func.avx2.cpp.o
  1750. [ 93%] Linking CXX shared library ../../lib/libopencv_gapi.so
  1751. [ 93%] Built target opencv_gapi
  1752. Scanning dependencies of target opencv_perf_gapi
  1753. [ 93%] Building CXX object modules/gapi/CMakeFiles/opencv_perf_gapi.dir/perf/common/gapi_core_perf_tests.cpp.o
  1754. [ 93%] Building CXX object modules/gapi/CMakeFiles/opencv_perf_gapi.dir/perf/common/gapi_imgproc_perf_tests.cpp.o
  1755. c++: fatal error: Killed signal terminated program cc1plus
  1756. compilation terminated.
  1757. make[2]: *** [modules/gapi/CMakeFiles/opencv_perf_gapi.dir/build.make:76: modules/gapi/CMakeFiles/opencv_perf_gapi.dir/perf/common/gapi_imgproc_perf_tests.cpp.o] Error 1
  1758. make[1]: *** [CMakeFiles/Makefile2:3195: modules/gapi/CMakeFiles/opencv_perf_gapi.dir/all] Error 2
  1759. make: *** [Makefile:163: all] Error 2
  1760. sam@sam-Base:~/sam/download/opencv/build$
  1761. sam@sam-Base:~/sam/download/opencv/build$ cmake --version
  1762. cmake version 3.16.3
  1763.  
  1764. CMake suite maintained and supported by Kitware (kitware.com/cmake).
  1765. sam@sam-Base:~/sam/download/opencv/build$ make --version
  1766. GNU Make 4.2.1
  1767. Built for x86_64-pc-linux-gnu
  1768. Copyright (C) 1988-2016 Free Software Foundation, Inc.
  1769. License GPLv3+: GNU GPL version 3 or later <http://gnu.org/licenses/gpl.html>
  1770. This is free software: you are free to change and redistribute it.
  1771. There is NO WARRANTY, to the extent permitted by law.
  1772. sam@sam-Base:~/sam/download/opencv/build$
  1773.  
RAW Paste Data