dominus

Untitled

Sep 28th, 2020
121
Never
Not a member of Pastebin yet? Sign Up, it unlocks many cool features!
  1. dtk@DTK mame % make -j1 VERBOSE=1 macosx_arm64_clang
  2. Clang 12.0.0 detected
  3. /Applications/Xcode-beta.app/Contents/Developer/usr/bin/make -R verbose=1 -C build/projects/sdl/mame/gmake-osx-clang config=release64 precompile
  4. /Applications/Xcode-beta.app/Contents/Developer/usr/bin/make -R verbose=1 -C build/projects/sdl/mame/gmake-osx-clang config=release64
  5. Compiling src/osd/modules/input/input_common.cpp...
  6. clang++ -MMD -MP -MP -DPTR64=1 -DNDEBUG -DCRLF=2 -DLSB_FIRST -DFLAC__NO_DLL -DPUGIXML_HEADER_ONLY -DMAME_NOASM -DLUA_COMPAT_ALL -DLUA_COMPAT_5_1 -DLUA_COMPAT_5_2 -DSDLMAME_NO_X11 -DUSE_XINPUT=0 -DUSE_XINPUT_WII_LIGHTGUN_HACK=0 -DSDLMAME_SDL2=1 -DOSD_SDL -DSDLMAME_UNIX -DSDLMAME_MACOSX -DSDLMAME_DARWIN -DUSE_OPENGL=1 -D__STDC_LIMIT_MACROS -D__STDC_FORMAT_MACROS -D__STDC_CONSTANT_MACROS -DIMGUI_DISABLE_OBSOLETE_FUNCTIONS -DUSE_QTDEBUG=0 -I"../../../../../3rdparty/bx/include/compat/osx" -I"../../../../../3rdparty/asio/include" -I"../../../../../3rdparty/bgfx/examples/common" -I"../../../../../3rdparty/bgfx/include" -I"../../../../../3rdparty/bgfx/3rdparty" -I"../../../../../3rdparty/bgfx/3rdparty/khronos" -I"../../../../../3rdparty/bx/include" -I"../../../../../3rdparty/rapidjson/include" -I"../../../../../3rdparty/portaudio/include" -I"../../../../../3rdparty/portmidi/pm_common" -I"../../../../../src/emu" -I"../../../../../src/devices" -I"../../../../../src/osd" -I"../../../../../src/lib" -I"../../../../../src/lib/util" -I"../../../../../src/osd/modules/file" -I"../../../../../src/osd/modules/render" -I"../../../../../3rdparty" -I"../../../../../src/osd/sdl" -m64 -arch arm64 -pipe -Werror -O3 -fno-strict-aliasing -Wno-unknown-pragmas -Wall -Wcast-align -Wundef -Wformat-security -Wwrite-strings -Wno-sign-compare -Wno-conversion -Wno-error=deprecated-declarations -Wno-cast-align -Wno-tautological-compare -Wno-unused-value -Wno-constant-logical-operand -fdiagnostics-show-note-include-stack -Wno-unknown-warning-option -Wno-extern-c-compat -Wno-unknown-attributes -Wno-ignored-qualifiers -Wno-pragma-pack -m64 -DHAVE_IMMINTRIN_H=1 -F/Library/Frameworks/ -std=c++14 -Woverloaded-virtual -include /Users/dtk/code/mame/src/osd/sdl/sdlprefix.h -o "../../../../osx_clang/obj/x64/Release/osd_sdl/src/osd/modules/input/input_common.o" -c "../../../../../src/osd/modules/input/input_common.cpp"
  7. In file included from ../../../../../src/osd/modules/input/input_common.cpp:36:
  8. In file included from /Library/Frameworks/SDL2.framework/Headers/SDL.h:38:
  9. In file included from /Library/Frameworks/SDL2.framework/Headers/SDL_cpuinfo.h:86:
  10. In file included from /Applications/Xcode-beta.app/Contents/Developer/Toolchains/XcodeDefault.xctoolchain/usr/lib/clang/12.0.0/include/immintrin.h:14:
  11. /Applications/Xcode-beta.app/Contents/Developer/Toolchains/XcodeDefault.xctoolchain/usr/lib/clang/12.0.0/include/mmintrin.h:33:5: error:
  12. use of undeclared identifier '__builtin_ia32_emms'; did you mean '__builtin_isless'?
  13. __builtin_ia32_emms();
  14. ^
  15. In file included from ../../../../../src/osd/modules/input/input_common.cpp:11:
  16. In file included from ../../../../../src/osd/modules/input/input_module.h:12:
  17. In file included from ../../../../../src/osd/osdepend.h:16:
  18. In file included from ../../../../../src/emu/emucore.h:17:
  19. In file included from /Applications/Xcode-beta.app/Contents/Developer/Toolchains/XcodeDefault.xctoolchain/usr/bin/../include/c++/v1/cassert:20:
  20. In file included from /Applications/xcode-beta.app/contents/developer/Platforms/MacOSX.platform/Developer/SDKs/MacOSX.sdk/usr/include/assert.h:44:
  21. In file included from /Applications/Xcode-beta.app/Contents/Developer/Toolchains/XcodeDefault.xctoolchain/usr/bin/../include/c++/v1/stdlib.h:100:
  22. /Applications/Xcode-beta.app/Contents/Developer/Toolchains/XcodeDefault.xctoolchain/usr/bin/../include/c++/v1/math.h:647:12: note:
  23. '__builtin_isless' declared here
  24. return isless(__lcpp_x, __lcpp_y);
  25. ^
  26. In file included from ../../../../../src/osd/modules/input/input_common.cpp:11:
  27. In file included from ../../../../../src/osd/modules/input/input_module.h:12:
  28. In file included from ../../../../../src/osd/osdepend.h:16:
  29. In file included from ../../../../../src/emu/emucore.h:17:
  30. In file included from /Applications/Xcode-beta.app/Contents/Developer/Toolchains/XcodeDefault.xctoolchain/usr/bin/../include/c++/v1/cassert:20:
  31. In file included from /Applications/xcode-beta.app/contents/developer/Platforms/MacOSX.platform/Developer/SDKs/MacOSX.sdk/usr/include/assert.h:44:
  32. In file included from /Applications/Xcode-beta.app/Contents/Developer/Toolchains/XcodeDefault.xctoolchain/usr/bin/../include/c++/v1/stdlib.h:100:
  33. In file included from /Applications/Xcode-beta.app/Contents/Developer/Toolchains/XcodeDefault.xctoolchain/usr/bin/../include/c++/v1/math.h:303:
  34. /Applications/xcode-beta.app/contents/developer/Platforms/MacOSX.platform/Developer/SDKs/MacOSX.sdk/usr/include/math.h:545:22: note:
  35. expanded from macro 'isless'
  36. #define isless(x, y) __builtin_isless((x),(y))
  37. ^
  38. In file included from ../../../../../src/osd/modules/input/input_common.cpp:36:
  39. In file included from /Library/Frameworks/SDL2.framework/Headers/SDL.h:38:
  40. In file included from /Library/Frameworks/SDL2.framework/Headers/SDL_cpuinfo.h:86:
  41. In file included from /Applications/Xcode-beta.app/Contents/Developer/Toolchains/XcodeDefault.xctoolchain/usr/lib/clang/12.0.0/include/immintrin.h:14:
  42. /Applications/Xcode-beta.app/Contents/Developer/Toolchains/XcodeDefault.xctoolchain/usr/lib/clang/12.0.0/include/mmintrin.h:33:25: error:
  43. too few arguments to function call, expected 2, have 0
  44. __builtin_ia32_emms();
  45. ^
  46. /Applications/Xcode-beta.app/Contents/Developer/Toolchains/XcodeDefault.xctoolchain/usr/lib/clang/12.0.0/include/mmintrin.h:50:19: error:
  47. use of undeclared identifier '__builtin_ia32_vec_init_v2si'
  48. return (__m64)__builtin_ia32_vec_init_v2si(__i, 0);
  49. ^
  50. /Applications/Xcode-beta.app/Contents/Developer/Toolchains/XcodeDefault.xctoolchain/usr/lib/clang/12.0.0/include/mmintrin.h:67:12: error:
  51. use of undeclared identifier '__builtin_ia32_vec_ext_v2si'
  52. return __builtin_ia32_vec_ext_v2si((__v2si)__m, 0);
  53. ^
  54. /Applications/Xcode-beta.app/Contents/Developer/Toolchains/XcodeDefault.xctoolchain/usr/lib/clang/12.0.0/include/mmintrin.h:129:19: error:
  55. use of undeclared identifier '__builtin_ia32_packsswb'
  56. return (__m64)__builtin_ia32_packsswb((__v4hi)__m1, (__v4hi)__m2);
  57. ^
  58. /Applications/Xcode-beta.app/Contents/Developer/Toolchains/XcodeDefault.xctoolchain/usr/lib/clang/12.0.0/include/mmintrin.h:159:19: error:
  59. use of undeclared identifier '__builtin_ia32_packssdw'
  60. return (__m64)__builtin_ia32_packssdw((__v2si)__m1, (__v2si)__m2);
  61. ^
  62. /Applications/Xcode-beta.app/Contents/Developer/Toolchains/XcodeDefault.xctoolchain/usr/lib/clang/12.0.0/include/mmintrin.h:189:19: error:
  63. use of undeclared identifier '__builtin_ia32_packuswb'
  64. return (__m64)__builtin_ia32_packuswb((__v4hi)__m1, (__v4hi)__m2);
  65. ^
  66. /Applications/Xcode-beta.app/Contents/Developer/Toolchains/XcodeDefault.xctoolchain/usr/lib/clang/12.0.0/include/mmintrin.h:216:19: error:
  67. use of undeclared identifier '__builtin_ia32_punpckhbw'
  68. return (__m64)__builtin_ia32_punpckhbw((__v8qi)__m1, (__v8qi)__m2);
  69. ^
  70. /Applications/Xcode-beta.app/Contents/Developer/Toolchains/XcodeDefault.xctoolchain/usr/lib/clang/12.0.0/include/mmintrin.h:239:19: error:
  71. use of undeclared identifier '__builtin_ia32_punpckhwd'
  72. return (__m64)__builtin_ia32_punpckhwd((__v4hi)__m1, (__v4hi)__m2);
  73. ^
  74. /Applications/Xcode-beta.app/Contents/Developer/Toolchains/XcodeDefault.xctoolchain/usr/lib/clang/12.0.0/include/mmintrin.h:260:19: error:
  75. use of undeclared identifier '__builtin_ia32_punpckhdq'
  76. return (__m64)__builtin_ia32_punpckhdq((__v2si)__m1, (__v2si)__m2);
  77. ^
  78. /Applications/Xcode-beta.app/Contents/Developer/Toolchains/XcodeDefault.xctoolchain/usr/lib/clang/12.0.0/include/mmintrin.h:287:19: error:
  79. use of undeclared identifier '__builtin_ia32_punpcklbw'
  80. return (__m64)__builtin_ia32_punpcklbw((__v8qi)__m1, (__v8qi)__m2);
  81. ^
  82. /Applications/Xcode-beta.app/Contents/Developer/Toolchains/XcodeDefault.xctoolchain/usr/lib/clang/12.0.0/include/mmintrin.h:310:19: error:
  83. use of undeclared identifier '__builtin_ia32_punpcklwd'
  84. return (__m64)__builtin_ia32_punpcklwd((__v4hi)__m1, (__v4hi)__m2);
  85. ^
  86. /Applications/Xcode-beta.app/Contents/Developer/Toolchains/XcodeDefault.xctoolchain/usr/lib/clang/12.0.0/include/mmintrin.h:331:19: error:
  87. use of undeclared identifier '__builtin_ia32_punpckldq'
  88. return (__m64)__builtin_ia32_punpckldq((__v2si)__m1, (__v2si)__m2);
  89. ^
  90. /Applications/Xcode-beta.app/Contents/Developer/Toolchains/XcodeDefault.xctoolchain/usr/lib/clang/12.0.0/include/mmintrin.h:352:19: error:
  91. use of undeclared identifier '__builtin_ia32_paddb'; did you mean '__builtin_arm_addg'?
  92. return (__m64)__builtin_ia32_paddb((__v8qi)__m1, (__v8qi)__m2);
  93. ^
  94. /Applications/Xcode-beta.app/Contents/Developer/Toolchains/XcodeDefault.xctoolchain/usr/lib/clang/12.0.0/include/mmintrin.h:352:19: note:
  95. '__builtin_arm_addg' declared here
  96. /Applications/Xcode-beta.app/Contents/Developer/Toolchains/XcodeDefault.xctoolchain/usr/lib/clang/12.0.0/include/mmintrin.h:352:19: error:
  97. first argument of MTE builtin function must be a pointer ('__v8qi' (vector of 8 'char' values) invalid)
  98. return (__m64)__builtin_ia32_paddb((__v8qi)__m1, (__v8qi)__m2);
  99. ^ ~~~~~~~~~~~~
  100. /Applications/Xcode-beta.app/Contents/Developer/Toolchains/XcodeDefault.xctoolchain/usr/lib/clang/12.0.0/include/mmintrin.h:373:19: error:
  101. use of undeclared identifier '__builtin_ia32_paddw'; did you mean '__builtin_arm_addg'?
  102. return (__m64)__builtin_ia32_paddw((__v4hi)__m1, (__v4hi)__m2);
  103. ^
  104. /Applications/Xcode-beta.app/Contents/Developer/Toolchains/XcodeDefault.xctoolchain/usr/lib/clang/12.0.0/include/mmintrin.h:352:19: note:
  105. '__builtin_arm_addg' declared here
  106. return (__m64)__builtin_ia32_paddb((__v8qi)__m1, (__v8qi)__m2);
  107. ^
  108. /Applications/Xcode-beta.app/Contents/Developer/Toolchains/XcodeDefault.xctoolchain/usr/lib/clang/12.0.0/include/mmintrin.h:373:19: error:
  109. first argument of MTE builtin function must be a pointer ('__v4hi' (vector of 4 'short' values) invalid)
  110. return (__m64)__builtin_ia32_paddw((__v4hi)__m1, (__v4hi)__m2);
  111. ^ ~~~~~~~~~~~~
  112. /Applications/Xcode-beta.app/Contents/Developer/Toolchains/XcodeDefault.xctoolchain/usr/lib/clang/12.0.0/include/mmintrin.h:394:19: error:
  113. use of undeclared identifier '__builtin_ia32_paddd'; did you mean '__builtin_arm_addg'?
  114. return (__m64)__builtin_ia32_paddd((__v2si)__m1, (__v2si)__m2);
  115. ^
  116. /Applications/Xcode-beta.app/Contents/Developer/Toolchains/XcodeDefault.xctoolchain/usr/lib/clang/12.0.0/include/mmintrin.h:352:19: note:
  117. '__builtin_arm_addg' declared here
  118. return (__m64)__builtin_ia32_paddb((__v8qi)__m1, (__v8qi)__m2);
  119. ^
  120. /Applications/Xcode-beta.app/Contents/Developer/Toolchains/XcodeDefault.xctoolchain/usr/lib/clang/12.0.0/include/mmintrin.h:394:19: error:
  121. first argument of MTE builtin function must be a pointer ('__v2si' (vector of 2 'int' values) invalid)
  122. return (__m64)__builtin_ia32_paddd((__v2si)__m1, (__v2si)__m2);
  123. ^ ~~~~~~~~~~~~
  124. fatal error: too many errors emitted, stopping now [-ferror-limit=]
  125. 20 errors generated.
  126. make[2]: *** [../../../../osx_clang/obj/x64/Release/osd_sdl/src/osd/modules/input/input_common.o] Error 1
  127. make[1]: *** [osd_sdl] Error 2
  128. make: *** [macosx_arm64_clang] Error 2
  129. dtk@DTK mame %
  130.  
RAW Paste Data