daily pastebin goal
66%
SHARE
TWEET

error

oskar333 Dec 22nd, 2017 (edited) 362 Never
Not a member of Pastebin yet? Sign Up, it unlocks many cool features!
  1. oskar@ThinkPad-X230 /media/storage/oskar/Dropbox/sandbox/webpack/ac $ yarn run build
  2. yarn run v1.3.2
  3. $ rimraf dist && cross-env NODE_ENV=development webpack
  4. ts-loader: Using typescript@1.8.10 and /media/storage/oskar/Dropbox/sandbox/webpack/ac/tsconfig.json    
  5. Hash: 923ee3cc586f66c34292                                                                              
  6. Version: webpack 1.15.0                                                                                
  7. Time: 8830ms                                                                                            
  8.                                                                                                                 Asset       Size  Chunks             Chunk Names                                                
  9.    node_modules/open-sans-fontface/fonts/SemiboldItalic//OpenSans-SemiboldItalic.ttf?1c0b4eb93fcf561eec03297a24922d6c     131 kB          [emitted]                                                            
  10.                             node_modules/font-awesome/fonts//fontawesome-webfont.eot?674f50d287a8c48dc19ba404d20fe713     166 kB          [emitted]                                                            
  11.                            node_modules/font-awesome/fonts//fontawesome-webfont.woff?fee66e712a8a08eef5805a46892932ad      98 kB          [emitted]                                                            
  12.                             node_modules/font-awesome/fonts//fontawesome-webfont.ttf?b06871f281fee6b241d60582ae9369b9     166 kB          [emitted]                                                            
  13.                             node_modules/font-awesome/fonts//fontawesome-webfont.svg?912ec66d7572ff821749319396470bde     444 kB          [emitted]                                                            
  14.                      node_modules/open-sans-fontface/fonts/Light//OpenSans-Light.eot?804037562eabaa5dbefa4a435206d017     108 kB          [emitted]                                                            
  15.                     node_modules/open-sans-fontface/fonts/Light//OpenSans-Light.woff?963eb32907744d9a0d6b98127162808f    62.8 kB          [emitted]                                                            
  16.                      node_modules/open-sans-fontface/fonts/Light//OpenSans-Light.ttf?ecb4572a5e478b107dfcb60c16a7eefa     107 kB          [emitted]                                                            
  17.                      node_modules/open-sans-fontface/fonts/Light//OpenSans-Light.svg?d79f021974b1f6bc5c21f31689cde94f     264 kB          [emitted]                                                            
  18.          node_modules/open-sans-fontface/fonts/LightItalic//OpenSans-LightItalic.eot?6725fc490942895a65f559882a17d524     133 kB          [emitted]                                                            
  19.         node_modules/open-sans-fontface/fonts/LightItalic//OpenSans-LightItalic.woff?97534dd409492b05b11ab96b3dd4a557    76.4 kB          [emitted]                                                            
  20.          node_modules/open-sans-fontface/fonts/LightItalic//OpenSans-LightItalic.ttf?26f1e68dfbd8b8621e5d07f75571a1f9     133 kB          [emitted]                                                            
  21.          node_modules/open-sans-fontface/fonts/LightItalic//OpenSans-LightItalic.svg?b64e9910811cdcc8df89cec2b5025a9f     298 kB          [emitted]                                                            
  22.                  node_modules/open-sans-fontface/fonts/Regular//OpenSans-Regular.eot?a35546eef3ea0de0d4735f23b0a0873b     106 kB          [emitted]                                                            
  23.                 node_modules/open-sans-fontface/fonts/Regular//OpenSans-Regular.woff?ac327c4db6284ef64ebe872b6308f5da    63.7 kB          [emitted]  
  24.                  node_modules/open-sans-fontface/fonts/Regular//OpenSans-Regular.ttf?cd7296352d159532b66c07d98efb1126     106 kB          [emitted]  
  25.                  node_modules/open-sans-fontface/fonts/Regular//OpenSans-Regular.svg?f641a7d4e80fd6321135b1a2b4ce8bb1     272 kB          [emitted]  
  26.                    node_modules/open-sans-fontface/fonts/Italic//OpenSans-Italic.eot?e487b7cb072550896dde6821d24de2be     131 kB          [emitted]  
  27.                   node_modules/open-sans-fontface/fonts/Italic//OpenSans-Italic.woff?525074686dfb8aa36b1b92e29de467ac    76.1 kB          [emitted]  
  28.                    node_modules/open-sans-fontface/fonts/Italic//OpenSans-Italic.ttf?9b30f13428e1b4a659aeeab4ac1fff35     131 kB          [emitted]  
  29.                    node_modules/open-sans-fontface/fonts/Italic//OpenSans-Italic.svg?d6671d41dde41d355619fe05b44f4aac     298 kB          [emitted]  
  30.                node_modules/open-sans-fontface/fonts/Semibold//OpenSans-Semibold.eot?0ea04502930623aa3de110aac9f9e4fd     108 kB          [emitted]  
  31.               node_modules/open-sans-fontface/fonts/Semibold//OpenSans-Semibold.woff?9f2144213fad53d4e0fdb26ecf93865f    69.9 kB          [emitted]  
  32.                node_modules/open-sans-fontface/fonts/Semibold//OpenSans-Semibold.ttf?33f225b8f5f7d6b34a0926f58f96c1e9     221 kB          [emitted]  
  33.                node_modules/open-sans-fontface/fonts/Semibold//OpenSans-Semibold.svg?bb100c995f1d20b8a96462fe5f528bd4    1.17 MB          [emitted]  
  34.    node_modules/open-sans-fontface/fonts/SemiboldItalic//OpenSans-SemiboldItalic.eot?da061416028fc9a66fbc0b80d33d6e6f     131 kB          [emitted]  
  35.   node_modules/open-sans-fontface/fonts/SemiboldItalic//OpenSans-SemiboldItalic.woff?ec55f263e2b86bc0f28fff46b873d6df    75.6 kB          [emitted]  
  36.                           node_modules/font-awesome/fonts//fontawesome-webfont.woff2?af7ae505a9eed503f8b8e6982036873e    77.2 kB          [emitted]  
  37.    node_modules/open-sans-fontface/fonts/SemiboldItalic//OpenSans-SemiboldItalic.svg?ddc348f204283c4f4090a3ed03853054     296 kB          [emitted]  
  38.                        node_modules/open-sans-fontface/fonts/Bold//OpenSans-Bold.eot?7ae9b8ba7886341831bf7c85a0da40d0     110 kB          [emitted]  
  39.                       node_modules/open-sans-fontface/fonts/Bold//OpenSans-Bold.woff?892667349c5cff6fcf7e40439596b97c    63.6 kB          [emitted]  
  40.                        node_modules/open-sans-fontface/fonts/Bold//OpenSans-Bold.ttf?5a100916f94b0babde0c92aaa8fb80d6     110 kB          [emitted]  
  41.                        node_modules/open-sans-fontface/fonts/Bold//OpenSans-Bold.svg?d6291f88056601e360ce6cea4bf676f4     270 kB          [emitted]  
  42.            node_modules/open-sans-fontface/fonts/BoldItalic//OpenSans-BoldItalic.eot?ea07932c5245dd421e3d05f579098bc2     128 kB          [emitted]  
  43.           node_modules/open-sans-fontface/fonts/BoldItalic//OpenSans-BoldItalic.woff?7be88e73fea7b64568a450d7c01346b0    73.6 kB          [emitted]  
  44.            node_modules/open-sans-fontface/fonts/BoldItalic//OpenSans-BoldItalic.ttf?c36b5ac7c2dddf6f525c8d161412ef41     128 kB          [emitted]  
  45.            node_modules/open-sans-fontface/fonts/BoldItalic//OpenSans-BoldItalic.svg?a54aba83b3d5d7702890c07c31c48147     291 kB          [emitted]  
  46.              node_modules/open-sans-fontface/fonts/ExtraBold//OpenSans-ExtraBold.eot?561e4b63e9119235465ec88c8c91f2c8     107 kB          [emitted]  
  47.             node_modules/open-sans-fontface/fonts/ExtraBold//OpenSans-ExtraBold.woff?12e2ed7a180e601bff44253d4c7062ad    69.9 kB          [emitted]  
  48.              node_modules/open-sans-fontface/fonts/ExtraBold//OpenSans-ExtraBold.ttf?19b56cfcb97fbcc245242fb28232939e     120 kB          [emitted]  
  49.              node_modules/open-sans-fontface/fonts/ExtraBold//OpenSans-ExtraBold.svg?8c5c497a47304f276f99ad05e0c5a395    1.17 MB          [emitted]  
  50.  node_modules/open-sans-fontface/fonts/ExtraBoldItalic//OpenSans-ExtraBoldItalic.eot?5f467e780ed0aead6614d85dcca181e1     124 kB          [emitted]  
  51. node_modules/open-sans-fontface/fonts/ExtraBoldItalic//OpenSans-ExtraBoldItalic.woff?4f44077586ec12a35ce6778e879d43da    71.7 kB          [emitted]  
  52.  node_modules/open-sans-fontface/fonts/ExtraBoldItalic//OpenSans-ExtraBoldItalic.ttf?4595d7f8ce0e7b381abb0254f04f0ec2     124 kB          [emitted]  
  53.  node_modules/open-sans-fontface/fonts/ExtraBoldItalic//OpenSans-ExtraBoldItalic.svg?9704305e6fd8184b40d526fca315d200     290 kB          [emitted]  
  54.                                                                                           app.js?923ee3cc586f66c34292    1.35 kB       0  [emitted]  app
  55.                                                                                        vendor.js?923ee3cc586f66c34292     736 kB       1  [emitted]  vendor
  56.                                                                                     bootstrap.js?923ee3cc586f66c34292    6.67 kB       2  [emitted]  bootstrap
  57.                                                                                       vendor.css?923ee3cc586f66c34292    45.6 kB       1  [emitted]  vendor
  58.                                                                                       app.js.map?923ee3cc586f66c34292    1.58 kB       0  [emitted]  app
  59.                                                                                    vendor.js.map?923ee3cc586f66c34292     883 kB       1  [emitted]  vendor
  60.                                                                                   vendor.css.map?923ee3cc586f66c34292     121 kB       1  [emitted]  vendor
  61.                                                                                 bootstrap.js.map?923ee3cc586f66c34292    5.44 kB       2  [emitted]  bootstrap
  62.                                                                                                            index.html  446 bytes          [emitted]  
  63.     + 252 hidden modules
  64.  
  65. ERROR in ./src/index.tsx
  66. (3,19): error TS2307: Cannot find module 'react'.
  67.  
  68. ERROR in ./src/index.tsx
  69. (4,22): error TS2307: Cannot find module 'react-dom'.
  70.  
  71. ERROR in ./src/index.tsx
  72. (8,17): error TS2602: JSX element implicitly has type 'any' because the global type 'JSX.Element' does not exist.
  73.  
  74. ERROR in /media/storage/oskar/Dropbox/sandbox/webpack/ac/src/index-hot.tsx
  75. (3,19): error TS2307: Cannot find module 'react'.
  76.  
  77. ERROR in /media/storage/oskar/Dropbox/sandbox/webpack/ac/src/index-hot.tsx
  78. (4,22): error TS2307: Cannot find module 'react-dom'.
  79.  
  80. ERROR in /media/storage/oskar/Dropbox/sandbox/webpack/ac/src/index-hot.tsx
  81. (14,17): error TS2602: JSX element implicitly has type 'any' because the global type 'JSX.Element' does not exist.
  82.  
  83. ERROR in /media/storage/oskar/Dropbox/sandbox/webpack/ac/src/index-hot.tsx
  84. (14,31): error TS2602: JSX element implicitly has type 'any' because the global type 'JSX.Element' does not exist.
  85.  
  86. ERROR in /media/storage/oskar/Dropbox/sandbox/webpack/ac/src/index-hot.tsx
  87. (20,19): error TS2602: JSX element implicitly has type 'any' because the global type 'JSX.Element' does not exist.
  88.  
  89. ERROR in /media/storage/oskar/Dropbox/sandbox/webpack/ac/src/index-hot.tsx
  90. (20,33): error TS2602: JSX element implicitly has type 'any' because the global type 'JSX.Element' does not exist.
  91.  
  92. ERROR in /media/storage/oskar/Dropbox/sandbox/webpack/ac/src/Hello.tsx
  93. (1,19): error TS2307: Cannot find module 'react'.
  94.  
  95. ERROR in /media/storage/oskar/Dropbox/sandbox/webpack/ac/src/Hello.tsx
  96. (11,7): error TS2602: JSX element implicitly has type 'any' because the global type 'JSX.Element' does not exist.
  97.  
  98. ERROR in /media/storage/oskar/Dropbox/sandbox/webpack/ac/src/Hello.tsx
  99. (11,7): error TS7026: JSX element implicitly has type 'any' because no interface 'JSX.IntrinsicElements' exists
  100.  
  101. ERROR in /media/storage/oskar/Dropbox/sandbox/webpack/ac/src/Hello.tsx
  102. (12,9): error TS2602: JSX element implicitly has type 'any' because the global type 'JSX.Element' does not exist.
  103.  
  104. ERROR in /media/storage/oskar/Dropbox/sandbox/webpack/ac/src/Hello.tsx
  105. (12,9): error TS7026: JSX element implicitly has type 'any' because no interface 'JSX.IntrinsicElements' exists
  106.  
  107. ERROR in /media/storage/oskar/Dropbox/sandbox/webpack/ac/src/Hello.tsx
  108. (12,30): error TS2339: Property 'props' does not exist on type 'Hello'.
  109.  
  110. ERROR in /media/storage/oskar/Dropbox/sandbox/webpack/ac/src/Hello.tsx
  111. (12,56): error TS2339: Property 'props' does not exist on type 'Hello'.
  112.  
  113. ERROR in /media/storage/oskar/Dropbox/sandbox/webpack/ac/src/Hello.tsx
  114. (12,72): error TS7026: JSX element implicitly has type 'any' because no interface 'JSX.IntrinsicElements' exists
  115.  
  116. ERROR in /media/storage/oskar/Dropbox/sandbox/webpack/ac/src/Hello.tsx
  117. (13,9): error TS2602: JSX element implicitly has type 'any' because the global type 'JSX.Element' does not exist.
  118.  
  119. ERROR in /media/storage/oskar/Dropbox/sandbox/webpack/ac/src/Hello.tsx
  120. (13,9): error TS7026: JSX element implicitly has type 'any' because no interface 'JSX.IntrinsicElements' exists
  121.  
  122. ERROR in /media/storage/oskar/Dropbox/sandbox/webpack/ac/src/Hello.tsx
  123. (14,11): error TS2602: JSX element implicitly has type 'any' because the global type 'JSX.Element' does not exist.
  124.  
  125. ERROR in /media/storage/oskar/Dropbox/sandbox/webpack/ac/src/Hello.tsx
  126. (14,11): error TS7026: JSX element implicitly has type 'any' because no interface 'JSX.IntrinsicElements' exists
  127.  
  128. ERROR in /media/storage/oskar/Dropbox/sandbox/webpack/ac/src/Hello.tsx
  129. (16,11): error TS7026: JSX element implicitly has type 'any' because no interface 'JSX.IntrinsicElements' exists
  130.  
  131. ERROR in /media/storage/oskar/Dropbox/sandbox/webpack/ac/src/Hello.tsx
  132. (17,9): error TS7026: JSX element implicitly has type 'any' because no interface 'JSX.IntrinsicElements' exists
  133.  
  134. ERROR in /media/storage/oskar/Dropbox/sandbox/webpack/ac/src/Hello.tsx
  135. (18,9): error TS2602: JSX element implicitly has type 'any' because the global type 'JSX.Element' does not exist.
  136.  
  137. ERROR in /media/storage/oskar/Dropbox/sandbox/webpack/ac/src/Hello.tsx
  138. (18,9): error TS7026: JSX element implicitly has type 'any' because no interface 'JSX.IntrinsicElements' exists
  139.  
  140. ERROR in /media/storage/oskar/Dropbox/sandbox/webpack/ac/src/Hello.tsx
  141. (19,11): error TS2602: JSX element implicitly has type 'any' because the global type 'JSX.Element' does not exist.
  142.  
  143. ERROR in /media/storage/oskar/Dropbox/sandbox/webpack/ac/src/Hello.tsx
  144. (19,11): error TS7026: JSX element implicitly has type 'any' because no interface 'JSX.IntrinsicElements' exists
  145.  
  146. ERROR in /media/storage/oskar/Dropbox/sandbox/webpack/ac/src/Hello.tsx
  147. (21,11): error TS7026: JSX element implicitly has type 'any' because no interface 'JSX.IntrinsicElements' exists
  148.  
  149. ERROR in /media/storage/oskar/Dropbox/sandbox/webpack/ac/src/Hello.tsx
  150. (22,9): error TS7026: JSX element implicitly has type 'any' because no interface 'JSX.IntrinsicElements' exists
  151.  
  152. ERROR in /media/storage/oskar/Dropbox/sandbox/webpack/ac/src/Hello.tsx
  153. (23,9): error TS2602: JSX element implicitly has type 'any' because the global type 'JSX.Element' does not exist.
  154.  
  155. ERROR in /media/storage/oskar/Dropbox/sandbox/webpack/ac/src/Hello.tsx
  156. (23,9): error TS7026: JSX element implicitly has type 'any' because no interface 'JSX.IntrinsicElements' exists
  157.  
  158. ERROR in /media/storage/oskar/Dropbox/sandbox/webpack/ac/src/Hello.tsx
  159. (24,11): error TS2602: JSX element implicitly has type 'any' because the global type 'JSX.Element' does not exist.
  160.  
  161. ERROR in /media/storage/oskar/Dropbox/sandbox/webpack/ac/src/Hello.tsx
  162. (24,11): error TS7026: JSX element implicitly has type 'any' because no interface 'JSX.IntrinsicElements' exists
  163.  
  164. ERROR in /media/storage/oskar/Dropbox/sandbox/webpack/ac/src/Hello.tsx
  165. (26,11): error TS7026: JSX element implicitly has type 'any' because no interface 'JSX.IntrinsicElements' exists
  166.  
  167. ERROR in /media/storage/oskar/Dropbox/sandbox/webpack/ac/src/Hello.tsx
  168. (27,9): error TS7026: JSX element implicitly has type 'any' because no interface 'JSX.IntrinsicElements' exists
  169.  
  170. ERROR in /media/storage/oskar/Dropbox/sandbox/webpack/ac/src/Hello.tsx
  171. (28,7): error TS7026: JSX element implicitly has type 'any' because no interface 'JSX.IntrinsicElements' exists
  172.  
  173. ERROR in /media/storage/oskar/Dropbox/sandbox/webpack/ac/src/Counter.tsx
  174. (1,19): error TS2307: Cannot find module 'react'.
  175.  
  176. ERROR in /media/storage/oskar/Dropbox/sandbox/webpack/ac/src/Counter.tsx
  177. (14,10): error TS2339: Property 'state' does not exist on type 'Counter'.
  178.  
  179. ERROR in /media/storage/oskar/Dropbox/sandbox/webpack/ac/src/Counter.tsx
  180. (18,10): error TS2339: Property 'setState' does not exist on type 'Counter'.
  181.  
  182. ERROR in /media/storage/oskar/Dropbox/sandbox/webpack/ac/src/Counter.tsx
  183. (19,21): error TS2339: Property 'state' does not exist on type 'Counter'.
  184.  
  185. ERROR in /media/storage/oskar/Dropbox/sandbox/webpack/ac/src/Counter.tsx
  186. (37,7): error TS2602: JSX element implicitly has type 'any' because the global type 'JSX.Element' does not exist.
  187.  
  188. ERROR in /media/storage/oskar/Dropbox/sandbox/webpack/ac/src/Counter.tsx
  189. (37,7): error TS7026: JSX element implicitly has type 'any' because no interface 'JSX.IntrinsicElements' exists
  190.  
  191. ERROR in /media/storage/oskar/Dropbox/sandbox/webpack/ac/src/Counter.tsx
  192. (37,26): error TS2339: Property 'state' does not exist on type 'Counter'.
  193.  
  194. ERROR in /media/storage/oskar/Dropbox/sandbox/webpack/ac/src/Counter.tsx
  195. (37,66): error TS7026: JSX element implicitly has type 'any' because no interface 'JSX.IntrinsicElements' exists
  196.  
  197. ERROR in ./src/App.tsx
  198. (1,19): error TS2307: Cannot find module 'react'.
  199.  
  200. ERROR in ./src/App.tsx
  201. (9,7): error TS2602: JSX element implicitly has type 'any' because the global type 'JSX.Element' does not exist.
  202.  
  203. ERROR in ./src/App.tsx
  204. (9,7): error TS7026: JSX element implicitly has type 'any' because no interface 'JSX.IntrinsicElements' exists
  205.  
  206. ERROR in ./src/App.tsx
  207. (10,9): error TS2602: JSX element implicitly has type 'any' because the global type 'JSX.Element' does not exist.
  208.  
  209. ERROR in ./src/App.tsx
  210. (11,9): error TS2602: JSX element implicitly has type 'any' because the global type 'JSX.Element' does not exist.
  211.  
  212. ERROR in ./src/App.tsx
  213. (12,7): error TS7026: JSX element implicitly has type 'any' because no interface 'JSX.IntrinsicElements' exists
  214.  
  215. ERROR in ./src/App.tsx
  216. [9, 18]: A space is required after '{'
  217. [9, 18]: A space is required before '}'
  218.  
  219.  
  220. ERROR in ./src/App.tsx
  221. Module build failed: Error: Compilation failed due to tslint errors.
  222.     at report (/media/storage/oskar/Dropbox/sandbox/webpack/ac/node_modules/tslint-loader/index.js:60:11)
  223.     at Object.lint (/media/storage/oskar/Dropbox/sandbox/webpack/ac/node_modules/tslint-loader/index.js:44:3)
  224.     at Object.module.exports (/media/storage/oskar/Dropbox/sandbox/webpack/ac/node_modules/tslint-loader/index.js:103:8)
  225.  @ ./src/index.tsx 5:12-28
  226.  
  227. ERROR in ./src/bootstrap/bootstrap.ts
  228. Module not found: Error: Cannot resolve module 'bootstrap/js/transition' in /media/storage/oskar/Dropbox/sandbox/webpack/ac/src/bootstrap
  229.  @ ./src/bootstrap/bootstrap.ts 4:0-34
  230.  
  231. ERROR in ./src/bootstrap/bootstrap.ts
  232. Module not found: Error: Cannot resolve module 'bootstrap/js/alert' in /media/storage/oskar/Dropbox/sandbox/webpack/ac/src/bootstrap
  233.  @ ./src/bootstrap/bootstrap.ts 5:0-29
  234.  
  235. ERROR in ./src/bootstrap/bootstrap.ts
  236. Module not found: Error: Cannot resolve module 'bootstrap/js/button' in /media/storage/oskar/Dropbox/sandbox/webpack/ac/src/bootstrap
  237.  @ ./src/bootstrap/bootstrap.ts 6:0-30
  238.  
  239. ERROR in ./src/bootstrap/bootstrap.ts
  240. Module not found: Error: Cannot resolve module 'bootstrap/js/carousel' in /media/storage/oskar/Dropbox/sandbox/webpack/ac/src/bootstrap
  241.  @ ./src/bootstrap/bootstrap.ts 7:0-32
  242.  
  243. ERROR in ./src/bootstrap/bootstrap.ts
  244. Module not found: Error: Cannot resolve module 'bootstrap/js/collapse' in /media/storage/oskar/Dropbox/sandbox/webpack/ac/src/bootstrap
  245.  @ ./src/bootstrap/bootstrap.ts 8:0-32
  246.  
  247. ERROR in ./src/bootstrap/bootstrap.ts
  248. Module not found: Error: Cannot resolve module 'bootstrap/js/dropdown' in /media/storage/oskar/Dropbox/sandbox/webpack/ac/src/bootstrap
  249.  @ ./src/bootstrap/bootstrap.ts 9:0-32
  250.  
  251. ERROR in ./src/bootstrap/bootstrap.ts
  252. Module not found: Error: Cannot resolve module 'bootstrap/js/modal' in /media/storage/oskar/Dropbox/sandbox/webpack/ac/src/bootstrap
  253.  @ ./src/bootstrap/bootstrap.ts 10:0-29
  254.  
  255. ERROR in ./src/bootstrap/bootstrap.ts
  256. Module not found: Error: Cannot resolve module 'bootstrap/js/tooltip' in /media/storage/oskar/Dropbox/sandbox/webpack/ac/src/bootstrap
  257.  @ ./src/bootstrap/bootstrap.ts 11:0-31
  258.  
  259. ERROR in ./src/bootstrap/bootstrap.ts
  260. Module not found: Error: Cannot resolve module 'bootstrap/js/popover' in /media/storage/oskar/Dropbox/sandbox/webpack/ac/src/bootstrap
  261.  @ ./src/bootstrap/bootstrap.ts 12:0-31
  262.  
  263. ERROR in ./src/bootstrap/bootstrap.ts
  264. Module not found: Error: Cannot resolve module 'bootstrap/js/scrollspy' in /media/storage/oskar/Dropbox/sandbox/webpack/ac/src/bootstrap
  265.  @ ./src/bootstrap/bootstrap.ts 13:0-33
  266.  
  267. ERROR in ./src/bootstrap/bootstrap.ts
  268. Module not found: Error: Cannot resolve module 'bootstrap/js/tab' in /media/storage/oskar/Dropbox/sandbox/webpack/ac/src/bootstrap
  269.  @ ./src/bootstrap/bootstrap.ts 14:0-27
  270.  
  271. ERROR in ./src/bootstrap/bootstrap.ts
  272. Module not found: Error: Cannot resolve module 'bootstrap/js/affix' in /media/storage/oskar/Dropbox/sandbox/webpack/ac/src/bootstrap
  273.  @ ./src/bootstrap/bootstrap.ts 15:0-29
  274.  
  275. ERROR in ./src/bootstrap/bootstrap.less
  276. Module build failed: Cannot resolve module 'bootstrap/less/variables.less' in /media/storage/oskar/Dropbox/sandbox/webpack/ac/src/bootstrap
  277.  @ /media/storage/oskar/Dropbox/sandbox/webpack/ac/src/bootstrap/bootstrap.less (line 8, column 0)
  278.  near lines:
  279.    // Core variables and mixins
  280.    @import "~bootstrap/less/variables.less";
  281.    @import "~bootstrap/less/mixins.less";
  282.  @ ./src/boot.tsx 5:0-37
  283. Child html-webpack-plugin for "index.html":
  284.         + 3 hidden modules
  285. Child extract-text-webpack-plugin:
  286.         + 21 hidden modules
  287. Child extract-text-webpack-plugin:
  288.         + 42 hidden modules
  289. Done in 9.73s.
RAW Paste Data
We use cookies for various purposes including analytics. By continuing to use Pastebin, you agree to our use of cookies as described in the Cookies Policy. OK, I Understand
 
Top