dominus

Untitled

Sep 27th, 2020 (edited)
141
Never
Not a member of Pastebin yet? Sign Up, it unlocks many cool features!
  1. dtk@DTK mame % make -j5 SDL_INSTALL_ROOT=/opt/arm macosx_arm64_clang NOWERROR=1
  2. Clang 12.0.0 detected
  3. Compiling src/osd/modules/input/input_common.cpp...
  4. Compiling src/osd/modules/input/input_sdl.cpp...
  5. Compiling src/osd/modules/input/input_sdlcommon.cpp...
  6. Compiling src/osd/modules/input/input_win32.cpp...
  7. ../../../../../src/osd/modules/input/input_sdlcommon.cpp:17:10: error: 'SDL2/SDL.h' file not found with <angled>
  8. include; use "quotes" instead
  9. #include <SDL2/SDL.h>
  10. ^~~~~~~~~~~~
  11. "SDL2/SDL.h"
  12. ../../../../../src/osd/modules/input/input_sdl.cpp:20:10: error: 'SDL2/SDL.h' file not found with <angled>
  13. include; use "quotes" instead
  14. #include <SDL2/SDL.h>
  15. ^~~~~~~~~~~~
  16. "SDL2/SDL.h"
  17. Compiling src/osd/modules/input/input_windows.cpp...
  18. In file included from ../../../../../src/osd/modules/input/input_sdlcommon.cpp:17:
  19. In file included from ../../../../../src/osd/modules/input/SDL2/SDL.h:38:
  20. In file included from ../../../../../src/osd/modules/input/SDL2/SDL_cpuinfo.h:86:
  21. In file included from /Applications/Xcode-beta.app/Contents/Developer/Toolchains/XcodeDefault.xctoolchain/usr/lib/clang/12.0.0/include/immintrin.h:14:
  22. /Applications/Xcode-beta.app/Contents/Developer/Toolchains/XcodeDefault.xctoolchain/usr/lib/clang/12.0.0/include/mmintrin.h:33:5: error:
  23. use of undeclared identifier '__builtin_ia32_emms'; did you mean '__builtin_isless'?
  24. __builtin_ia32_emms();
  25. ^
  26. In file included from ../../../../../src/osd/modules/input/input_sdlcommon.cpp:11:
  27. In file included from ../../../../../src/osd/modules/input/input_module.h:12:
  28. In file included from ../../../../../src/osd/osdepend.h:16:
  29. In file included from ../../../../../src/emu/emucore.h:17:
  30. In file included from /Applications/Xcode-beta.app/Contents/Developer/Toolchains/XcodeDefault.xctoolchain/usr/bin/../include/c++/v1/cassert:20:
  31. In file included from /Applications/xcode-beta.app/contents/developer/Platforms/MacOSX.platform/Developer/SDKs/MacOSX.sdk/usr/include/assert.h:44:
  32. In file included from /Applications/Xcode-beta.app/Contents/Developer/Toolchains/XcodeDefault.xctoolchain/usr/bin/../include/c++/v1/stdlib.h:100:
  33. /Applications/Xcode-beta.app/Contents/Developer/Toolchains/XcodeDefault.xctoolchain/usr/bin/../include/c++/v1/math.h:647:12: note:
  34. '__builtin_isless' declared here
  35. return isless(__lcpp_x, __lcpp_y);
  36. ^
  37. In file included from ../../../../../src/osd/modules/input/input_sdlcommon.cpp:11:
  38. In file included from ../../../../../src/osd/modules/input/input_module.h:12:
  39. In file included from ../../../../../src/osd/osdepend.h:16:
  40. In file included from ../../../../../src/emu/emucore.h:17:
  41. In file included from /Applications/Xcode-beta.app/Contents/Developer/Toolchains/XcodeDefault.xctoolchain/usr/bin/../include/c++/v1/cassert:20:
  42. In file included from /Applications/xcode-beta.app/contents/developer/Platforms/MacOSX.platform/Developer/SDKs/MacOSX.sdk/usr/include/assert.h:44:
  43. In file included from /Applications/Xcode-beta.app/Contents/Developer/Toolchains/XcodeDefault.xctoolchain/usr/bin/../include/c++/v1/stdlib.h:100:
  44. In file included from /Applications/Xcode-beta.app/Contents/Developer/Toolchains/XcodeDefault.xctoolchain/usr/bin/../include/c++/v1/math.h:303:
  45. /Applications/xcode-beta.app/contents/developer/Platforms/MacOSX.platform/Developer/SDKs/MacOSX.sdk/usr/include/math.h:545:22: note:
  46. expanded from macro 'isless'
  47. #define isless(x, y) __builtin_isless((x),(y))
  48. ^
  49. In file included from ../../../../../src/osd/modules/input/input_sdlcommon.cpp:17:
  50. In file included from ../../../../../src/osd/modules/input/SDL2/SDL.h:38:
  51. In file included from ../../../../../src/osd/modules/input/SDL2/SDL_cpuinfo.h:86:
  52. In file included from /Applications/Xcode-beta.app/Contents/Developer/Toolchains/XcodeDefault.xctoolchain/usr/lib/clang/12.0.0/include/immintrin.h:14:
  53. /Applications/Xcode-beta.app/Contents/Developer/Toolchains/XcodeDefault.xctoolchain/usr/lib/clang/12.0.0/include/mmintrin.h:33:25: error:
  54. too few arguments to function call, expected 2, have 0
  55. __builtin_ia32_emms();
  56. ^
  57. /Applications/Xcode-beta.app/Contents/Developer/Toolchains/XcodeDefault.xctoolchain/usr/lib/clang/12.0.0/include/mmintrin.h:50:19: error:
  58. use of undeclared identifier '__builtin_ia32_vec_init_v2si'
  59. return (__m64)__builtin_ia32_vec_init_v2si(__i, 0);
  60. ^
  61. In file included from ../../../../../src/osd/modules/input/input_sdl.cpp:20:
  62. In file included from ../../../../../src/osd/modules/input/SDL2/SDL.h:38:
  63. In file included from ../../../../../src/osd/modules/input/SDL2/SDL_cpuinfo.h:86:
  64. In file included from /Applications/Xcode-beta.app/Contents/Developer/Toolchains/XcodeDefault.xctoolchain/usr/lib/clang/12.0.0/include/immintrin.h:14:
  65. /Applications/Xcode-beta.app/Contents/Developer/Toolchains/XcodeDefault.xctoolchain/usr/lib/clang/12.0.0/include/mmintrin.h:33:5: error:
  66. use of undeclared identifier '__builtin_ia32_emms'; did you mean '__builtin_isless'?
  67. __builtin_ia32_emms();
  68. ^
  69. In file included from ../../../../../src/osd/modules/input/input_sdl.cpp:14:
  70. In file included from ../../../../../src/osd/modules/input/input_module.h:12:
  71. In file included from ../../../../../src/osd/osdepend.h:16:
  72. In file included from ../../../../../src/emu/emucore.h:17:
  73. In file included from /Applications/Xcode-beta.app/Contents/Developer/Toolchains/XcodeDefault.xctoolchain/usr/bin/../include/c++/v1/cassert:20:
  74. In file included from /Applications/xcode-beta.app/contents/developer/Platforms/MacOSX.platform/Developer/SDKs/MacOSX.sdk/usr/include/assert.h:44:
  75. In file included from /Applications/Xcode-beta.app/Contents/Developer/Toolchains/XcodeDefault.xctoolchain/usr/bin/../include/c++/v1/stdlib.h:100:
  76. /Applications/Xcode-beta.app/Contents/Developer/Toolchains/XcodeDefault.xctoolchain/usr/bin/../include/c++/v1/math.h:647:12: note:
  77. '__builtin_isless' declared here
  78. return isless(__lcpp_x, __lcpp_y);
  79. ^
  80. In file included from ../../../../../src/osd/modules/input/input_sdl.cpp:14:
  81. In file included from ../../../../../src/osd/modules/input/input_module.h:12:
  82. In file included from ../../../../../src/osd/osdepend.h:16:
  83. In file included from ../../../../../src/emu/emucore.h:17:
  84. In file included from /Applications/Xcode-beta.app/Contents/Developer/Toolchains/XcodeDefault.xctoolchain/usr/bin/../include/c++/v1/cassert:20:
  85. In file included from /Applications/xcode-beta.app/contents/developer/Platforms/MacOSX.platform/Developer/SDKs/MacOSX.sdk/usr/include/assert.h:44:
  86. In file included from /Applications/Xcode-beta.app/Contents/Developer/Toolchains/XcodeDefault.xctoolchain/usr/bin/../include/c++/v1/stdlib.h:100:
  87. In file included from /Applications/Xcode-beta.app/Contents/Developer/Toolchains/XcodeDefault.xctoolchain/usr/bin/../include/c++/v1/math.h:303:
  88. /Applications/xcode-beta.app/contents/developer/Platforms/MacOSX.platform/Developer/SDKs/MacOSX.sdk/usr/include/math.h:545:22: note:
  89. expanded from macro 'isless'
  90. #define isless(x, y) __builtin_isless((x),(y))
  91. ^
  92. In file included from ../../../../../src/osd/modules/input/input_sdl.cpp:20:
  93. In file included from ../../../../../src/osd/modules/input/SDL2/SDL.h:38:
  94. In file included from ../../../../../src/osd/modules/input/SDL2/SDL_cpuinfo.h:86:
  95. In file included from /Applications/Xcode-beta.app/Contents/Developer/Toolchains/XcodeDefault.xctoolchain/usr/lib/clang/12.0.0/include/immintrin.h:14:
  96. /Applications/Xcode-beta.app/Contents/Developer/Toolchains/XcodeDefault.xctoolchain/usr/lib/clang/12.0.0/include/mmintrin.h:33:25: error:
  97. too few arguments to function call, expected 2, have 0
  98. __builtin_ia32_emms();
  99. ^
  100. /Applications/Xcode-beta.app/Contents/Developer/Toolchains/XcodeDefault.xctoolchain/usr/lib/clang/12.0.0/include/mmintrin.h:67:12: error:
  101. use of undeclared identifier '__builtin_ia32_vec_ext_v2si'
  102. return __builtin_ia32_vec_ext_v2si((__v2si)__m, 0);
  103. ^
  104. /Applications/Xcode-beta.app/Contents/Developer/Toolchains/XcodeDefault.xctoolchain/usr/lib/clang/12.0.0/include/mmintrin.h:50:19: error:
  105. use of undeclared identifier '__builtin_ia32_vec_init_v2si'
  106. return (__m64)__builtin_ia32_vec_init_v2si(__i, 0);
  107. ^
  108. /Applications/Xcode-beta.app/Contents/Developer/Toolchains/XcodeDefault.xctoolchain/usr/lib/clang/12.0.0/include/mmintrin.h:129:19: error:
  109. use of undeclared identifier '__builtin_ia32_packsswb'
  110. return (__m64)__builtin_ia32_packsswb((__v4hi)__m1, (__v4hi)__m2);
  111. ^
  112. /Applications/Xcode-beta.app/Contents/Developer/Toolchains/XcodeDefault.xctoolchain/usr/lib/clang/12.0.0/include/mmintrin.h:67:12: error:
  113. use of undeclared identifier '__builtin_ia32_vec_ext_v2si'
  114. return __builtin_ia32_vec_ext_v2si((__v2si)__m, 0);
  115. ^
  116. /Applications/Xcode-beta.app/Contents/Developer/Toolchains/XcodeDefault.xctoolchain/usr/lib/clang/12.0.0/include/mmintrin.h:129:19: error:
  117. use of undeclared identifier '__builtin_ia32_packsswb'
  118. return (__m64)__builtin_ia32_packsswb((__v4hi)__m1, (__v4hi)__m2);
  119. ^
  120. /Applications/Xcode-beta.app/Contents/Developer/Toolchains/XcodeDefault.xctoolchain/usr/lib/clang/12.0.0/include/mmintrin.h:159:19: error:
  121. use of undeclared identifier '__builtin_ia32_packssdw'
  122. return (__m64)__builtin_ia32_packssdw((__v2si)__m1, (__v2si)__m2);
  123. ^
  124. /Applications/Xcode-beta.app/Contents/Developer/Toolchains/XcodeDefault.xctoolchain/usr/lib/clang/12.0.0/include/mmintrin.h:189:19: error:
  125. use of undeclared identifier '__builtin_ia32_packuswb'
  126. return (__m64)__builtin_ia32_packuswb((__v4hi)__m1, (__v4hi)__m2);
  127. ^
  128. /Applications/Xcode-beta.app/Contents/Developer/Toolchains/XcodeDefault.xctoolchain/usr/lib/clang/12.0.0/include/mmintrin.h:159:19: error:
  129. use of undeclared identifier '__builtin_ia32_packssdw'
  130. return (__m64)__builtin_ia32_packssdw((__v2si)__m1, (__v2si)__m2);
  131. ^
  132. /Applications/Xcode-beta.app/Contents/Developer/Toolchains/XcodeDefault.xctoolchain/usr/lib/clang/12.0.0/include/mmintrin.h:189:19: error:
  133. use of undeclared identifier '__builtin_ia32_packuswb'
  134. return (__m64)__builtin_ia32_packuswb((__v4hi)__m1, (__v4hi)__m2);
  135. ^
  136. /Applications/Xcode-beta.app/Contents/Developer/Toolchains/XcodeDefault.xctoolchain/usr/lib/clang/12.0.0/include/mmintrin.h:216:19: error:
  137. use of undeclared identifier '__builtin_ia32_punpckhbw'
  138. return (__m64)__builtin_ia32_punpckhbw((__v8qi)__m1, (__v8qi)__m2);
  139. ^
  140. /Applications/Xcode-beta.app/Contents/Developer/Toolchains/XcodeDefault.xctoolchain/usr/lib/clang/12.0.0/include/mmintrin.h:216:19: error:
  141. use of undeclared identifier '__builtin_ia32_punpckhbw'
  142. return (__m64)__builtin_ia32_punpckhbw((__v8qi)__m1, (__v8qi)__m2);
  143. /Applications/Xcode-beta.app/Contents/Developer/Toolchains/XcodeDefault.xctoolchain/usr/lib/clang/12.0.0/include/mmintrin.h:239 ^:
  144. 19: error:
  145. use of undeclared identifier '__builtin_ia32_punpckhwd'
  146. return (__m64)__builtin_ia32_punpckhwd((__v4hi)__m1, (__v4hi)__m2);
  147. ^
  148. /Applications/Xcode-beta.app/Contents/Developer/Toolchains/XcodeDefault.xctoolchain/usr/lib/clang/12.0.0/include/mmintrin.h:239:19: error:
  149. use of undeclared identifier '__builtin_ia32_punpckhwd'
  150. return (__m64)__builtin_ia32_punpckhwd((__v4hi)__m1, (__v4hi)__m2);
  151. ^
  152. /Applications/Xcode-beta.app/Contents/Developer/Toolchains/XcodeDefault.xctoolchain/usr/lib/clang/12.0.0/include/mmintrin.h:260:19: error:
  153. use of undeclared identifier '__builtin_ia32_punpckhdq'
  154. return (__m64)__builtin_ia32_punpckhdq((__v2si)__m1, (__v2si)__m2);
  155. ^
  156. /Applications/Xcode-beta.app/Contents/Developer/Toolchains/XcodeDefault.xctoolchain/usr/lib/clang/12.0.0/include/mmintrin.h:287:19: error:
  157. use of undeclared identifier '__builtin_ia32_punpcklbw'
  158. return (__m64)__builtin_ia32_punpcklbw((__v8qi)__m1, (__v8qi)__m2);
  159. ^
  160. /Applications/Xcode-beta.app/Contents/Developer/Toolchains/XcodeDefault.xctoolchain/usr/lib/clang/12.0.0/include/mmintrin.h:260:19: error:
  161. use of undeclared identifier '__builtin_ia32_punpckhdq'
  162. return (__m64)__builtin_ia32_punpckhdq((__v2si)__m1, (__v2si)__m2);
  163. ^
  164. /Applications/Xcode-beta.app/Contents/Developer/Toolchains/XcodeDefault.xctoolchain/usr/lib/clang/12.0.0/include/mmintrin.h:287:19: error:
  165. use of undeclared identifier '__builtin_ia32_punpcklbw'
  166. return (__m64)__builtin_ia32_punpcklbw((__v8qi)__m1, (__v8qi)__m2);
  167. ^
  168. /Applications/Xcode-beta.app/Contents/Developer/Toolchains/XcodeDefault.xctoolchain/usr/lib/clang/12.0.0/include/mmintrin.h:310:19: error:
  169. use of undeclared identifier '__builtin_ia32_punpcklwd'
  170. return (__m64)__builtin_ia32_punpcklwd((__v4hi)__m1, (__v4hi)__m2);
  171. ^
  172. /Applications/Xcode-beta.app/Contents/Developer/Toolchains/XcodeDefault.xctoolchain/usr/lib/clang/12.0.0/include/mmintrin.h:310:19: error:
  173. use of undeclared identifier '__builtin_ia32_punpcklwd'
  174. return (__m64)__builtin_ia32_punpcklwd((__v4hi)__m1, (__v4hi)__m2);
  175. ^
  176. /Applications/Xcode-beta.app/Contents/Developer/Toolchains/XcodeDefault.xctoolchain/usr/lib/clang/12.0.0/include/mmintrin.h:331:19: error:
  177. use of undeclared identifier '__builtin_ia32_punpckldq'
  178. return (__m64)__builtin_ia32_punpckldq((__v2si)__m1, (__v2si)__m2);
  179. ^
  180. /Applications/Xcode-beta.app/Contents/Developer/Toolchains/XcodeDefault.xctoolchain/usr/lib/clang/12.0.0/include/mmintrin.h:352:19: error:
  181. use of undeclared identifier '__builtin_ia32_paddb'; did you mean '__builtin_arm_addg'?
  182. return (__m64)__builtin_ia32_paddb((__v8qi)__m1, (__v8qi)__m2);
  183. ^
  184. /Applications/Xcode-beta.app/Contents/Developer/Toolchains/XcodeDefault.xctoolchain/usr/lib/clang/12.0.0/include/mmintrin.h:352:19: note:
  185. '__builtin_arm_addg' declared here
  186. /Applications/Xcode-beta.app/Contents/Developer/Toolchains/XcodeDefault.xctoolchain/usr/lib/clang/12.0.0/include/mmintrin.h:352:19: error:
  187. first argument of MTE builtin function must be a pointer ('__v8qi' (vector of 8 'char' values) invalid)
  188. return (__m64)__builtin_ia32_paddb((__v8qi)__m1, (__v8qi)__m2);
  189. ^ ~~~~~~~~~~~~
  190. /Applications/Xcode-beta.app/Contents/Developer/Toolchains/XcodeDefault.xctoolchain/usr/lib/clang/12.0.0/include/mmintrin.h:331:19: error:
  191. use of undeclared identifier '__builtin_ia32_punpckldq'
  192. return (__m64)__builtin_ia32_punpckldq((__v2si)__m1, (__v2si)__m2);
  193. ^
  194. /Applications/Xcode-beta.app/Contents/Developer/Toolchains/XcodeDefault.xctoolchain/usr/lib/clang/12.0.0/include/mmintrin.h:373:19: error:
  195. use of undeclared identifier '__builtin_ia32_paddw'; did you mean '__builtin_arm_addg'?
  196. return (__m64)__builtin_ia32_paddw((__v4hi)__m1, (__v4hi)__m2);
  197. ^
  198. /Applications/Xcode-beta.app/Contents/Developer/Toolchains/XcodeDefault.xctoolchain/usr/lib/clang/12.0.0/include/mmintrin.h:352:19: note:
  199. '__builtin_arm_addg' declared here
  200. return (__m64)__builtin_ia32_paddb((__v8qi)__m1, (__v8qi)__m2);
  201. ^
  202. /Applications/Xcode-beta.app/Contents/Developer/Toolchains/XcodeDefault.xctoolchain/usr/lib/clang/12.0.0/include/mmintrin.h:373:19: error:
  203. first argument of MTE builtin function must be a pointer ('__v4hi' (vector of 4 'short' values) invalid)
  204. return (__m64)__builtin_ia32_paddw((__v4hi)__m1, (__v4hi)__m2);
  205. ^ ~~~~~~~~~~~~
  206. /Applications/Xcode-beta.app/Contents/Developer/Toolchains/XcodeDefault.xctoolchain/usr/lib/clang/12.0.0/include/mmintrin.h:352:19: error:
  207. use of undeclared identifier '__builtin_ia32_paddb'; did you mean '__builtin_arm_addg'?
  208. return (__m64)__builtin_ia32_paddb((__v8qi)__m1, (__v8qi)__m2);
  209. ^
  210. /Applications/Xcode-beta.app/Contents/Developer/Toolchains/XcodeDefault.xctoolchain/usr/lib/clang/12.0.0/include/mmintrin.h:352:19: note:
  211. '__builtin_arm_addg' declared here
  212. /Applications/Xcode-beta.app/Contents/Developer/Toolchains/XcodeDefault.xctoolchain/usr/lib/clang/12.0.0/include/mmintrin.h:352:19: error:
  213. first argument of MTE builtin function must be a pointer ('__v8qi' (vector of 8 'char' values) invalid)
  214. return (__m64)__builtin_ia32_paddb((__v8qi)__m1, (__v8qi)__m2);
  215. ^ ~~~~~~~~~~~~
  216. /Applications/Xcode-beta.app/Contents/Developer/Toolchains/XcodeDefault.xctoolchain/usr/lib/clang/12.0.0/include/mmintrin.h:394:19: error:
  217. use of undeclared identifier '__builtin_ia32_paddd'; did you mean '__builtin_arm_addg'?
  218. return (__m64)__builtin_ia32_paddd((__v2si)__m1, (__v2si)__m2);
  219. ^
  220. /Applications/Xcode-beta.app/Contents/Developer/Toolchains/XcodeDefault.xctoolchain/usr/lib/clang/12.0.0/include/mmintrin.h:352:19: note:
  221. '__builtin_arm_addg' declared here
  222. return (__m64)__builtin_ia32_paddb((__v8qi)__m1, (__v8qi)__m2);
  223. ^
  224. fatal error: too many errors emitted, stopping now [-ferror-limit=]
  225. /Applications/Xcode-beta.app/Contents/Developer/Toolchains/XcodeDefault.xctoolchain/usr/lib/clang/12.0.0/include/mmintrin.h:373:19: error:
  226. use of undeclared identifier '__builtin_ia32_paddw'; did you mean '__builtin_arm_addg'?
  227. return (__m64)__builtin_ia32_paddw((__v4hi)__m1, (__v4hi)__m2);
  228. ^
  229. /Applications/Xcode-beta.app/Contents/Developer/Toolchains/XcodeDefault.xctoolchain/usr/lib/clang/12.0.0/include/mmintrin.h:352:19: note:
  230. '__builtin_arm_addg' declared here
  231. return (__m64)__builtin_ia32_paddb((__v8qi)__m1, (__v8qi)__m2);
  232. ^
  233. /Applications/Xcode-beta.app/Contents/Developer/Toolchains/XcodeDefault.xctoolchain/usr/lib/clang/12.0.0/include/mmintrin.h:373:19: error:
  234. first argument of MTE builtin function must be a pointer ('__v4hi' (vector of 4 'short' values) invalid)
  235. return (__m64)__builtin_ia32_paddw((__v4hi)__m1, (__v4hi)__m2);
  236. ^ ~~~~~~~~~~~~
  237. /Applications/Xcode-beta.app/Contents/Developer/Toolchains/XcodeDefault.xctoolchain/usr/lib/clang/12.0.0/include/mmintrin.h:394:19: error:
  238. use of undeclared identifier '__builtin_ia32_paddd'; did you mean '__builtin_arm_addg'?
  239. return (__m64)__builtin_ia32_paddd((__v2si)__m1, (__v2si)__m2);
  240. ^
  241. /Applications/Xcode-beta.app/Contents/Developer/Toolchains/XcodeDefault.xctoolchain/usr/lib/clang/12.0.0/include/mmintrin.h:352:19: note:
  242. '__builtin_arm_addg' declared here
  243. return (__m64)__builtin_ia32_paddb((__v8qi)__m1, (__v8qi)__m2);
  244. ^
  245. fatal error: too many errors emitted, stopping now [-ferror-limit=]
  246. Compiling src/devices/sound/mas3507d.cpp...
  247. Compiling src/osd/modules/input/input_winhybrid.cpp...
  248. 20 errors generated.
  249. 20 errors generated.
  250. make[2]: *** [../../../../osx_clang/obj/x64/Release/osd_sdl/src/osd/modules/input/input_sdlcommon.o] Error 1
  251. make[2]: *** Waiting for unfinished jobs....
  252. make[2]: *** [../../../../osx_clang/obj/x64/Release/osd_sdl/src/osd/modules/input/input_sdl.o] Error 1
  253. Compiling src/devices/sound/mos6581.cpp...
  254. Compiling src/devices/sound/mos7360.cpp...
  255. In file included from ../../../../../src/devices/sound/mas3507d.cpp:14:
  256. ../../../../../3rdparty/minimp3/minimp3.h:1275:5: error: 'HAVE_SSE' is not defined, evaluates to 0
  257. [-Werror,-Wundef]
  258. #if HAVE_SSE
  259. ^
  260. ../../../../../3rdparty/minimp3/minimp3.h:1477:5: error: 'HAVE_SSE' is not defined, evaluates to 0
  261. [-Werror,-Wundef]
  262. #if HAVE_SSE
  263. ^
  264. ../../../../../src/osd/modules/input/input_common.cpp:36:10: error: 'SDL2/SDL.h' file not found with <angled>
  265. include; use "quotes" instead
  266. #include <SDL2/SDL.h>
  267. ^~~~~~~~~~~~
  268. "SDL2/SDL.h"
  269. Compiling src/devices/sound/mpeg_audio.cpp...
  270. In file included from ../../../../../src/osd/modules/input/input_common.cpp:36:
  271. In file included from ../../../../../src/osd/modules/input/SDL2/SDL.h:38:
  272. In file included from ../../../../../src/osd/modules/input/SDL2/SDL_cpuinfo.h:86:
  273. In file included from /Applications/Xcode-beta.app/Contents/Developer/Toolchains/XcodeDefault.xctoolchain/usr/lib/clang/12.0.0/include/immintrin.h:14:
  274. /Applications/Xcode-beta.app/Contents/Developer/Toolchains/XcodeDefault.xctoolchain/usr/lib/clang/12.0.0/include/mmintrin.h:33:5: error:
  275. use of undeclared identifier '__builtin_ia32_emms'; did you mean '__builtin_isless'?
  276. __builtin_ia32_emms();
  277. ^
  278. In file included from ../../../../../src/osd/modules/input/input_common.cpp:11:
  279. In file included from ../../../../../src/osd/modules/input/input_module.h:12:
  280. In file included from ../../../../../src/osd/osdepend.h:16:
  281. In file included from ../../../../../src/emu/emucore.h:17:
  282. In file included from /Applications/Xcode-beta.app/Contents/Developer/Toolchains/XcodeDefault.xctoolchain/usr/bin/../include/c++/v1/cassert:20:
  283. In file included from /Applications/xcode-beta.app/contents/developer/Platforms/MacOSX.platform/Developer/SDKs/MacOSX.sdk/usr/include/assert.h:44:
  284. In file included from /Applications/Xcode-beta.app/Contents/Developer/Toolchains/XcodeDefault.xctoolchain/usr/bin/../include/c++/v1/stdlib.h:100:
  285. /Applications/Xcode-beta.app/Contents/Developer/Toolchains/XcodeDefault.xctoolchain/usr/bin/../include/c++/v1/math.h:647:12: note:
  286. '__builtin_isless' declared here
  287. return isless(__lcpp_x, __lcpp_y);
  288. ^
  289. In file included from ../../../../../src/osd/modules/input/input_common.cpp:11:
  290. In file included from ../../../../../src/osd/modules/input/input_module.h:12:
  291. In file included from ../../../../../src/osd/osdepend.h:16:
  292. In file included from ../../../../../src/emu/emucore.h:17:
  293. In file included from /Applications/Xcode-beta.app/Contents/Developer/Toolchains/XcodeDefault.xctoolchain/usr/bin/../include/c++/v1/cassert:20:
  294. In file included from /Applications/xcode-beta.app/contents/developer/Platforms/MacOSX.platform/Developer/SDKs/MacOSX.sdk/usr/include/assert.h:44:
  295. In file included from /Applications/Xcode-beta.app/Contents/Developer/Toolchains/XcodeDefault.xctoolchain/usr/bin/../include/c++/v1/stdlib.h:100:
  296. In file included from /Applications/Xcode-beta.app/Contents/Developer/Toolchains/XcodeDefault.xctoolchain/usr/bin/../include/c++/v1/math.h:303:
  297. /Applications/xcode-beta.app/contents/developer/Platforms/MacOSX.platform/Developer/SDKs/MacOSX.sdk/usr/include/math.h:545:22: note:
  298. expanded from macro 'isless'
  299. #define isless(x, y) __builtin_isless((x),(y))
  300. ^
  301. In file included from ../../../../../src/osd/modules/input/input_common.cpp:36:
  302. In file included from ../../../../../src/osd/modules/input/SDL2/SDL.h:38:
  303. In file included from ../../../../../src/osd/modules/input/SDL2/SDL_cpuinfo.h:86:
  304. In file included from /Applications/Xcode-beta.app/Contents/Developer/Toolchains/XcodeDefault.xctoolchain/usr/lib/clang/12.0.0/include/immintrin.h:14:
  305. /Applications/Xcode-beta.app/Contents/Developer/Toolchains/XcodeDefault.xctoolchain/usr/lib/clang/12.0.0/include/mmintrin.h:33:25: error:
  306. too few arguments to function call, expected 2, have 0
  307. __builtin_ia32_emms();
  308. ^
  309. /Applications/Xcode-beta.app/Contents/Developer/Toolchains/XcodeDefault.xctoolchain/usr/lib/clang/12.0.0/include/mmintrin.h:50:19: error:
  310. use of undeclared identifier '__builtin_ia32_vec_init_v2si'
  311. return (__m64)__builtin_ia32_vec_init_v2si(__i, 0);
  312. ^
  313. /Applications/Xcode-beta.app/Contents/Developer/Toolchains/XcodeDefault.xctoolchain/usr/lib/clang/12.0.0/include/mmintrin.h:67:12: error:
  314. use of undeclared identifier '__builtin_ia32_vec_ext_v2si'
  315. return __builtin_ia32_vec_ext_v2si((__v2si)__m, 0);
  316. ^
  317. 2 errors generated.
  318. make[2]: *** [../../../../osx_clang/obj/x64/Release/src/devices/sound/mas3507d.o] Error 1
  319. make[2]: *** Waiting for unfinished jobs....
  320. /Applications/Xcode-beta.app/Contents/Developer/Toolchains/XcodeDefault.xctoolchain/usr/lib/clang/12.0.0/include/mmintrin.h:129:19: error:
  321. use of undeclared identifier '__builtin_ia32_packsswb'
  322. return (__m64)__builtin_ia32_packsswb((__v4hi)__m1, (__v4hi)__m2);
  323. ^
  324. /Applications/Xcode-beta.app/Contents/Developer/Toolchains/XcodeDefault.xctoolchain/usr/lib/clang/12.0.0/include/mmintrin.h:159:19: error:
  325. use of undeclared identifier '__builtin_ia32_packssdw'
  326. return (__m64)__builtin_ia32_packssdw((__v2si)__m1, (__v2si)__m2);
  327. ^
  328. /Applications/Xcode-beta.app/Contents/Developer/Toolchains/XcodeDefault.xctoolchain/usr/lib/clang/12.0.0/include/mmintrin.h:189:19: error:
  329. use of undeclared identifier '__builtin_ia32_packuswb'
  330. return (__m64)__builtin_ia32_packuswb((__v4hi)__m1, (__v4hi)__m2);
  331. ^
  332. /Applications/Xcode-beta.app/Contents/Developer/Toolchains/XcodeDefault.xctoolchain/usr/lib/clang/12.0.0/include/mmintrin.h:216:19: error:
  333. use of undeclared identifier '__builtin_ia32_punpckhbw'
  334. return (__m64)__builtin_ia32_punpckhbw((__v8qi)__m1, (__v8qi)__m2);
  335. ^
  336. /Applications/Xcode-beta.app/Contents/Developer/Toolchains/XcodeDefault.xctoolchain/usr/lib/clang/12.0.0/include/mmintrin.h:239:19: error:
  337. use of undeclared identifier '__builtin_ia32_punpckhwd'
  338. return (__m64)__builtin_ia32_punpckhwd((__v4hi)__m1, (__v4hi)__m2);
  339. ^
  340. /Applications/Xcode-beta.app/Contents/Developer/Toolchains/XcodeDefault.xctoolchain/usr/lib/clang/12.0.0/include/mmintrin.h:260:19: error:
  341. use of undeclared identifier '__builtin_ia32_punpckhdq'
  342. return (__m64)__builtin_ia32_punpckhdq((__v2si)__m1, (__v2si)__m2);
  343. ^
  344. /Applications/Xcode-beta.app/Contents/Developer/Toolchains/XcodeDefault.xctoolchain/usr/lib/clang/12.0.0/include/mmintrin.h:287:19: error:
  345. use of undeclared identifier '__builtin_ia32_punpcklbw'
  346. return (__m64)__builtin_ia32_punpcklbw((__v8qi)__m1, (__v8qi)__m2);
  347. ^
  348. /Applications/Xcode-beta.app/Contents/Developer/Toolchains/XcodeDefault.xctoolchain/usr/lib/clang/12.0.0/include/mmintrin.h:310:19: error:
  349. use of undeclared identifier '__builtin_ia32_punpcklwd'
  350. return (__m64)__builtin_ia32_punpcklwd((__v4hi)__m1, (__v4hi)__m2);
  351. ^
  352. /Applications/Xcode-beta.app/Contents/Developer/Toolchains/XcodeDefault.xctoolchain/usr/lib/clang/12.0.0/include/mmintrin.h:331:19: error:
  353. use of undeclared identifier '__builtin_ia32_punpckldq'
  354. return (__m64)__builtin_ia32_punpckldq((__v2si)__m1, (__v2si)__m2);
  355. ^
  356. /Applications/Xcode-beta.app/Contents/Developer/Toolchains/XcodeDefault.xctoolchain/usr/lib/clang/12.0.0/include/mmintrin.h:352:19: error:
  357. use of undeclared identifier '__builtin_ia32_paddb'; did you mean '__builtin_arm_addg'?
  358. return (__m64)__builtin_ia32_paddb((__v8qi)__m1, (__v8qi)__m2);
  359. ^
  360. /Applications/Xcode-beta.app/Contents/Developer/Toolchains/XcodeDefault.xctoolchain/usr/lib/clang/12.0.0/include/mmintrin.h:352:19: note:
  361. '__builtin_arm_addg' declared here
  362. /Applications/Xcode-beta.app/Contents/Developer/Toolchains/XcodeDefault.xctoolchain/usr/lib/clang/12.0.0/include/mmintrin.h:352:19: error:
  363. first argument of MTE builtin function must be a pointer ('__v8qi' (vector of 8 'char' values) invalid)
  364. return (__m64)__builtin_ia32_paddb((__v8qi)__m1, (__v8qi)__m2);
  365. ^ ~~~~~~~~~~~~
  366. /Applications/Xcode-beta.app/Contents/Developer/Toolchains/XcodeDefault.xctoolchain/usr/lib/clang/12.0.0/include/mmintrin.h:373:19: error:
  367. use of undeclared identifier '__builtin_ia32_paddw'; did you mean '__builtin_arm_addg'?
  368. return (__m64)__builtin_ia32_paddw((__v4hi)__m1, (__v4hi)__m2);
  369. ^
  370. /Applications/Xcode-beta.app/Contents/Developer/Toolchains/XcodeDefault.xctoolchain/usr/lib/clang/12.0.0/include/mmintrin.h:352:19: note:
  371. '__builtin_arm_addg' declared here
  372. return (__m64)__builtin_ia32_paddb((__v8qi)__m1, (__v8qi)__m2);
  373. ^
  374. /Applications/Xcode-beta.app/Contents/Developer/Toolchains/XcodeDefault.xctoolchain/usr/lib/clang/12.0.0/include/mmintrin.h:373:19: error:
  375. first argument of MTE builtin function must be a pointer ('__v4hi' (vector of 4 'short' values) invalid)
  376. return (__m64)__builtin_ia32_paddw((__v4hi)__m1, (__v4hi)__m2);
  377. ^ ~~~~~~~~~~~~
  378. /Applications/Xcode-beta.app/Contents/Developer/Toolchains/XcodeDefault.xctoolchain/usr/lib/clang/12.0.0/include/mmintrin.h:394:19: error:
  379. use of undeclared identifier '__builtin_ia32_paddd'; did you mean '__builtin_arm_addg'?
  380. return (__m64)__builtin_ia32_paddd((__v2si)__m1, (__v2si)__m2);
  381. ^
  382. /Applications/Xcode-beta.app/Contents/Developer/Toolchains/XcodeDefault.xctoolchain/usr/lib/clang/12.0.0/include/mmintrin.h:352:19: note:
  383. '__builtin_arm_addg' declared here
  384. return (__m64)__builtin_ia32_paddb((__v8qi)__m1, (__v8qi)__m2);
  385. ^
  386. fatal error: too many errors emitted, stopping now [-ferror-limit=]
  387. 20 errors generated.
  388. make[2]: *** [../../../../osx_clang/obj/x64/Release/osd_sdl/src/osd/modules/input/input_common.o] Error 1
  389. make[1]: *** [osd_sdl] Error 2
  390. make[1]: *** Waiting for unfinished jobs....
  391. make[1]: *** [optional] Error 2
  392. make: *** [macosx_arm64_clang] Error 2
  393. dtk@DTK mame %
  394.  
RAW Paste Data