SHARE
TWEET

Untitled

a guest Nov 12th, 2019 82 Never
Not a member of Pastebin yet? Sign Up, it unlocks many cool features!
  1. [ 14%] Building CXX object contrib/epee/src/CMakeFiles/epee_readline.dir/readline_buffer.cpp.o
  2. cc1plus: Fehler: »-fstack-check=« und »-fstack-clash_protection« schließen einander aus. »-fstack-check=« wird deaktiviert [-Werror]
  3. cc1plus: Alle Warnungen werden als Fehler behandelt
  4. make[2]: *** [contrib/epee/src/CMakeFiles/epee_readline.dir/build.make:63: contrib/epee/src/CMakeFiles/epee_readline.dir/readline_buffer.cpp.o] Fehler 1
  5. make[1]: *** [CMakeFiles/Makefile2:405: contrib/epee/src/CMakeFiles/epee_readline.dir/all] Fehler 2
  6. make: *** [Makefile:141: all] Fehler 2
  7. ==> FEHLER: Ein Fehler geschah in build().
  8.     Breche ab...
RAW Paste Data
We use cookies for various purposes including analytics. By continuing to use Pastebin, you agree to our use of cookies as described in the Cookies Policy. OK, I Understand
 
Top