SHARE
TWEET

Untitled

LegendaXXL Apr 23rd, 2018 118 Never
Not a member of Pastebin yet? Sign Up, it unlocks many cool features!
  1. /usr/local/bin/ld: cannot find -lanticpxsvr
  2. collect2: error: ld returned 1 exit status
  3. /usr/local/bin/ld: cannot find -lanticpxsvr
  4. collect2: error: ld returned 1 exit status
  5. gmake: *** [../game_r40250_32] Error 1
  6. gmake: *** Waiting for unfinished jobs....
  7. gmake: *** [../test] Error 1
RAW Paste Data
We use cookies for various purposes including analytics. By continuing to use Pastebin, you agree to our use of cookies as described in the Cookies Policy. OK, I Understand
Top