gusibsd

Untitled

Mar 27th, 2014
138
0
Never
Not a member of Pastebin yet? Sign Up, it unlocks many cool features!
text 0.88 KB | None | 0 0
  1. CC test_tree_view_frame-test-tree-view-frame.o
  2. CCLD libevolution-util.la
  3. cc: error: no such file or directory: '/usr/local/lib/libgtkhtml-editor-4.0.so'
  4. cc: error: no such file or directory: '/usr/local/lib/libgtkhtml-4.0.so'
  5. gmake[4]: *** [libevolution-util.la] Error 1
  6. gmake[4]: Leaving directory `/wrkdirs/usr/ports/mail/evolution/work/evolution-3.12.0/e-util'
  7. gmake[3]: *** [all] Error 2
  8. gmake[3]: Leaving directory `/wrkdirs/usr/ports/mail/evolution/work/evolution-3.12.0/e-util'
  9. gmake[2]: *** [all-recursive] Error 1
  10. gmake[2]: Leaving directory `/wrkdirs/usr/ports/mail/evolution/work/evolution-3.12.0'
  11. gmake[1]: *** [all] Error 2
  12. gmake[1]: Leaving directory `/wrkdirs/usr/ports/mail/evolution/work/evolution-3.12.0'
  13. ===> Compilation failed unexpectedly.
  14. Try to set MAKE_JOBS_UNSAFE=yes and rebuild before reporting the failure to
  15. the maintainer.
  16. *** Error code 1
Advertisement
Add Comment
Please, Sign In to add comment