Nessiesson

Untitled

Dec 18th, 2019
629
0
Never
Not a member of Pastebin yet? Sign Up, it unlocks many cool features!
text 2.45 KB | None | 0 0
  1. PS C:\Users\Nessi\IdeaProjects\carpet-client> .\gradlew setupDecompWorkspace build
  2.  
  3. > Configure project :
  4. This mapping 'stable_39' was designed for MC 1.12! Use at your own peril.
  5. Version string 'v1.1d' does not match SemVer specification
  6. You should try SemVer : http://semver.org/
  7.  
  8. > Task :compileJava FAILED
  9. Note: SpongePowered MIXIN Annotation Processor Version=0.7.4
  10. Note: ObfuscationServiceMCP supports type: "searge"
  11. Note: ObfuscationServiceMCP supports type: "notch"
  12. Note: Loading searge mappings from C:\Users\Nessi\.gradle\caches\minecraft\de\oceanlabs\mcp\mcp_stable\39\1.12.2\srgs\mcp-srg.srg
  13. Note: Loading notch mappings from C:\Users\Nessi\.gradle\caches\minecraft\de\oceanlabs\mcp\mcp_stable\39\1.12.2\srgs\mcp-notch.srg
  14. Note: Writing refmap to C:\Users\Nessi\IdeaProjects\carpet-client\build\tmp\compileJava\compileJava-refmap.json
  15. Note: Writing refmap to C:\Users\Nessi\IdeaProjects\carpet-client\build\tmp\compileJava\compileJava-refmap.json
  16. Note: Writing searge output SRGs to C:\Users\Nessi\IdeaProjects\carpet-client\build\tmp\compileJava\mcp-srg.srg
  17. Note: Writing notch output SRGs to C:\Users\Nessi\IdeaProjects\carpet-client\build\tmp\compileJava\mcp-notch.srg
  18. C:\Users\Nessi\IdeaProjects\carpet-client\build\sources\main\java\carpetclient\Config.java:13: error: package javafx.geometry does not exist
  19. import javafx.geometry.BoundingBox;
  20. ^
  21. Note: Writing refmap to C:\Users\Nessi\IdeaProjects\carpet-client\build\tmp\compileJava\compileJava-refmap.json
  22. Note: Writing refmap to C:\Users\Nessi\IdeaProjects\carpet-client\build\tmp\compileJava\compileJava-refmap.json
  23. Note: Writing searge output SRGs to C:\Users\Nessi\IdeaProjects\carpet-client\build\tmp\compileJava\mcp-srg.srg
  24. Note: Writing notch output SRGs to C:\Users\Nessi\IdeaProjects\carpet-client\build\tmp\compileJava\mcp-notch.srg
  25. 1 error
  26.  
  27. FAILURE: Build failed with an exception.
  28.  
  29. * What went wrong:
  30. Execution failed for task ':compileJava'.
  31. > Compilation failed; see the compiler error output for details.
  32.  
  33. * Try:
  34. Run with --stacktrace option to get the stack trace. Run with --info or --debug option to get more log output. Run with --scan to get full insights.
  35.  
  36. * Get more help at https://help.gradle.org
  37.  
  38. Deprecated Gradle features were used in this build, making it incompatible with Gradle 5.0.
  39. See https://docs.gradle.org/4.7/userguide/command_line_interface.html#sec:command_line_warnings
  40.  
  41. BUILD FAILED in 8s
  42. 9 actionable tasks: 6 executed, 3 up-to-date
Advertisement
Add Comment
Please, Sign In to add comment