Advertisement
Guest User

Untitled

a guest
May 5th, 2021
109
Never
Not a member of Pastebin yet? Sign Up, it unlocks many cool features!
  1. Microsoft Windows [Version 10.0.19041.928]
  2. (c) Microsoft Corporation. All rights reserved.
  3.  
  4. C:\Users\ODEL>g:
  5.  
  6. G:\>cd openmrs
  7.  
  8. G:\openmrs>cd openmrs-core
  9.  
  10. G:\openmrs\openmrs-core>mvn clean install -Dfork=false
  11. [INFO] Scanning for projects...
  12. Downloading from openmrs-bintray-repo: https://dl.bintray.com/openmrs/maven/javax/annotation/javax.annotation-api/maven-metadata.xml
  13. [WARNING] Could not transfer metadata javax.annotation:javax.annotation-api/maven-metadata.xml from/to openmrs-bintray-repo (https://dl.bintray.com/openmrs/maven/): Authorization failed for https://dl.bintray.com/openmrs/maven/javax/annotation/javax.annotation-api/maven-metadata.xml 403 Forbidden
  14. [INFO] ------------------------------------------------------------------------
  15. [INFO] Reactor Build Order:
  16. [INFO]
  17. [INFO] OpenMRS [pom]
  18. [INFO] openmrs-tools [jar]
  19. [INFO] openmrs-test [pom]
  20. [INFO] openmrs-api [jar]
  21. [INFO] openmrs-web [jar]
  22. [INFO] openmrs-webapp [war]
  23. [INFO] openmrs-liquibase [jar]
  24. [INFO]
  25. [INFO] ------------------------< org.openmrs:openmrs >-------------------------
  26. [INFO] Building OpenMRS 2.5.0-SNAPSHOT [1/7]
  27. [INFO] --------------------------------[ pom ]---------------------------------
  28. [INFO]
  29. [INFO] --- maven-clean-plugin:2.5:clean (default-clean) @ openmrs ---
  30. [INFO] Deleting G:\openmrs\openmrs-core\target
  31. [INFO]
  32. [INFO] --- buildnumber-maven-plugin:1.4:create (default) @ openmrs ---
  33. [INFO] ShortRevision tag detected. The value is '6'.
  34. [INFO] Executing: cmd.exe /X /C "git rev-parse --verify --short=6 HEAD"
  35. [INFO] Working directory: G:\openmrs\openmrs-core
  36. [INFO] Storing buildNumber: 95b784 at timestamp: 1620239133272
  37. [INFO] Storing buildScmBranch: master
  38. [INFO]
  39. [INFO] --- build-helper-maven-plugin:3.2.0:parse-version (parse-version) @ openmrs ---
  40. [INFO]
  41. [INFO] --- maven-jar-plugin:3.2.0:test-jar (default) @ openmrs ---
  42. [WARNING] JAR will be empty - no content was marked for inclusion!
  43. [INFO] Building jar: G:\openmrs\openmrs-core\target\openmrs-2.5.0-SNAPSHOT-tests.jar
  44. [INFO]
  45. [INFO] --- license-maven-plugin:3.0:check (default) @ openmrs ---
  46. [INFO] Checking licenses...
  47. [INFO]
  48. [INFO] --- maven-install-plugin:2.4:install (default-install) @ openmrs ---
  49. [INFO] Installing G:\openmrs\openmrs-core\pom.xml to C:\Users\ODEL\.m2\repository\org\openmrs\openmrs\2.5.0-SNAPSHOT\openmrs-2.5.0-SNAPSHOT.pom
  50. [INFO] Installing G:\openmrs\openmrs-core\target\openmrs-2.5.0-SNAPSHOT-tests.jar to C:\Users\ODEL\.m2\repository\org\openmrs\openmrs\2.5.0-SNAPSHOT\openmrs-2.5.0-SNAPSHOT-tests.jar
  51. [INFO]
  52. [INFO] ------------------< org.openmrs.tools:openmrs-tools >-------------------
  53. [INFO] Building openmrs-tools 2.5.0-SNAPSHOT [2/7]
  54. [INFO] --------------------------------[ jar ]---------------------------------
  55. [INFO]
  56. [INFO] --- maven-clean-plugin:2.5:clean (default-clean) @ openmrs-tools ---
  57. [INFO] Deleting G:\openmrs\openmrs-core\tools\target
  58. [INFO]
  59. [INFO] --- buildnumber-maven-plugin:1.4:create (default) @ openmrs-tools ---
  60. [INFO]
  61. [INFO] --- build-helper-maven-plugin:3.2.0:parse-version (parse-version) @ openmrs-tools ---
  62. [INFO]
  63. [INFO] --- maven-resources-plugin:3.2.0:resources (default-resources) @ openmrs-tools ---
  64. [INFO] Using 'UTF-8' encoding to copy filtered resources.
  65. [INFO] Using 'UTF-8' encoding to copy filtered properties files.
  66. [INFO] Copying 4 resources
  67. [INFO]
  68. [INFO] --- maven-compiler-plugin:3.8.1:compile (default-compile) @ openmrs-tools ---
  69. [INFO] No sources to compile
  70. [INFO]
  71. [INFO] --- maven-resources-plugin:3.2.0:testResources (default-testResources) @ openmrs-tools ---
  72. [INFO] Using 'UTF-8' encoding to copy filtered resources.
  73. [INFO] Using 'UTF-8' encoding to copy filtered properties files.
  74. [INFO] skip non existing resourceDirectory G:\openmrs\openmrs-core\tools\src\test\resources
  75. [INFO]
  76. [INFO] --- maven-compiler-plugin:3.8.1:testCompile (default-testCompile) @ openmrs-tools ---
  77. [INFO] No sources to compile
  78. [INFO]
  79. [INFO] --- maven-surefire-plugin:2.22.2:test (default-test) @ openmrs-tools ---
  80. [INFO] No tests to run.
  81. [INFO]
  82. [INFO] --- maven-jar-plugin:3.2.0:jar (default-jar) @ openmrs-tools ---
  83. [INFO] Building jar: G:\openmrs\openmrs-core\tools\target\openmrs-tools-2.5.0-SNAPSHOT.jar
  84. [INFO]
  85. [INFO] --- maven-jar-plugin:3.2.0:test-jar (default) @ openmrs-tools ---
  86. [WARNING] JAR will be empty - no content was marked for inclusion!
  87. [INFO] Building jar: G:\openmrs\openmrs-core\tools\target\openmrs-tools-2.5.0-SNAPSHOT-tests.jar
  88. [INFO]
  89. [INFO] --- license-maven-plugin:3.0:check (default) @ openmrs-tools ---
  90. [INFO] Checking licenses...
  91. [INFO]
  92. [INFO] --- maven-install-plugin:2.4:install (default-install) @ openmrs-tools ---
  93. [INFO] Installing G:\openmrs\openmrs-core\tools\target\openmrs-tools-2.5.0-SNAPSHOT.jar to C:\Users\ODEL\.m2\repository\org\openmrs\tools\openmrs-tools\2.5.0-SNAPSHOT\openmrs-tools-2.5.0-SNAPSHOT.jar
  94. [INFO] Installing G:\openmrs\openmrs-core\tools\pom.xml to C:\Users\ODEL\.m2\repository\org\openmrs\tools\openmrs-tools\2.5.0-SNAPSHOT\openmrs-tools-2.5.0-SNAPSHOT.pom
  95. [INFO] Installing G:\openmrs\openmrs-core\tools\target\openmrs-tools-2.5.0-SNAPSHOT-tests.jar to C:\Users\ODEL\.m2\repository\org\openmrs\tools\openmrs-tools\2.5.0-SNAPSHOT\openmrs-tools-2.5.0-SNAPSHOT-tests.jar
  96. [INFO]
  97. [INFO] -------------------< org.openmrs.test:openmrs-test >--------------------
  98. [INFO] Building openmrs-test 2.5.0-SNAPSHOT [3/7]
  99. [INFO] --------------------------------[ pom ]---------------------------------
  100. [INFO]
  101. [INFO] --- maven-clean-plugin:2.5:clean (default-clean) @ openmrs-test ---
  102. [INFO] Deleting G:\openmrs\openmrs-core\test\target
  103. [INFO]
  104. [INFO] --- buildnumber-maven-plugin:1.4:create (default) @ openmrs-test ---
  105. [INFO]
  106. [INFO] --- build-helper-maven-plugin:3.2.0:parse-version (parse-version) @ openmrs-test ---
  107. [INFO]
  108. [INFO] --- maven-jar-plugin:3.2.0:test-jar (default) @ openmrs-test ---
  109. [WARNING] JAR will be empty - no content was marked for inclusion!
  110. [INFO] Building jar: G:\openmrs\openmrs-core\test\target\openmrs-test-2.5.0-SNAPSHOT-tests.jar
  111. [INFO]
  112. [INFO] --- license-maven-plugin:3.0:check (default) @ openmrs-test ---
  113. [INFO] Checking licenses...
  114. [INFO]
  115. [INFO] --- maven-install-plugin:2.4:install (default-install) @ openmrs-test ---
  116. [INFO] Installing G:\openmrs\openmrs-core\test\pom.xml to C:\Users\ODEL\.m2\repository\org\openmrs\test\openmrs-test\2.5.0-SNAPSHOT\openmrs-test-2.5.0-SNAPSHOT.pom
  117. [INFO] Installing G:\openmrs\openmrs-core\test\target\openmrs-test-2.5.0-SNAPSHOT-tests.jar to C:\Users\ODEL\.m2\repository\org\openmrs\test\openmrs-test\2.5.0-SNAPSHOT\openmrs-test-2.5.0-SNAPSHOT-tests.jar
  118. [INFO]
  119. [INFO] --------------------< org.openmrs.api:openmrs-api >---------------------
  120. [INFO] Building openmrs-api 2.5.0-SNAPSHOT [4/7]
  121. [INFO] --------------------------------[ jar ]---------------------------------
  122. [INFO]
  123. [INFO] --- maven-clean-plugin:2.5:clean (default-clean) @ openmrs-api ---
  124. [INFO] Deleting G:\openmrs\openmrs-core\api\target
  125. [INFO]
  126. [INFO] --- buildnumber-maven-plugin:1.4:create (default) @ openmrs-api ---
  127. [INFO]
  128. [INFO] --- build-helper-maven-plugin:3.2.0:parse-version (parse-version) @ openmrs-api ---
  129. [INFO]
  130. [INFO] --- jacoco-maven-plugin:0.8.7:prepare-agent (prepare-agent) @ openmrs-api ---
  131. [INFO] argLine set to -javaagent:C:\\Users\\ODEL\\.m2\\repository\\org\\jacoco\\org.jacoco.agent\\0.8.7\\org.jacoco.agent-0.8.7-runtime.jar=destfile=G:\\openmrs\\openmrs-core\\api\\target\\jacoco.exec,includes=org/openmrs/** -Duser.language=en -Duser.region=US -Xmx2g -Djava.locale.providers=COMPAT
  132. [INFO]
  133. [INFO] --- maven-java-formatter-plugin:0.3:format (default) @ openmrs-api ---
  134. [INFO] Using 'UTF-8' encoding to format source files.
  135. [INFO] Number of files to be formatted: 1084
  136. [INFO] Successfully formatted: 0 file(s)
  137. [INFO] Fail to format : 0 file(s)
  138. [INFO] Skipped : 1084 file(s)
  139. [INFO] Approximate time taken: 9s
  140. [INFO]
  141. [INFO] --- maven-resources-plugin:3.2.0:resources (default-resources) @ openmrs-api ---
  142. [INFO] Using 'UTF-8' encoding to copy filtered resources.
  143. [INFO] Using 'UTF-8' encoding to copy filtered properties files.
  144. [INFO] Copying 1 resource
  145. [INFO] Copying 153 resources
  146. [INFO] The encoding used to copy filtered properties files have not been set. This means that the same encoding will be used to copy filtered properties files as when copying other filtered resources. This might not be what you want! Run your build with --debug to see which files might be affected. Read more at https://maven.apache.org/plugins/maven-resources-plugin/examples/filtering-properties-files.html
  147. [INFO]
  148. [INFO] --- maven-compiler-plugin:3.8.1:compile (default-compile) @ openmrs-api ---
  149. [INFO] Changes detected - recompiling the module!
  150. [INFO] Compiling 725 source files to G:\openmrs\openmrs-core\api\target\classes
  151. [INFO] /G:/openmrs/openmrs-core/api/src/main/java/org/openmrs/PersonName.java: Some input files use or override a deprecated API.
  152. [INFO] /G:/openmrs/openmrs-core/api/src/main/java/org/openmrs/PersonName.java: Recompile with -Xlint:deprecation for details.
  153. [INFO] /G:/openmrs/openmrs-core/api/src/main/java/org/openmrs/api/db/hibernate/HibernateVisitDAO.java: Some input files use unchecked or unsafe operations.
  154. [INFO] /G:/openmrs/openmrs-core/api/src/main/java/org/openmrs/api/db/hibernate/HibernateVisitDAO.java: Recompile with -Xlint:unchecked for details.
  155. [INFO]
  156. [INFO] --- maven-resources-plugin:3.2.0:testResources (default-testResources) @ openmrs-api ---
  157. [INFO] Using 'UTF-8' encoding to copy filtered resources.
  158. [INFO] Using 'UTF-8' encoding to copy filtered properties files.
  159. [INFO] Copying 147 resources
  160. [INFO]
  161. [INFO] --- maven-compiler-plugin:3.8.1:testCompile (default-testCompile) @ openmrs-api ---
  162. [INFO] Changes detected - recompiling the module!
  163. [INFO] Compiling 359 source files to G:\openmrs\openmrs-core\api\target\test-classes
  164. [INFO] /G:/openmrs/openmrs-core/api/src/test/java/org/openmrs/test/jupiter/BaseContextSensitiveTest.java: Some input files use or override a deprecated API.
  165. [INFO] /G:/openmrs/openmrs-core/api/src/test/java/org/openmrs/test/jupiter/BaseContextSensitiveTest.java: Recompile with -Xlint:deprecation for details.
  166. [INFO] /G:/openmrs/openmrs-core/api/src/test/java/org/openmrs/api/ConceptServiceTest.java: Some input files use unchecked or unsafe operations.
  167. [INFO] /G:/openmrs/openmrs-core/api/src/test/java/org/openmrs/api/ConceptServiceTest.java: Recompile with -Xlint:unchecked for details.
  168. [INFO]
  169. [INFO] --- maven-surefire-plugin:2.22.2:test (default-test) @ openmrs-api ---
  170. [INFO]
  171. [INFO] -------------------------------------------------------
  172. [INFO] T E S T S
  173. [INFO] -------------------------------------------------------
  174. [INFO]
  175. [INFO] Results:
  176. [INFO]
  177. [INFO] Tests run: 0, Failures: 0, Errors: 0, Skipped: 0
  178. [INFO]
  179. [WARNING] Corrupted STDOUT by directly writing to native stream in forked JVM 1. See FAQ web page and the dump file G:\openmrs\openmrs-core\api\target\surefire-reports\2021-05-05T21-25-41_892-jvmRun1.dumpstream
  180. [INFO] ------------------------------------------------------------------------
  181. [INFO] Reactor Summary for OpenMRS 2.5.0-SNAPSHOT:
  182. [INFO]
  183. [INFO] OpenMRS ............................................ SUCCESS [ 9.721 s]
  184. [INFO] openmrs-tools ...................................... SUCCESS [ 2.949 s]
  185. [INFO] openmrs-test ....................................... SUCCESS [ 0.931 s]
  186. [INFO] openmrs-api ........................................ FAILURE [ 46.671 s]
  187. [INFO] openmrs-web ........................................ SKIPPED
  188. [INFO] openmrs-webapp ..................................... SKIPPED
  189. [INFO] openmrs-liquibase .................................. SKIPPED
  190. [INFO] ------------------------------------------------------------------------
  191. [INFO] BUILD FAILURE
  192. [INFO] ------------------------------------------------------------------------
  193. [INFO] Total time: 01:02 min
  194. [INFO] Finished at: 2021-05-05T21:26:30+03:00
  195. [INFO] ------------------------------------------------------------------------
  196. [ERROR] Failed to execute goal org.apache.maven.plugins:maven-surefire-plugin:2.22.2:test (default-test) on project openmrs-api: There are test failures.
  197. [ERROR]
  198. [ERROR] Please refer to G:\openmrs\openmrs-core\api\target\surefire-reports for the individual test results.
  199. [ERROR] Please refer to dump files (if any exist) [date].dump, [date]-jvmRun[N].dump and [date].dumpstream.
  200. [ERROR] The forked VM terminated without properly saying goodbye. VM crash or System.exit called?
  201. [ERROR] Command was cmd.exe /X /C ""C:\Program Files\java\jre\bin\java" -javaagent:C:\\Users\\ODEL\\.m2\\repository\\org\\jacoco\\org.jacoco.agent\\0.8.7\\org.jacoco.agent-0.8.7-runtime.jar=destfile=G:\\openmrs\\openmrs-core\\api\\target\\jacoco.exec,includes=org/openmrs/** -Duser.language=en -Duser.region=US -Xmx2g -Djava.locale.providers=COMPAT org.apache.maven.surefire.booter.ForkedBooter C:\Users\ODEL\AppData\Local\Temp\surefire6237042045971155190 2021-05-05T21-25-41_892-jvmRun1 surefire760461621260091151tmp surefire_09100629830616275313tmp"
  202. [ERROR] Error occurred in starting fork, check output in log
  203. [ERROR] Process Exit Code: 1
  204. [ERROR] org.apache.maven.surefire.booter.SurefireBooterForkException: The forked VM terminated without properly saying goodbye. VM crash or System.exit called?
  205. [ERROR] Command was cmd.exe /X /C ""C:\Program Files\java\jre\bin\java" -javaagent:C:\\Users\\ODEL\\.m2\\repository\\org\\jacoco\\org.jacoco.agent\\0.8.7\\org.jacoco.agent-0.8.7-runtime.jar=destfile=G:\\openmrs\\openmrs-core\\api\\target\\jacoco.exec,includes=org/openmrs/** -Duser.language=en -Duser.region=US -Xmx2g -Djava.locale.providers=COMPAT org.apache.maven.surefire.booter.ForkedBooter C:\Users\ODEL\AppData\Local\Temp\surefire6237042045971155190 2021-05-05T21-25-41_892-jvmRun1 surefire760461621260091151tmp surefire_09100629830616275313tmp"
  206. [ERROR] Error occurred in starting fork, check output in log
  207. [ERROR] Process Exit Code: 1
  208. [ERROR] at org.apache.maven.plugin.surefire.booterclient.ForkStarter.fork(ForkStarter.java:669)
  209. [ERROR] at org.apache.maven.plugin.surefire.booterclient.ForkStarter.run(ForkStarter.java:282)
  210. [ERROR] at org.apache.maven.plugin.surefire.booterclient.ForkStarter.run(ForkStarter.java:245)
  211. [ERROR] at org.apache.maven.plugin.surefire.AbstractSurefireMojo.executeProvider(AbstractSurefireMojo.java:1183)
  212. [ERROR] at org.apache.maven.plugin.surefire.AbstractSurefireMojo.executeAfterPreconditionsChecked(AbstractSurefireMojo.java:1011)
  213. [ERROR] at org.apache.maven.plugin.surefire.AbstractSurefireMojo.execute(AbstractSurefireMojo.java:857)
  214. [ERROR] at org.apache.maven.plugin.DefaultBuildPluginManager.executeMojo(DefaultBuildPluginManager.java:137)
  215. [ERROR] at org.apache.maven.lifecycle.internal.MojoExecutor.execute(MojoExecutor.java:210)
  216. [ERROR] at org.apache.maven.lifecycle.internal.MojoExecutor.execute(MojoExecutor.java:156)
  217. [ERROR] at org.apache.maven.lifecycle.internal.MojoExecutor.execute(MojoExecutor.java:148)
  218. [ERROR] at org.apache.maven.lifecycle.internal.LifecycleModuleBuilder.buildProject(LifecycleModuleBuilder.java:117)
  219. [ERROR] at org.apache.maven.lifecycle.internal.LifecycleModuleBuilder.buildProject(LifecycleModuleBuilder.java:81)
  220. [ERROR] at org.apache.maven.lifecycle.internal.builder.singlethreaded.SingleThreadedBuilder.build(SingleThreadedBuilder.java:56)
  221. [ERROR] at org.apache.maven.lifecycle.internal.LifecycleStarter.execute(LifecycleStarter.java:128)
  222. [ERROR] at org.apache.maven.DefaultMaven.doExecute(DefaultMaven.java:305)
  223. [ERROR] at org.apache.maven.DefaultMaven.doExecute(DefaultMaven.java:192)
  224. [ERROR] at org.apache.maven.DefaultMaven.execute(DefaultMaven.java:105)
  225. [ERROR] at org.apache.maven.cli.MavenCli.execute(MavenCli.java:957)
  226. [ERROR] at org.apache.maven.cli.MavenCli.doMain(MavenCli.java:289)
  227. [ERROR] at org.apache.maven.cli.MavenCli.main(MavenCli.java:193)
  228. [ERROR] at sun.reflect.NativeMethodAccessorImpl.invoke0(Native Method)
  229. [ERROR] at sun.reflect.NativeMethodAccessorImpl.invoke(NativeMethodAccessorImpl.java:62)
  230. [ERROR] at sun.reflect.DelegatingMethodAccessorImpl.invoke(DelegatingMethodAccessorImpl.java:43)
  231. [ERROR] at java.lang.reflect.Method.invoke(Method.java:498)
  232. [ERROR] at org.codehaus.plexus.classworlds.launcher.Launcher.launchEnhanced(Launcher.java:282)
  233. [ERROR] at org.codehaus.plexus.classworlds.launcher.Launcher.launch(Launcher.java:225)
  234. [ERROR] at org.codehaus.plexus.classworlds.launcher.Launcher.mainWithExitCode(Launcher.java:406)
  235. [ERROR] at org.codehaus.plexus.classworlds.launcher.Launcher.main(Launcher.java:347)
  236. [ERROR]
  237. [ERROR] -> [Help 1]
  238. [ERROR]
  239. [ERROR] To see the full stack trace of the errors, re-run Maven with the -e switch.
  240. [ERROR] Re-run Maven using the -X switch to enable full debug logging.
  241. [ERROR]
  242. [ERROR] For more information about the errors and possible solutions, please read the following articles:
  243. [ERROR] [Help 1] http://cwiki.apache.org/confluence/display/MAVEN/MojoExecutionException
  244. [ERROR]
  245. [ERROR] After correcting the problems, you can resume the build with the command
  246. [ERROR] mvn <args> -rf :openmrs-api
  247.  
  248. G:\openmrs\openmrs-core>
Advertisement
RAW Paste Data Copied
Advertisement