Advertisement
Guest User

Untitled

a guest
Jul 28th, 2022
24
0
Never
Not a member of Pastebin yet? Sign Up, it unlocks many cool features!
text 13.61 KB | None | 0 0
  1. Executing Gradle task: runClient
  2. Build info: MCreator 2022.1.20510, forge-1.16.5, 64-bit, 14284 MB, Windows 10, JVM 17.0.1, JAVA_HOME: C:\Program Files\Pylo\MCreator\jdk, started on: 2022-07-28-17:25:42
  3.  
  4. > Task :compileJava
  5. C:\Users\Admin\MCreatorWorkspaces\eotug\src\main\java\net\mcreator\eotug\entity\renderer\FEQueenRenderer.java:102: error: cannot find symbol public void setupAnim(T entity, float limbSwing, float limbSwingAmount, float ageInTicks, float netHeadYaw, float headPitch) {
  6. ^
  7. symbol: class T
  8. location: class net.mcreator.eotug.entity.renderer.FEQueenRenderer.ModelFEQueen
  9. C:\Users\Admin\MCreatorWorkspaces\eotug\src\main\java\net\mcreator\eotug\entity\renderer\FEQueenRenderer.java:42: error: net.mcreator.eotug.entity.renderer.FEQueenRenderer.ModelFEQueen is not abstract and does not override abstract method setRotationAngles(net.minecraft.entity.Entity,float,float,float,float,float) in net.minecraft.client.renderer.entity.model.EntityModel public static class ModelFEQueen extends EntityModel<Entity> {
  10. ^
  11. C:\Users\Admin\MCreatorWorkspaces\eotug\src\main\java\net\mcreator\eotug\entity\renderer\FEQueenRenderer.java:48: error: cannot find symbol texWidth = 32;
  12. ^
  13. symbol: variable texWidth
  14. location: class net.mcreator.eotug.entity.renderer.FEQueenRenderer.ModelFEQueen
  15. C:\Users\Admin\MCreatorWorkspaces\eotug\src\main\java\net\mcreator\eotug\entity\renderer\FEQueenRenderer.java:49: error: cannot find symbol texHeight = 32;
  16. ^
  17. symbol: variable texHeight
  18. location: class net.mcreator.eotug.entity.renderer.FEQueenRenderer.ModelFEQueen
  19. C:\Users\Admin\MCreatorWorkspaces\eotug\src\main\java\net\mcreator\eotug\entity\renderer\FEQueenRenderer.java:51: error: cannot find symbol bb_main.setPos(0.0F, 24.0F, 0.0F);
  20. ^
  21. symbol: method setPos(float,float,float)
  22. location: variable bb_main of type net.minecraft.client.renderer.model.ModelRenderer
  23. C:\Users\Admin\MCreatorWorkspaces\eotug\src\main\java\net\mcreator\eotug\entity\renderer\FEQueenRenderer.java:52: error: cannot find symbol bb_main.texOffs(0, 0).addBox(-2.0F, -3.0F, -4.0F, 4.0F, 1.0F, 8.0F, 0.0F, false);
  24. ^
  25. symbol: method texOffs(int,int)
  26. location: variable bb_main of type net.minecraft.client.renderer.model.ModelRenderer
  27. C:\Users\Admin\MCreatorWorkspaces\eotug\src\main\java\net\mcreator\eotug\entity\renderer\FEQueenRenderer.java:53: error: cannot find symbol bb_main.texOffs(0, 9).addBox(-2.0F, -4.0F, 4.0F, 4.0F, 3.0F, 4.0F, 0.0F, false);
  28. ^
  29. symbol: method texOffs(int,int)
  30. location: variable bb_main of type net.minecraft.client.renderer.model.ModelRenderer
  31. C:\Users\Admin\MCreatorWorkspaces\eotug\src\main\java\net\mcreator\eotug\entity\renderer\FEQueenRenderer.java:54: error: cannot find symbol bb_main.texOffs(12, 12).addBox(-2.0F, -4.0F, -4.0F, 4.0F, 1.0F, 4.0F, 0.0F, false);
  32. ^
  33. symbol: method texOffs(int,int)
  34. location: variable bb_main of type net.minecraft.client.renderer.model.ModelRenderer
  35. C:\Users\Admin\MCreatorWorkspaces\eotug\src\main\java\net\mcreator\eotug\entity\renderer\FEQueenRenderer.java:55: error: cannot find symbol bb_main.texOffs(0, 4).addBox(-1.0F, -5.0F, -4.0F, 2.0F, 1.0F, 2.0F, 0.0F, false);
  36. ^
  37. symbol: method texOffs(int,int)
  38. location: variable bb_main of type net.minecraft.client.renderer.model.ModelRenderer
  39. C:\Users\Admin\MCreatorWorkspaces\eotug\src\main\java\net\mcreator\eotug\entity\renderer\FEQueenRenderer.java:56: error: cannot find symbol bb_main.texOffs(12, 9).addBox(-1.0F, -3.0F, -5.0F, 2.0F, 1.0F, 1.0F, 0.0F, false);
  40. ^
  41. symbol: method texOffs(int,int)
  42. location: variable bb_main of type net.minecraft.client.renderer.model.ModelRenderer
  43. C:\Users\Admin\MCreatorWorkspaces\eotug\src\main\java\net\mcreator\eotug\entity\renderer\FEQueenRenderer.java:57: error: cannot find symbol bb_main.texOffs(0, 0).addBox(-1.0F, -4.0F, -7.0F, 2.0F, 2.0F, 2.0F, 0.0F, false);
  44. ^
  45. symbol: method texOffs(int,int)
  46. location: variable bb_main of type net.minecraft.client.renderer.model.ModelRenderer
  47. C:\Users\Admin\MCreatorWorkspaces\eotug\src\main\java\net\mcreator\eotug\entity\renderer\FEQueenRenderer.java:58: error: cannot find symbol bb_main.texOffs(11, 17).addBox(2.0F, -2.0F, -3.0F, 1.0F, 1.0F, 1.0F, 0.0F, false);
  48. ^
  49. symbol: method texOffs(int,int)
  50. location: variable bb_main of type net.minecraft.client.renderer.model.ModelRenderer
  51. C:\Users\Admin\MCreatorWorkspaces\eotug\src\main\java\net\mcreator\eotug\entity\renderer\FEQueenRenderer.java:59: error: cannot find symbol bb_main.texOffs(17, 10).addBox(2.0F, -2.0F, 0.0F, 1.0F, 1.0F, 1.0F, 0.0F, false);
  52. ^
  53. symbol: method texOffs(int,int)
  54. location: variable bb_main of type net.minecraft.client.renderer.model.ModelRenderer
  55. C:\Users\Admin\MCreatorWorkspaces\eotug\src\main\java\net\mcreator\eotug\entity\renderer\FEQueenRenderer.java:60: error: cannot find symbol bb_main.texOffs(8, 16).addBox(2.0F, -2.0F, 3.0F, 1.0F, 1.0F, 1.0F, 0.0F, false);
  56. ^
  57. symbol: method texOffs(int,int)
  58. location: variable bb_main of type net.minecraft.client.renderer.model.ModelRenderer
  59. C:\Users\Admin\MCreatorWorkspaces\eotug\src\main\java\net\mcreator\eotug\entity\renderer\FEQueenRenderer.java:61: error: cannot find symbol bb_main.texOffs(16, 6).addBox(-3.0F, -2.0F, 3.0F, 1.0F, 1.0F, 1.0F, 0.0F, false);
  60. ^
  61. symbol: method texOffs(int,int)
  62. location: variable bb_main of type net.minecraft.client.renderer.model.ModelRenderer
  63. C:\Users\Admin\MCreatorWorkspaces\eotug\src\main\java\net\mcreator\eotug\entity\renderer\FEQueenRenderer.java:62: error: cannot find symbol bb_main.texOffs(16, 4).addBox(-3.0F, -2.0F, 0.0F, 1.0F, 1.0F, 1.0F, 0.0F, false);
  64. ^
  65. symbol: method texOffs(int,int)
  66. location: variable bb_main of type net.minecraft.client.renderer.model.ModelRenderer
  67. C:\Users\Admin\MCreatorWorkspaces\eotug\src\main\java\net\mcreator\eotug\entity\renderer\FEQueenRenderer.java:63: error: cannot find symbol bb_main.texOffs(4, 16).addBox(-3.0F, -2.0F, -3.0F, 1.0F, 1.0F, 1.0F, 0.0F, false);
  68. ^
  69. symbol: method texOffs(int,int)
  70. location: variable bb_main of type net.minecraft.client.renderer.model.ModelRenderer
  71. C:\Users\Admin\MCreatorWorkspaces\eotug\src\main\java\net\mcreator\eotug\entity\renderer\FEQueenRenderer.java:64: error: cannot find symbol bb_main.texOffs(16, 2).addBox(-4.0F, -1.0F, 3.0F, 1.0F, 1.0F, 1.0F, 0.0F, false);
  72. ^
  73. symbol: method texOffs(int,int)
  74. location: variable bb_main of type net.minecraft.client.renderer.model.ModelRenderer
  75. C:\Users\Admin\MCreatorWorkspaces\eotug\src\main\java\net\mcreator\eotug\entity\renderer\FEQueenRenderer.java:65: error: cannot find symbol bb_main.texOffs(16, 0).addBox(-4.0F, -1.0F, 0.0F, 1.0F, 1.0F, 1.0F, 0.0F, false);
  76. ^
  77. symbol: method texOffs(int,int)
  78. location: variable bb_main of type net.minecraft.client.renderer.model.ModelRenderer
  79. C:\Users\Admin\MCreatorWorkspaces\eotug\src\main\java\net\mcreator\eotug\entity\renderer\FEQueenRenderer.java:66: error: cannot find symbol bb_main.texOffs(0, 16).addBox(-4.0F, -1.0F, -3.0F, 1.0F, 1.0F, 1.0F, 0.0F, false);
  80. ^
  81. symbol: method texOffs(int,int)
  82. location: variable bb_main of type net.minecraft.client.renderer.model.ModelRenderer
  83. C:\Users\Admin\MCreatorWorkspaces\eotug\src\main\java\net\mcreator\eotug\entity\renderer\FEQueenRenderer.java:67: error: cannot find symbol bb_main.texOffs(12, 11).addBox(3.0F, -1.0F, 3.0F, 1.0F, 1.0F, 1.0F, 0.0F, false);
  84. ^
  85. symbol: method texOffs(int,int)
  86. location: variable bb_main of type net.minecraft.client.renderer.model.ModelRenderer
  87. C:\Users\Admin\MCreatorWorkspaces\eotug\src\main\java\net\mcreator\eotug\entity\renderer\FEQueenRenderer.java:68: error: cannot find symbol bb_main.texOffs(0, 11).addBox(3.0F, -1.0F, 0.0F, 1.0F, 1.0F, 1.0F, 0.0F, false);
  88. ^
  89. symbol: method texOffs(int,int)
  90. location: variable bb_main of type net.minecraft.client.renderer.model.ModelRenderer
  91. C:\Users\Admin\MCreatorWorkspaces\eotug\src\main\java\net\mcreator\eotug\entity\renderer\FEQueenRenderer.java:69: error: cannot find symbol bb_main.texOffs(0, 9).addBox(3.0F, -1.0F, -3.0F, 1.0F, 1.0F, 1.0F, 0.0F, false);
  92. ^
  93. symbol: method texOffs(int,int)
  94. location: variable bb_main of type net.minecraft.client.renderer.model.ModelRenderer
  95. C:\Users\Admin\MCreatorWorkspaces\eotug\src\main\java\net\mcreator\eotug\entity\renderer\FEQueenRenderer.java:70: error: cannot find symbol bb_main.texOffs(4, 6).addBox(-1.0F, -5.0F, -7.0F, 0.0F, 1.0F, 1.0F, 0.0F, false);
  96. ^
  97. symbol: method texOffs(int,int)
  98. location: variable bb_main of type net.minecraft.client.renderer.model.ModelRenderer
  99. C:\Users\Admin\MCreatorWorkspaces\eotug\src\main\java\net\mcreator\eotug\entity\renderer\FEQueenRenderer.java:71: error: cannot find symbol bb_main.texOffs(6, 3).addBox(-1.0F, -6.0F, -8.0F, 0.0F, 1.0F, 1.0F, 0.0F, false);
  100. ^
  101. symbol: method texOffs(int,int)
  102. location: variable bb_main of type net.minecraft.client.renderer.model.ModelRenderer
  103. C:\Users\Admin\MCreatorWorkspaces\eotug\src\main\java\net\mcreator\eotug\entity\renderer\FEQueenRenderer.java:72: error: cannot find symbol bb_main.texOffs(2, 6).addBox(-1.0F, -5.0F, -9.0F, 0.0F, 1.0F, 1.0F, 0.0F, false);
  104. ^
  105. symbol: method texOffs(int,int)
  106. location: variable bb_main of type net.minecraft.client.renderer.model.ModelRenderer
  107. C:\Users\Admin\MCreatorWorkspaces\eotug\src\main\java\net\mcreator\eotug\entity\renderer\FEQueenRenderer.java:73: error: cannot find symbol bb_main.texOffs(6, 0).addBox(-1.0F, -4.0F, -10.0F, 0.0F, 1.0F, 1.0F, 0.0F, false);
  108. ^
  109. symbol: method texOffs(int,int)
  110. location: variable bb_main of type net.minecraft.client.renderer.model.ModelRenderer
  111. C:\Users\Admin\MCreatorWorkspaces\eotug\src\main\java\net\mcreator\eotug\entity\renderer\FEQueenRenderer.java:74: error: cannot find symbol bb_main.texOffs(0, 6).addBox(1.0F, -4.0F, -10.0F, 0.0F, 1.0F, 1.0F, 0.0F, false);
  112. ^
  113. symbol: method texOffs(int,int)
  114. location: variable bb_main of type net.minecraft.client.renderer.model.ModelRenderer
  115. C:\Users\Admin\MCreatorWorkspaces\eotug\src\main\java\net\mcreator\eotug\entity\renderer\FEQueenRenderer.java:75: error: cannot find symbol bb_main.texOffs(0, 4).addBox(1.0F, -5.0F, -9.0F, 0.0F, 1.0F, 1.0F, 0.0F, false);
  116. ^
  117. symbol: method texOffs(int,int)
  118. location: variable bb_main of type net.minecraft.client.renderer.model.ModelRenderer
  119. C:\Users\Admin\MCreatorWorkspaces\eotug\src\main\java\net\mcreator\eotug\entity\renderer\FEQueenRenderer.java:76: error: cannot find symbol bb_main.texOffs(0, 3).addBox(1.0F, -6.0F, -8.0F, 0.0F, 1.0F, 1.0F, 0.0F, false);
  120. ^
  121. symbol: method texOffs(int,int)
  122. location: variable bb_main of type net.minecraft.client.renderer.model.ModelRenderer
  123. C:\Users\Admin\MCreatorWorkspaces\eotug\src\main\java\net\mcreator\eotug\entity\renderer\FEQueenRenderer.java:77: error: cannot find symbol bb_main.texOffs(0, 0).addBox(1.0F, -5.0F, -7.0F, 0.0F, 1.0F, 1.0F, 0.0F, false);
  124. ^
  125. symbol: method texOffs(int,int)
  126. location: variable bb_main of type net.minecraft.client.renderer.model.ModelRenderer
  127. C:\Users\Admin\MCreatorWorkspaces\eotug\src\main\java\net\mcreator\eotug\entity\renderer\FEQueenRenderer.java:79: error: cannot find symbol cube_r1.setPos(0.0F, 0.0F, 0.0F);
  128. ^
  129. symbol: method setPos(float,float,float)
  130. location: variable cube_r1 of type net.minecraft.client.renderer.model.ModelRenderer
  131. C:\Users\Admin\MCreatorWorkspaces\eotug\src\main\java\net\mcreator\eotug\entity\renderer\FEQueenRenderer.java:82: error: cannot find symbol cube_r1.texOffs(6, 4).addBox(-7.0F, -2.0F, 1.0F, 0.0F, 1.0F, 1.0F, 0.0F, false);
  132. ^
  133. symbol: method texOffs(int,int)
  134. location: variable cube_r1 of type net.minecraft.client.renderer.model.ModelRenderer
  135. C:\Users\Admin\MCreatorWorkspaces\eotug\src\main\java\net\mcreator\eotug\entity\renderer\FEQueenRenderer.java:84: error: cannot find symbol cube_r2.setPos(0.0F, 0.0F, 0.0F);
  136. ^
  137. symbol: method setPos(float,float,float)
  138. location: variable cube_r2 of type net.minecraft.client.renderer.model.ModelRenderer
  139. C:\Users\Admin\MCreatorWorkspaces\eotug\src\main\java\net\mcreator\eotug\entity\renderer\FEQueenRenderer.java:87: error: cannot find symbol cube_r2.texOffs(6, 6).addBox(-7.0F, -2.0F, 1.0F, 0.0F, 1.0F, 1.0F, 0.0F, false);
  140. ^
  141. symbol: method texOffs(int,int)
  142. location: variable cube_r2 of type net.minecraft.client.renderer.model.ModelRenderer
  143. C:\Users\Admin\MCreatorWorkspaces\eotug\src\main\java\net\mcreator\eotug\entity\renderer\FEQueenRenderer.java:90: error: method does not override or implement a method from a supertype @Override
  144. ^
  145. C:\Users\Admin\MCreatorWorkspaces\eotug\src\main\java\net\mcreator\eotug\entity\renderer\FEQueenRenderer.java:97: error: cannot find symbol modelRenderer.xRot = x;
  146. ^
  147. symbol: variable xRot
  148. location: variable modelRenderer of type net.minecraft.client.renderer.model.ModelRenderer
  149. C:\Users\Admin\MCreatorWorkspaces\eotug\src\main\java\net\mcreator\eotug\entity\renderer\FEQueenRenderer.java:98: error: cannot find symbol modelRenderer.yRot = y;
  150. ^
  151. symbol: variable yRot
  152. location: variable modelRenderer of type net.minecraft.client.renderer.model.ModelRenderer
  153. C:\Users\Admin\MCreatorWorkspaces\eotug\src\main\java\net\mcreator\eotug\entity\renderer\FEQueenRenderer.java:99: error: cannot find symbol modelRenderer.zRot = z;
  154. ^
  155. symbol: variable zRot
  156. location: variable modelRenderer of type net.minecraft.client.renderer.model.ModelRenderer
  157. 39 errors
  158. > Task :compileJava FAILED
  159. FAILURE: Build failed with an exception.
  160. * What went wrong:
  161. Execution failed for task ':compileJava'.
  162. > Compilation failed; see the compiler error output for details.
  163. * Try:
  164. Run with --stacktrace option to get the stack trace. Run with --info or --debug option to get more log output. Run with --scan to get full insights.
  165. * Get more help at https://help.gradle.org
  166. BUILD FAILED in 3s
  167. 1 actionable task: 1 executed
  168.  
  169. BUILD FAILED
  170. Task completed in 8 seconds
Advertisement
Add Comment
Please, Sign In to add comment
Advertisement