Guest User

12.04 monero error

a guest
May 13th, 2014
274
Never
Not a member of Pastebin yet? Sign Up, it unlocks many cool features!
  1. ~/bitmonero# sudo make -j $i
  2. mkdir -p build/release
  3. cd build/release && cmake -D CMAKE_BUILD_TYPE=Release ../..
  4. -- The C compiler identification is GNU
  5. -- The CXX compiler identification is GNU
  6. -- Check for working C compiler: /usr/bin/gcc
  7. -- Check for working C compiler: /usr/bin/gcc -- works
  8. -- Detecting C compiler ABI info
  9. -- Detecting C compiler ABI info - done
  10. -- Check for working CXX compiler: /usr/bin/c++
  11. -- Check for working CXX compiler: /usr/bin/c++ -- works
  12. -- Detecting CXX compiler ABI info
  13. -- Detecting CXX compiler ABI info - done
  14. -- Boost version: 1.55.0
  15. -- Found the following Boost libraries:
  16. -- system
  17. -- filesystem
  18. -- thread
  19. -- date_time
  20. -- chrono
  21. -- regex
  22. -- serialization
  23. -- atomic
  24. -- program_options
  25. -- Found Git: /usr/bin/git
  26. -- Found PythonInterp: /usr/bin/python (found version "2.7.3")
  27. -- Looking for include files CMAKE_HAVE_PTHREAD_H
  28. -- Looking for include files CMAKE_HAVE_PTHREAD_H - not found.
  29. -- Could NOT find Threads (missing: Threads_FOUND)
  30. -- Configuring done
  31. -- Generating done
  32. -- Build files have been written to: /root/bitmonero/build/release
  33. cd build/release && make
  34. make[1]: Entering directory `/root/bitmonero/build/release'
  35. make[2]: Entering directory `/root/bitmonero/build/release'
  36. make[3]: Entering directory `/root/bitmonero/build/release'
  37. make[3]: Entering directory `/root/bitmonero/build/release'
  38. make[3]: Entering directory `/root/bitmonero/build/release'
  39. make[3]: Entering directory `/root/bitmonero/build/release'
  40. make[3]: Entering directory `/root/bitmonero/build/release'
  41. make[3]: Entering directory `/root/bitmonero/build/release'
  42. make[3]: Entering directory `/root/bitmonero/build/release'
  43. Scanning dependencies of target crypto
  44. Scanning dependencies of target version
  45. make[3]: Entering directory `/root/bitmonero/build/release'
  46. Scanning dependencies of target common
  47. Scanning dependencies of target upnpc-static
  48. Scanning dependencies of target cryptonote_core
  49. make[3]: Leaving directory `/root/bitmonero/build/release'
  50. make[3]: Leaving directory `/root/bitmonero/build/release'
  51. Scanning dependencies of target gtest
  52. Scanning dependencies of target crypto-tests
  53. Scanning dependencies of target wallet
  54. make[3]: Entering directory `/root/bitmonero/build/release'
  55. make[3]: Leaving directory `/root/bitmonero/build/release'
  56. make[3]: Entering directory `/root/bitmonero/build/release'
  57. make[3]: Entering directory `/root/bitmonero/build/release'
  58. make[3]: Leaving directory `/root/bitmonero/build/release'
  59. make[3]: Leaving directory `/root/bitmonero/build/release'
  60. [ 1%] [ 2%] make[3]: Entering directory `/root/bitmonero/build/release'
  61. make[3]: Entering directory `/root/bitmonero/build/release'
  62. fatal: No names found, cannot describe anything.
  63. [ 3%] CMake Warning at src/version.cmake:3 (message):
  64. Cannot determine current revision. Make sure that you are building either
  65. from a Git working tree or from a source archive.
  66.  
  67.  
  68. [ 4%] [ 5%] [ 6%] make[3]: Leaving directory `/root/bitmonero/build/release'
  69. [ 7%] [ 8%] Building C object src/CMakeFiles/crypto.dir/crypto/jh.c.o
  70. Building C object src/CMakeFiles/crypto.dir/crypto/skein.c.o
  71. Building C object external/miniupnpc/CMakeFiles/upnpc-static.dir/igd_desc_parse.c.o
  72. [ 8%] Building C object external/miniupnpc/CMakeFiles/upnpc-static.dir/miniupnpc.c.o
  73. Building CXX object tests/gtest/CMakeFiles/gtest.dir/src/gtest-all.cc.o
  74. [ 9%] [ 10%] [ 11%] Building C object tests/CMakeFiles/crypto-tests.dir/crypto/crypto-ops.c.o
  75. Built target version
  76. [ 12%] Building CXX object tests/CMakeFiles/crypto-tests.dir/crypto/main.cpp.o
  77. make[3]: Entering directory `/root/bitmonero/build/release'
  78. cc1: error: -Werror=maybe-uninitialized: no option -Wmaybe-uninitialized
  79. cc1: error: unrecognized command line option ‘-std=c11’
  80. Building C object tests/CMakeFiles/crypto-tests.dir/crypto/random.c.o
  81. cc1: error: -Werror=maybe-uninitialized: no option -Wmaybe-uninitialized
  82. cc1: error: unrecognized command line option ‘-std=c11’
  83. cc1: error: -Werror=maybe-uninitialized: no option -Wmaybe-uninitialized
  84. cc1: error: unrecognized command line option ‘-std=c11’
  85. Building C object external/miniupnpc/CMakeFiles/upnpc-static.dir/minixml.c.o
  86. Scanning dependencies of target rpc
  87. Building C object src/CMakeFiles/crypto.dir/crypto/keccak.c.o
  88. cc1: error: -Werror=maybe-uninitialized: no option -Wmaybe-uninitialized
  89. cc1: error: unrecognized command line option ‘-std=c11’
  90. [ 13%] cc1: error: -Werror=maybe-uninitialized: no option -Wmaybe-uninitialized
  91. cc1: error: unrecognized command line option ‘-std=c11’
  92. make[3]: *** [src/CMakeFiles/crypto.dir/crypto/skein.c.o] Error 1
  93. [ 14%] make[3]: *** Waiting for unfinished jobs....
  94. make[3]: cc1plus: error: -Werror=maybe-uninitialized: no option -Wmaybe-uninitialized
  95. cc1plus: error: -Werror=maybe-uninitialized: no option -Wmaybe-uninitialized
  96. cc1plus: error: unrecognized command line option ‘-std=c++11’*** [src/CMakeFiles/crypto.dir/crypto/jh.c.o] Error 1
  97.  
  98. cc1plus: error: unrecognized command line option ‘-std=c++11’
  99. make[3]: *** [external/miniupnpc/CMakeFiles/upnpc-static.dir/igd_desc_parse.c.o] Error 1
  100. make[3]: *** Waiting for unfinished jobs....
  101. make[3]: *** [external/miniupnpc/CMakeFiles/upnpc-static.dir/miniupnpc.c.o] Error 1
  102. Building C object tests/CMakeFiles/crypto-tests.dir/crypto/hash.c.o
  103. cc1plus: error: -Werror=maybe-uninitialized: no option -Wmaybe-uninitialized
  104. cc1plus: error: unrecognized command line option ‘-std=c++11’
  105. Building C object external/miniupnpc/CMakeFiles/upnpc-static.dir/minisoap.c.o
  106. cc1: error: -Werror=maybe-uninitialized: no option -Wmaybe-uninitializedmake[3]: *** [tests/CMakeFiles/crypto-tests.dir/crypto/crypto-ops.c.o] Error 1
  107. make[3]: *** Waiting for unfinished jobs....
  108.  
  109. cc1: error: unrecognized command line option ‘-std=c11’
  110. make[3]: *** [tests/gtest/CMakeFiles/gtest.dir/src/gtest-all.cc.o] Error 1
  111. make[3]: Leaving directory `/root/bitmonero/build/release'
  112. make[2]: *** [tests/gtest/CMakeFiles/gtest.dir/all] Error 2
  113. make[2]: *** Waiting for unfinished jobs....
  114. make[3]: *** [tests/CMakeFiles/crypto-tests.dir/crypto/main.cpp.o] Error 1cc1: error: -Werror=maybe-uninitialized: no option -Wmaybe-uninitialized
  115. cc1: error: unrecognized command line option ‘-std=c11’
  116.  
  117. Building C object src/CMakeFiles/crypto.dir/crypto/hash-extra-jh.c.o
  118. make[3]: *** [external/miniupnpc/CMakeFiles/upnpc-static.dir/minixml.c.o] Error 1
  119. cc1: error: -Werror=maybe-uninitialized: no option -Wmaybe-uninitializedmake[3]: *** [src/CMakeFiles/crypto.dir/crypto/keccak.c.o] Error 1
  120.  
  121. cc1: error: unrecognized command line option ‘-std=c11’
  122. Building C object external/miniupnpc/CMakeFiles/upnpc-static.dir/miniwget.c.o
  123. cc1: error: -Werror=maybe-uninitialized: no option -Wmaybe-uninitialized
  124. cc1: error: unrecognized command line option ‘-std=c11’
  125. make[3]: *** [tests/CMakeFiles/crypto-tests.dir/crypto/random.c.o] Error 1
  126. cc1: error: -Werror=maybe-uninitialized: no option -Wmaybe-uninitialized
  127. cc1: error: unrecognized command line option ‘-std=c11’
  128. cc1: error: -Werror=maybe-uninitialized: no option -Wmaybe-uninitialized
  129. cc1: error: unrecognized command line option ‘-std=c11’
  130. make[3]: *** [external/miniupnpc/CMakeFiles/upnpc-static.dir/minisoap.c.o] Error 1
  131. make[3]: *** [tests/CMakeFiles/crypto-tests.dir/crypto/hash.c.o] Error 1
  132. make[3]: Leaving directory `/root/bitmonero/build/release'
  133. make[2]: *** [tests/CMakeFiles/crypto-tests.dir/all] Error 2
  134. make[3]: *** [src/CMakeFiles/crypto.dir/crypto/hash-extra-jh.c.o] Error 1
  135. make[3]: Leaving directory `/root/bitmonero/build/release'
  136. make[2]: *** [src/CMakeFiles/crypto.dir/all] Error 2
  137. cc1: error: -Werror=maybe-uninitialized: no option -Wmaybe-uninitialized
  138. cc1: error: unrecognized command line option ‘-std=c11’
  139. make[3]: *** [external/miniupnpc/CMakeFiles/upnpc-static.dir/miniwget.c.o] Error 1
  140. make[3]: Leaving directory `/root/bitmonero/build/release'
  141. make[2]: *** [external/miniupnpc/CMakeFiles/upnpc-static.dir/all] Error 2
  142. make[3]: Leaving directory `/root/bitmonero/build/release'
  143. make[3]: Leaving directory `/root/bitmonero/build/release'
  144. make[3]: Entering directory `/root/bitmonero/build/release'
  145. [ 15%] [ 16%] [ 17%] Building CXX object src/CMakeFiles/common.dir/common/util.cpp.o
  146. Building CXX object src/CMakeFiles/common.dir/common/base58.cpp.o
  147. Building CXX object src/CMakeFiles/common.dir/common/command_line.cpp.o
  148. make[3]: Leaving directory `/root/bitmonero/build/release'
  149. cc1plus: error: -Werror=maybe-uninitialized: no option -Wmaybe-uninitialized
  150. cc1plus: error: unrecognized command line option ‘-std=c++11’
  151. cc1plus: error: -Werror=maybe-uninitialized: no option -Wmaybe-uninitialized
  152. cc1plus: error: unrecognized command line option ‘-std=c++11’
  153. cc1plus: error: -Werror=maybe-uninitialized: no option -Wmaybe-uninitialized
  154. cc1plus: error: unrecognized command line option ‘-std=c++11’
  155. make[3]: *** [src/CMakeFiles/common.dir/common/util.cpp.o] Error 1
  156. make[3]: *** Waiting for unfinished jobs....
  157. make[3]: *** [src/CMakeFiles/common.dir/common/base58.cpp.o] Error 1
  158. make[3]: *** [src/CMakeFiles/common.dir/common/command_line.cpp.o] Error 1
  159. make[3]: Leaving directory `/root/bitmonero/build/release'
  160. make[3]: Entering directory `/root/bitmonero/build/release'
  161. make[2]: *** [src/CMakeFiles/common.dir/all] Error 2
  162. [ 18%] [ 20%] Building CXX object src/CMakeFiles/wallet.dir/wallet/wallet2.cpp.o
  163. Building CXX object src/CMakeFiles/wallet.dir/wallet/wallet_rpc_server.cpp.o
  164. cc1plus: error: -Werror=maybe-uninitialized: no option -Wmaybe-uninitialized
  165. cc1plus: error: unrecognized command line option ‘-std=c++11’
  166. cc1plus: error: -Werror=maybe-uninitialized: no option -Wmaybe-uninitialized
  167. cc1plus: error: unrecognized command line option ‘-std=c++11’
  168. make[3]: *** [src/CMakeFiles/wallet.dir/wallet/wallet2.cpp.o] Error 1
  169. make[3]: *** Waiting for unfinished jobs....
  170. make[3]: *** [src/CMakeFiles/wallet.dir/wallet/wallet_rpc_server.cpp.o] Error 1
  171. make[3]: Leaving directory `/root/bitmonero/build/release'
  172. make[2]: *** [src/CMakeFiles/wallet.dir/all] Error 2
  173. make[3]: Entering directory `/root/bitmonero/build/release'
  174. [ 21%] Building CXX object src/CMakeFiles/rpc.dir/rpc/core_rpc_server.cpp.o
  175. cc1plus: error: -Werror=maybe-uninitialized: no option -Wmaybe-uninitialized
  176. cc1plus: error: unrecognized command line option ‘-std=c++11’
  177. make[3]: *** [src/CMakeFiles/rpc.dir/rpc/core_rpc_server.cpp.o] Error 1
  178. make[3]: Leaving directory `/root/bitmonero/build/release'
  179. make[2]: *** [src/CMakeFiles/rpc.dir/all] Error 2
  180. make[3]: Leaving directory `/root/bitmonero/build/release'
  181. make[3]: Entering directory `/root/bitmonero/build/release'
  182. [ 22%] [ 23%] [ 24%] Building CXX object src/CMakeFiles/cryptonote_core.dir/cryptonote_core/checkpoints.cpp.o
  183. [ 25%] Building CXX object src/CMakeFiles/cryptonote_core.dir/cryptonote_core/cryptonote_basic_impl.cpp.o
  184. [ 26%] Building CXX object src/CMakeFiles/cryptonote_core.dir/cryptonote_core/cryptonote_format_utils.cpp.o
  185. Building CXX object src/CMakeFiles/cryptonote_core.dir/cryptonote_core/account.cpp.o
  186. cc1plus: error: -Werror=maybe-uninitialized: no option -Wmaybe-uninitialized
  187. cc1plus: error: unrecognized command line option ‘-std=c++11’
  188. make[3]: *** [src/CMakeFiles/cryptonote_core.dir/cryptonote_core/checkpoints.cpp.o] Error 1
  189. make[3]: *** Waiting for unfinished jobs....
  190. cc1plus: error: -Werror=maybe-uninitialized: no option -Wmaybe-uninitialized
  191. cc1plus: error: unrecognized command line option ‘-std=c++11’
  192. Building CXX object src/CMakeFiles/cryptonote_core.dir/cryptonote_core/tx_pool.cpp.o
  193. cc1plus: error: -Werror=maybe-uninitialized: no option -Wmaybe-uninitialized
  194. cc1plus: error: unrecognized command line option ‘-std=c++11’
  195. make[3]: *** [src/CMakeFiles/cryptonote_core.dir/cryptonote_core/cryptonote_basic_impl.cpp.o] Error 1
  196. cc1plus: error: -Werror=maybe-uninitialized: no option -Wmaybe-uninitialized
  197. cc1plus: error: unrecognized command line option ‘-std=c++11’
  198. make[3]: *** [src/CMakeFiles/cryptonote_core.dir/cryptonote_core/cryptonote_format_utils.cpp.o] Error 1
  199. make[3]: *** [src/CMakeFiles/cryptonote_core.dir/cryptonote_core/account.cpp.o] Error 1
  200. cc1plus: error: -Werror=maybe-uninitialized: no option -Wmaybe-uninitialized
  201. cc1plus: error: unrecognized command line option ‘-std=c++11’
  202. make[3]: *** [src/CMakeFiles/cryptonote_core.dir/cryptonote_core/tx_pool.cpp.o] Error 1
  203. make[3]: Leaving directory `/root/bitmonero/build/release'
  204. make[2]: *** [src/CMakeFiles/cryptonote_core.dir/all] Error 2
  205. make[2]: Leaving directory `/root/bitmonero/build/release'
  206. make[1]: *** [all] Error 2
  207. make[1]: Leaving directory `/root/bitmonero/build/release'
  208. make: *** [build-release] Error 2
RAW Paste Data