SHARE
TWEET

Untitled

a guest Mar 24th, 2019 91 Never
Not a member of Pastebin yet? Sign Up, it unlocks many cool features!
  1. Running tests...
  2. Test project /home/builder/nss_wrapper/src/build
  3.     Start 1: testsuite
  4. 1/8 Test #1: testsuite ........................   Passed    0.00 sec
  5.     Start 2: test_nwrap_vector
  6. 2/8 Test #2: test_nwrap_vector ................   Passed    0.00 sec
  7.     Start 3: test_getaddrinfo
  8. 3/8 Test #3: test_getaddrinfo .................***Exception: SegFault  0.15 sec
  9. [==========] Running 13 test(s).
  10. [ RUN      ] test_nwrap_getaddrinfo
  11. [       OK ] test_nwrap_getaddrinfo
  12. [ RUN      ] test_nwrap_getaddrinfo_reload
  13. [  ERROR   ] --- Test failed with exception: Segmentation fault(11)
  14. [  FAILED  ] test_nwrap_getaddrinfo_reload
  15. [ RUN      ] test_nwrap_getaddrinfo_any
  16. [       OK ] test_nwrap_getaddrinfo_any
  17. [ RUN      ] test_nwrap_getaddrinfo_local
  18. [       OK ] test_nwrap_getaddrinfo_local
  19. [ RUN      ] test_nwrap_getaddrinfo_name
  20. [  ERROR   ] --- "48.154.210.67" != "127.0.0.12"
  21. [   LINE   ] --- /home/builder/nss_wrapper/src/nss_wrapper-1.1.5/tests/test_getaddrinfo.c:323: error: Failure!
  22. [  FAILED  ] test_nwrap_getaddrinfo_name
  23. [ RUN      ] test_nwrap_getaddrinfo_service
  24. [  ERROR   ] --- 0xfffffffffffffffa != 0
  25. [   LINE   ] --- /home/builder/nss_wrapper/src/nss_wrapper-1.1.5/tests/test_getaddrinfo.c:373: error: Failure!
  26. [  FAILED  ] test_nwrap_getaddrinfo_service
  27. [ RUN      ] test_nwrap_getaddrinfo_null
  28. [  ERROR   ] --- res
  29. [   LINE   ] --- /home/builder/nss_wrapper/src/nss_wrapper-1.1.5/tests/test_getaddrinfo.c:433: error: Failure!
  30. [  FAILED  ] test_nwrap_getaddrinfo_null
  31. [ RUN      ] test_nwrap_getaddrinfo_dot
  32. [  ERROR   ] --- "0.27.175.190" != "127.0.0.11"
  33. [   LINE   ] --- /home/builder/nss_wrapper/src/nss_wrapper-1.1.5/tests/test_getaddrinfo.c:465: error: Failure!
  34. [  FAILED  ] test_nwrap_getaddrinfo_dot
  35. [ RUN      ] test_nwrap_getaddrinfo_ipv6
  36. [  ERROR   ] --- "1b:afbe:8e7f::" != "::14"
  37. [   LINE   ] --- /home/builder/nss_wrapper/src/nss_wrapper-1.1.5/tests/test_getaddrinfo.c:498: error: Failure!
  38. [  FAILED  ] test_nwrap_getaddrinfo_ipv6
  39. [ RUN      ] test_nwrap_getaddrinfo_multiple_mixed
  40. [  ERROR   ] --- Test failed with exception: Segmentation fault(11)
  41. [  FAILED  ] test_nwrap_getaddrinfo_multiple_mixed
  42. [ RUN      ] test_nwrap_getaddrinfo_flags_ai_numericserv
  43. [  ERROR   ] --- 0xfffffffffffffffa != 0
  44. [   LINE   ] --- /home/builder/nss_wrapper/src/nss_wrapper-1.1.5/tests/test_getaddrinfo.c:623: error: Failure!
  45. [  FAILED  ] test_nwrap_getaddrinfo_flags_ai_numericserv
  46. [ RUN      ] test_nwrap_getaddrinfo_flags_ai_numerichost
  47. [       OK ] test_nwrap_getaddrinfo_flags_ai_numerichost
  48. [ RUN      ] test_nwrap_getaddrinfo_samba
  49. [  ERROR   ] --- Test failed with exception: Segmentation fault(11)
  50. [  FAILED  ] test_nwrap_getaddrinfo_samba
  51. [==========] 13 test(s) run.
  52. [  PASSED  ] 4 test(s).
  53. [  FAILED  ] 9 test(s), listed below:
  54. [  FAILED  ] test_nwrap_getaddrinfo_reload
  55. [  FAILED  ] test_nwrap_getaddrinfo_name
  56. [  FAILED  ] test_nwrap_getaddrinfo_service
  57. [  FAILED  ] test_nwrap_getaddrinfo_null
  58. [  FAILED  ] test_nwrap_getaddrinfo_dot
  59. [  FAILED  ] test_nwrap_getaddrinfo_ipv6
  60. [  FAILED  ] test_nwrap_getaddrinfo_multiple_mixed
  61. [  FAILED  ] test_nwrap_getaddrinfo_flags_ai_numericserv
  62. [  FAILED  ] test_nwrap_getaddrinfo_samba
  63.  
  64.  9 FAILED TEST(S)
  65.  
  66.     Start 4: test_getnameinfo
  67. 4/8 Test #4: test_getnameinfo .................   Passed    0.00 sec
  68.     Start 5: test_gethostby_name_addr
  69. 5/8 Test #5: test_gethostby_name_addr .........   Passed    0.01 sec
  70.     Start 6: test_gethostent
  71. 6/8 Test #6: test_gethostent ..................   Passed    0.01 sec
  72.     Start 7: test_shadow
  73. 7/8 Test #7: test_shadow ......................   Passed    0.05 sec
  74.     Start 8: test_nwrap_disabled
  75. 8/8 Test #8: test_nwrap_disabled ..............   Passed    0.00 sec
  76.  
  77. 88% tests passed, 1 tests failed out of 8
  78.  
  79. Total Test time (real) =   0.25 sec
  80.  
  81. The following tests FAILED:
  82.           3 - test_getaddrinfo (SEGFAULT)
  83. Errors while running CTest
  84. make: *** [Makefile:141: test] Error 8
RAW Paste Data
We use cookies for various purposes including analytics. By continuing to use Pastebin, you agree to our use of cookies as described in the Cookies Policy. OK, I Understand
Not a member of Pastebin yet?
Sign Up, it unlocks many cool features!
 
Top