anupkini

e-gcc compile error

Apr 9th, 2013
199
0
Never
Not a member of Pastebin yet? Sign Up, it unlocks many cool features!
text 5.19 KB | None | 0 0
  1. make[3]: Entering directory `/home/linaro/epiphany-gcc/host-armv7l-unknown-linux-gnueabihf/gcc'
  2. /bin/bash ../.././gcc/../mkinstalldirs po
  3. : --statistics -o po/be.gmo ../.././gcc/po/be.po
  4. /bin/bash ../.././gcc/../mkinstalldirs po
  5. : --statistics -o po/da.gmo ../.././gcc/po/da.po
  6. /bin/bash ../.././gcc/../mkinstalldirs po
  7. : --statistics -o po/de.gmo ../.././gcc/po/de.po
  8. /bin/bash ../.././gcc/../mkinstalldirs po
  9. : --statistics -o po/el.gmo ../.././gcc/po/el.po
  10. /bin/bash ../.././gcc/../mkinstalldirs po
  11. : --statistics -o po/es.gmo ../.././gcc/po/es.po
  12. /bin/bash ../.././gcc/../mkinstalldirs po
  13. : --statistics -o po/fi.gmo ../.././gcc/po/fi.po
  14. /bin/bash ../.././gcc/../mkinstalldirs po
  15. : --statistics -o po/fr.gmo ../.././gcc/po/fr.po
  16. /bin/bash ../.././gcc/../mkinstalldirs po
  17. : --statistics -o po/id.gmo ../.././gcc/po/id.po
  18. /bin/bash ../.././gcc/../mkinstalldirs po
  19. : --statistics -o po/ja.gmo ../.././gcc/po/ja.po
  20. /bin/bash ../.././gcc/../mkinstalldirs po
  21. : --statistics -o po/nl.gmo ../.././gcc/po/nl.po
  22. /bin/bash ../.././gcc/../mkinstalldirs po
  23. : --statistics -o po/ru.gmo ../.././gcc/po/ru.po
  24. /bin/bash ../.././gcc/../mkinstalldirs po
  25. : --statistics -o po/sr.gmo ../.././gcc/po/sr.po
  26. /bin/bash ../.././gcc/../mkinstalldirs po
  27. : --statistics -o po/sv.gmo ../.././gcc/po/sv.po
  28. /bin/bash ../.././gcc/../mkinstalldirs po
  29. : --statistics -o po/tr.gmo ../.././gcc/po/tr.po
  30. /bin/bash ../.././gcc/../mkinstalldirs po
  31. : --statistics -o po/vi.gmo ../.././gcc/po/vi.po
  32. /bin/bash ../.././gcc/../mkinstalldirs po
  33. : --statistics -o po/zh_CN.gmo ../.././gcc/po/zh_CN.po
  34. /bin/bash ../.././gcc/../mkinstalldirs po
  35. : --statistics -o po/zh_TW.gmo ../.././gcc/po/zh_TW.po
  36. gcc -g -fkeep-inline-functions -DIN_GCC -W -Wall -Wwrite-strings -Wcast-qual -Wstrict-prototypes -Wmissing-prototypes -Wmissing-format-attribute -pedantic -Wno-long-long -Wno-variadic-macros -Wno-overlength-strings -Wold-style-definition -Wc++-compat -fno-common -DHAVE_CONFIG_H -DGENERATOR_FILE -o build/gengtype \
  37. build/gengtype.o build/errors.o build/gengtype-lex.o build/gengtype-parse.o build/gengtype-state.o build/version.o ../../build-armv7l-unknown-linux-gnueabihf/libiberty/libiberty.a
  38. build/gengtype.o: In function `create_optional_field_':
  39. /home/linaro/epiphany-gcc/host-armv7l-unknown-linux-gnueabihf/gcc/../.././gcc/gengtype.c:853: undefined reference to `lexer_line'
  40. /home/linaro/epiphany-gcc/host-armv7l-unknown-linux-gnueabihf/gcc/../.././gcc/gengtype.c:853: undefined reference to `lexer_line'
  41. build/gengtype.o: In function `adjust_field_rtx_def':
  42. /home/linaro/epiphany-gcc/host-armv7l-unknown-linux-gnueabihf/gcc/../.././gcc/gengtype.c:989: undefined reference to `lexer_line'
  43. /home/linaro/epiphany-gcc/host-armv7l-unknown-linux-gnueabihf/gcc/../.././gcc/gengtype.c:989: undefined reference to `lexer_line'
  44. /home/linaro/epiphany-gcc/host-armv7l-unknown-linux-gnueabihf/gcc/../.././gcc/gengtype.c:1045: undefined reference to `lexer_line'
  45. build/gengtype.o:/home/linaro/epiphany-gcc/host-armv7l-unknown-linux-gnueabihf/gcc/../.././gcc/gengtype.c:1045: more undefined references to `lexer_line' follow
  46. build/gengtype-parse.o: In function `token':
  47. /home/linaro/epiphany-gcc/host-armv7l-unknown-linux-gnueabihf/gcc/../.././gcc/gengtype-parse.c:53: undefined reference to `yylex'
  48. build/gengtype-parse.o: In function `parse_error':
  49. /home/linaro/epiphany-gcc/host-armv7l-unknown-linux-gnueabihf/gcc/../.././gcc/gengtype-parse.c:142: undefined reference to `lexer_line'
  50. /home/linaro/epiphany-gcc/host-armv7l-unknown-linux-gnueabihf/gcc/../.././gcc/gengtype-parse.c:142: undefined reference to `lexer_line'
  51. /home/linaro/epiphany-gcc/host-armv7l-unknown-linux-gnueabihf/gcc/../.././gcc/gengtype-parse.c:142: undefined reference to `lexer_line'
  52. /home/linaro/epiphany-gcc/host-armv7l-unknown-linux-gnueabihf/gcc/../.././gcc/gengtype-parse.c:142: undefined reference to `lexer_line'
  53. build/gengtype-parse.o: In function `struct_field_seq':
  54. /home/linaro/epiphany-gcc/host-armv7l-unknown-linux-gnueabihf/gcc/../.././gcc/gengtype-parse.c:692: undefined reference to `lexer_line'
  55. build/gengtype-parse.o:/home/linaro/epiphany-gcc/host-armv7l-unknown-linux-gnueabihf/gcc/../.././gcc/gengtype-parse.c:692: more undefined references to `lexer_line' follow
  56. build/gengtype-parse.o: In function `parse_file':
  57. /home/linaro/epiphany-gcc/host-armv7l-unknown-linux-gnueabihf/gcc/../.././gcc/gengtype-parse.c:951: undefined reference to `yybegin'
  58. /home/linaro/epiphany-gcc/host-armv7l-unknown-linux-gnueabihf/gcc/../.././gcc/gengtype-parse.c:986: undefined reference to `lexer_toplevel_done'
  59. /home/linaro/epiphany-gcc/host-armv7l-unknown-linux-gnueabihf/gcc/../.././gcc/gengtype-parse.c:986: undefined reference to `lexer_toplevel_done'
  60. /home/linaro/epiphany-gcc/host-armv7l-unknown-linux-gnueabihf/gcc/../.././gcc/gengtype-parse.c:991: undefined reference to `yyend'
  61. collect2: ld returned 1 exit status
  62. make[3]: *** [build/gengtype] Error 1
  63. make[3]: Leaving directory `/home/linaro/epiphany-gcc/host-armv7l-unknown-linux-gnueabihf/gcc'
  64. make[2]: *** [all-stage1-gcc] Error 2
  65. make[2]: Leaving directory `/home/linaro/epiphany-gcc'
  66. make[1]: *** [stage1-bubble] Error 2
  67. make[1]: Leaving directory `/home/linaro/epiphany-gcc'
  68. make: *** [all] Error 2
  69. linaro@linaro-ubuntu-desktop:~/epiphany-gcc$
Advertisement
Add Comment
Please, Sign In to add comment