SHARE
TWEET

dpkg-buildpackage: fallo:

maulican Feb 2nd, 2015 289 Never
Not a member of Pastebin yet? Sign Up, it unlocks many cool features!
  1. javier@javier-Inspiron-5537:/tmp/unity/unity-7.2.3+14.04.20140826$ dpkg-buildpackage -us -uc -nc
  2. dpkg-buildpackage: paquete fuente unity
  3. dpkg-buildpackage: versión de las fuentes 7.2.3+14.04.20140826-0ubuntu1
  4. dpkg-buildpackage: source distribution trusty
  5. dpkg-buildpackage: fuentes modificadas por Ubuntu daily release <ps-jenkins@lists.canonical.com>
  6. dpkg-buildpackage: arquitectura del sistema i386
  7.  dpkg-source --before-build unity-7.2.3+14.04.20140826
  8.  debian/rules build
  9. dh build --with translations,quilt,python2,migrations --parallel
  10.    dh_auto_build -O--parallel
  11. make[1]: se ingresa al directorio «/tmp/unity/unity-7.2.3+14.04.20140826/obj-i686-linux-gnu»
  12. /usr/bin/cmake -H/tmp/unity/unity-7.2.3+14.04.20140826 -B/tmp/unity/unity-7.2.3+14.04.20140826/obj-i686-linux-gnu --check-build-system CMakeFiles/Makefile.cmake 0
  13. /usr/bin/cmake -E cmake_progress_start /tmp/unity/unity-7.2.3+14.04.20140826/obj-i686-linux-gnu/CMakeFiles /tmp/unity/unity-7.2.3+14.04.20140826/obj-i686-linux-gnu/CMakeFiles/progress.marks
  14. make -f CMakeFiles/Makefile2 all
  15. make[2]: se ingresa al directorio «/tmp/unity/unity-7.2.3+14.04.20140826/obj-i686-linux-gnu»
  16. make -f CMakeFiles/translations_1.dir/build.make CMakeFiles/translations_1.dir/depend
  17. make[3]: se ingresa al directorio «/tmp/unity/unity-7.2.3+14.04.20140826/obj-i686-linux-gnu»
  18. cd /tmp/unity/unity-7.2.3+14.04.20140826/obj-i686-linux-gnu && /usr/bin/cmake -E cmake_depends "Unix Makefiles" /tmp/unity/unity-7.2.3+14.04.20140826 /tmp/unity/unity-7.2.3+14.04.20140826 /tmp/unity/unity-7.2.3+14.04.20140826/obj-i686-linux-gnu /tmp/unity/unity-7.2.3+14.04.20140826/obj-i686-linux-gnu /tmp/unity/unity-7.2.3+14.04.20140826/obj-i686-linux-gnu/CMakeFiles/translations_1.dir/DependInfo.cmake --color=
  19. make[3]: se sale del directorio «/tmp/unity/unity-7.2.3+14.04.20140826/obj-i686-linux-gnu»
  20. make -f CMakeFiles/translations_1.dir/build.make CMakeFiles/translations_1.dir/build
  21. make[3]: se ingresa al directorio «/tmp/unity/unity-7.2.3+14.04.20140826/obj-i686-linux-gnu»
  22. make[3]: No se hace nada para «CMakeFiles/translations_1.dir/build».
  23. make[3]: se sale del directorio «/tmp/unity/unity-7.2.3+14.04.20140826/obj-i686-linux-gnu»
  24. /usr/bin/cmake -E cmake_progress_report /tmp/unity/unity-7.2.3+14.04.20140826/obj-i686-linux-gnu/CMakeFiles  65 66 67 68 69
  25. [ 12%] Built target translations_1
  26. make -f UnityCore/CMakeFiles/unity-core-6.0_pch.dir/build.make UnityCore/CMakeFiles/unity-core-6.0_pch.dir/depend
  27. make[3]: se ingresa al directorio «/tmp/unity/unity-7.2.3+14.04.20140826/obj-i686-linux-gnu»
  28. cd /tmp/unity/unity-7.2.3+14.04.20140826/obj-i686-linux-gnu && /usr/bin/cmake -E cmake_depends "Unix Makefiles" /tmp/unity/unity-7.2.3+14.04.20140826 /tmp/unity/unity-7.2.3+14.04.20140826/UnityCore /tmp/unity/unity-7.2.3+14.04.20140826/obj-i686-linux-gnu /tmp/unity/unity-7.2.3+14.04.20140826/obj-i686-linux-gnu/UnityCore /tmp/unity/unity-7.2.3+14.04.20140826/obj-i686-linux-gnu/UnityCore/CMakeFiles/unity-core-6.0_pch.dir/DependInfo.cmake --color=
  29. make[3]: se sale del directorio «/tmp/unity/unity-7.2.3+14.04.20140826/obj-i686-linux-gnu»
  30. make -f UnityCore/CMakeFiles/unity-core-6.0_pch.dir/build.make UnityCore/CMakeFiles/unity-core-6.0_pch.dir/build
  31. make[3]: se ingresa al directorio «/tmp/unity/unity-7.2.3+14.04.20140826/obj-i686-linux-gnu»
  32. make[3]: No se hace nada para «UnityCore/CMakeFiles/unity-core-6.0_pch.dir/build».
  33. make[3]: se sale del directorio «/tmp/unity/unity-7.2.3+14.04.20140826/obj-i686-linux-gnu»
  34. /usr/bin/cmake -E cmake_progress_report /tmp/unity/unity-7.2.3+14.04.20140826/obj-i686-linux-gnu/CMakeFiles
  35. [ 12%] Built target unity-core-6.0_pch
  36. make -f UnityCore/CMakeFiles/unity-core-6.0.dir/build.make UnityCore/CMakeFiles/unity-core-6.0.dir/depend
  37. make[3]: se ingresa al directorio «/tmp/unity/unity-7.2.3+14.04.20140826/obj-i686-linux-gnu»
  38. cd /tmp/unity/unity-7.2.3+14.04.20140826/obj-i686-linux-gnu && /usr/bin/cmake -E cmake_depends "Unix Makefiles" /tmp/unity/unity-7.2.3+14.04.20140826 /tmp/unity/unity-7.2.3+14.04.20140826/UnityCore /tmp/unity/unity-7.2.3+14.04.20140826/obj-i686-linux-gnu /tmp/unity/unity-7.2.3+14.04.20140826/obj-i686-linux-gnu/UnityCore /tmp/unity/unity-7.2.3+14.04.20140826/obj-i686-linux-gnu/UnityCore/CMakeFiles/unity-core-6.0.dir/DependInfo.cmake --color=
  39. make[3]: se sale del directorio «/tmp/unity/unity-7.2.3+14.04.20140826/obj-i686-linux-gnu»
  40. make -f UnityCore/CMakeFiles/unity-core-6.0.dir/build.make UnityCore/CMakeFiles/unity-core-6.0.dir/build
  41. make[3]: se ingresa al directorio «/tmp/unity/unity-7.2.3+14.04.20140826/obj-i686-linux-gnu»
  42. make[3]: No se hace nada para «UnityCore/CMakeFiles/unity-core-6.0.dir/build».
  43. make[3]: se sale del directorio «/tmp/unity/unity-7.2.3+14.04.20140826/obj-i686-linux-gnu»
  44. /usr/bin/cmake -E cmake_progress_report /tmp/unity/unity-7.2.3+14.04.20140826/obj-i686-linux-gnu/CMakeFiles  70 71 72 73 74 75 76
  45. [ 12%] Built target unity-core-6.0
  46. make -f unity-shared/CMakeFiles/unity-shared_pch.dir/build.make unity-shared/CMakeFiles/unity-shared_pch.dir/depend
  47. make[3]: se ingresa al directorio «/tmp/unity/unity-7.2.3+14.04.20140826/obj-i686-linux-gnu»
  48. cd /tmp/unity/unity-7.2.3+14.04.20140826/obj-i686-linux-gnu && /usr/bin/cmake -E cmake_depends "Unix Makefiles" /tmp/unity/unity-7.2.3+14.04.20140826 /tmp/unity/unity-7.2.3+14.04.20140826/unity-shared /tmp/unity/unity-7.2.3+14.04.20140826/obj-i686-linux-gnu /tmp/unity/unity-7.2.3+14.04.20140826/obj-i686-linux-gnu/unity-shared /tmp/unity/unity-7.2.3+14.04.20140826/obj-i686-linux-gnu/unity-shared/CMakeFiles/unity-shared_pch.dir/DependInfo.cmake --color=
  49. make[3]: se sale del directorio «/tmp/unity/unity-7.2.3+14.04.20140826/obj-i686-linux-gnu»
  50. make -f unity-shared/CMakeFiles/unity-shared_pch.dir/build.make unity-shared/CMakeFiles/unity-shared_pch.dir/build
  51. make[3]: se ingresa al directorio «/tmp/unity/unity-7.2.3+14.04.20140826/obj-i686-linux-gnu»
  52. make[3]: No se hace nada para «unity-shared/CMakeFiles/unity-shared_pch.dir/build».
  53. make[3]: se sale del directorio «/tmp/unity/unity-7.2.3+14.04.20140826/obj-i686-linux-gnu»
  54. /usr/bin/cmake -E cmake_progress_report /tmp/unity/unity-7.2.3+14.04.20140826/obj-i686-linux-gnu/CMakeFiles
  55. [ 12%] Built target unity-shared_pch
  56. make -f unity-shared/CMakeFiles/unity-shared.dir/build.make unity-shared/CMakeFiles/unity-shared.dir/depend
  57. make[3]: se ingresa al directorio «/tmp/unity/unity-7.2.3+14.04.20140826/obj-i686-linux-gnu»
  58. cd /tmp/unity/unity-7.2.3+14.04.20140826/obj-i686-linux-gnu && /usr/bin/cmake -E cmake_depends "Unix Makefiles" /tmp/unity/unity-7.2.3+14.04.20140826 /tmp/unity/unity-7.2.3+14.04.20140826/unity-shared /tmp/unity/unity-7.2.3+14.04.20140826/obj-i686-linux-gnu /tmp/unity/unity-7.2.3+14.04.20140826/obj-i686-linux-gnu/unity-shared /tmp/unity/unity-7.2.3+14.04.20140826/obj-i686-linux-gnu/unity-shared/CMakeFiles/unity-shared.dir/DependInfo.cmake --color=
  59. make[3]: se sale del directorio «/tmp/unity/unity-7.2.3+14.04.20140826/obj-i686-linux-gnu»
  60. make -f unity-shared/CMakeFiles/unity-shared.dir/build.make unity-shared/CMakeFiles/unity-shared.dir/build
  61. make[3]: se ingresa al directorio «/tmp/unity/unity-7.2.3+14.04.20140826/obj-i686-linux-gnu»
  62. /usr/bin/cmake -E cmake_progress_report /tmp/unity/unity-7.2.3+14.04.20140826/obj-i686-linux-gnu/CMakeFiles
  63. [ 12%] Building CXX object unity-shared/CMakeFiles/unity-shared.dir/DecorationStyle.cpp.o
  64. cd /tmp/unity/unity-7.2.3+14.04.20140826/obj-i686-linux-gnu/unity-shared && /usr/bin/i686-linux-gnu-g++   -DUSE_X11 -g -O2 -fstack-protector --param=ssp-buffer-size=4 -Wformat -Werror=format-security -O2 -D_FORTIFY_SOURCE=2  -DGNOME_DESKTOP_USE_UNSTABLE_API -std=c++0x -fno-permissive -Werror -Wall -Wcast-align -Wempty-body -Wformat-security -Winit-self -Warray-bounds -Wno-error=unused-local-typedefs -pthread -DGLEW_MX -I/usr/include/unity/unity -I/usr/include/glib-2.0 -I/usr/lib/i386-linux-gnu/glib-2.0/include -I/usr/include/dee-1.0 -I/usr/include/gio-unix-2.0/ -I/usr/include/atk-1.0 -I/usr/include/at-spi2-atk/2.0 -I/usr/include/cairo -I/usr/include/pixman-1 -I/usr/include/freetype2 -I/usr/include/libpng12 -I/usr/include/libdbusmenu-glib-0.4 -I/usr/include/gtk-3.0 -I/usr/include/pango-1.0 -I/usr/include/gdk-pixbuf-2.0 -I/usr/include/harfbuzz -I/usr/include/libindicator3-0.4 -I/usr/include/json-glib-1.0 -I/usr/include/libbamf3 -I/usr/lib/i386-linux-gnu/libbamf3/include -I/usr/include/startup-notification-1.0 -I/usr/include/Nux-4.0 -I/usr/include/GL -I/usr/include/sigc++-2.0 -I/usr/lib/i386-linux-gnu/sigc++-2.0/include -I/usr/include/libdrm -I/usr/include/unity-misc -I/usr/include/zeitgeist-2.0 -I/usr/include/libxml2 -I/usr/include/glibmm-2.4 -I/usr/lib/i386-linux-gnu/glibmm-2.4/include -I/usr/include/gnome-desktop-3.0 -I/usr/include/compiz -I/usr/include/gsettings-desktop-schemas -pthread -DGLEW_MX -I/tmp/unity/unity-7.2.3+14.04.20140826/unity-shared/.. -I/tmp/unity/unity-7.2.3+14.04.20140826/unity-shared/../services -I/tmp/unity/unity-7.2.3+14.04.20140826/unity-shared/../UnityCore -I/tmp/unity/unity-7.2.3+14.04.20140826/unity-shared/../plugins/unityshell/src -I/tmp/unity/unity-7.2.3+14.04.20140826/obj-i686-linux-gnu -I/tmp/unity/unity-7.2.3+14.04.20140826/obj-i686-linux-gnu/unity-shared     -include unity-shared_pch.hh  -fpch-preprocess  -Winvalid-pch  -o CMakeFiles/unity-shared.dir/DecorationStyle.cpp.o -c /tmp/unity/unity-7.2.3+14.04.20140826/unity-shared/DecorationStyle.cpp
  65. /tmp/unity/unity-7.2.3+14.04.20140826/unity-shared/DecorationStyle.cpp: In lambda function:
  66. /tmp/unity/unity-7.2.3+14.04.20140826/unity-shared/DecorationStyle.cpp:172:7: error: ‘void gtk_style_context_invalidate(GtkStyleContext*)’ is deprecated (declared at /usr/include/gtk-3.0/gtk/gtkstylecontext.h:1113) [-Werror=deprecated-declarations]
  67.        gtk_style_context_invalidate(ctx_);
  68.        ^
  69. /tmp/unity/unity-7.2.3+14.04.20140826/unity-shared/DecorationStyle.cpp:172:40: error: ‘void gtk_style_context_invalidate(GtkStyleContext*)’ is deprecated (declared at /usr/include/gtk-3.0/gtk/gtkstylecontext.h:1113) [-Werror=deprecated-declarations]
  70.        gtk_style_context_invalidate(ctx_);
  71.                                         ^
  72. /tmp/unity/unity-7.2.3+14.04.20140826/unity-shared/DecorationStyle.cpp: In lambda function:
  73. /tmp/unity/unity-7.2.3+14.04.20140826/unity-shared/DecorationStyle.cpp:195:7: error: ‘void gtk_style_context_invalidate(GtkStyleContext*)’ is deprecated (declared at /usr/include/gtk-3.0/gtk/gtkstylecontext.h:1113) [-Werror=deprecated-declarations]
  74.        gtk_style_context_invalidate(ctx_);
  75.        ^
  76. /tmp/unity/unity-7.2.3+14.04.20140826/unity-shared/DecorationStyle.cpp:195:40: error: ‘void gtk_style_context_invalidate(GtkStyleContext*)’ is deprecated (declared at /usr/include/gtk-3.0/gtk/gtkstylecontext.h:1113) [-Werror=deprecated-declarations]
  77.        gtk_style_context_invalidate(ctx_);
  78.                                         ^
  79. cc1plus: all warnings being treated as errors
  80. make[3]: *** [unity-shared/CMakeFiles/unity-shared.dir/DecorationStyle.cpp.o] Error 1
  81. make[3]: se sale del directorio «/tmp/unity/unity-7.2.3+14.04.20140826/obj-i686-linux-gnu»
  82. make[2]: *** [unity-shared/CMakeFiles/unity-shared.dir/all] Error 2
  83. make[2]: se sale del directorio «/tmp/unity/unity-7.2.3+14.04.20140826/obj-i686-linux-gnu»
  84. make[1]: *** [all] Error 2
  85. make[1]: se sale del directorio «/tmp/unity/unity-7.2.3+14.04.20140826/obj-i686-linux-gnu»
  86. dh_auto_build: make -j1 returned exit code 2
  87. make: *** [build] Error 2
  88. dpkg-buildpackage: fallo: debian/rules build devolvió un estado de salida de error 2
RAW Paste Data
We use cookies for various purposes including analytics. By continuing to use Pastebin, you agree to our use of cookies as described in the Cookies Policy. OK, I Understand
Top