Guest User

Untitled

a guest
Mar 3rd, 2014
55
Never
Not a member of Pastebin yet? Sign Up, it unlocks many cool features!
  1. ➜ minetest-official git:(master) ✗ make -j2
  2. Scanning dependencies of target jsoncpp
  3. Scanning dependencies of target GenerateVersion
  4. [ 0%] -- *** Detected git version 0.4.9-120-g3e52dd5-dirty ***
  5. Building CXX object src/json/CMakeFiles/jsoncpp.dir/jsoncpp.cpp.o
  6. [ 0%] Built target GenerateVersion
  7. Linking CXX static library libjsoncpp.a
  8. [ 0%] Built target jsoncpp
  9. Scanning dependencies of target minetestserver
  10. Scanning dependencies of target minetest
  11. [ 0%] Building CXX object src/CMakeFiles/minetestserver.dir/jthread/pthread/jevent.cpp.o
  12. [ 1%] Building CXX object src/CMakeFiles/minetestserver.dir/jthread/pthread/jmutex.cpp.o
  13. [ 1%] Building CXX object src/CMakeFiles/minetestserver.dir/jthread/pthread/jsemaphore.cpp.o
  14. [ 1%] Building CXX object src/CMakeFiles/minetest.dir/jthread/pthread/jevent.cpp.o
  15. /Users/adrian/Github/minetest-official/src/jthread/pthread/jsemaphore.cpp:70:24: error:
  16. use of undeclared identifier 'sem_timedwait'
  17. int sem_wait_retval = sem_timedwait(&m_semaphore,&waittime);
  18. ^
  19. 1 error generated.
  20. make[2]: *** [src/CMakeFiles/minetestserver.dir/jthread/pthread/jsemaphore.cpp.o] Error 1
  21. make[1]: *** [src/CMakeFiles/minetestserver.dir/all] Error 2
  22. make[1]: *** Waiting for unfinished jobs....
  23. [ 2%] [ 2%] Building CXX object src/CMakeFiles/minetest.dir/jthread/pthread/jmutex.cpp.o
  24. Building CXX object src/CMakeFiles/minetest.dir/jthread/pthread/jsemaphore.cpp.o
  25. /Users/adrian/Github/minetest-official/src/jthread/pthread/jsemaphore.cpp:70:24: error:
  26. use of undeclared identifier 'sem_timedwait'
  27. int sem_wait_retval = sem_timedwait(&m_semaphore,&waittime);
  28. ^
  29. 1 error generated.
  30. make[2]: *** [src/CMakeFiles/minetest.dir/jthread/pthread/jsemaphore.cpp.o] Error 1
  31. make[2]: *** Waiting for unfinished jobs....
  32. make[1]: *** [src/CMakeFiles/minetest.dir/all] Error 2
  33. make: *** [all] Error 2
RAW Paste Data

Adblocker detected! Please consider disabling it...

We've detected AdBlock Plus or some other adblocking software preventing Pastebin.com from fully loading.

We don't have any obnoxious sound, or popup ads, we actively block these annoying types of ads!

Please add Pastebin.com to your ad blocker whitelist or disable your adblocking software.

×