Guest User

Untitled

a guest
Jun 25th, 2025
27
0
Never
Not a member of Pastebin yet? Sign Up, it unlocks many cool features!
text 1.81 KB | None | 0 0
  1. LD vmlinux
  2. SORTEX vmlinux
  3. SYSMAP System.map
  4. find: 'arch/arm64/boot/dts/': No such file or directory
  5. OBJCOPY arch/arm64/boot/Image
  6. find: 'arch/arm64/boot/dts/': No such file or directory
  7. GZIP arch/arm64/boot/Image.gz
  8. make[3]: Leaving directory '/buildd/sources/out/KERNEL_OBJ'
  9. make[2]: Leaving directory '/buildd/sources'
  10. touch /buildd/sources/out/kernel-stamp.default
  11. PATH=/usr/lib/llvm-android-12.0-r416183b/bin:/buildd/sources/debian/path-override:/usr/sbin:/usr/bin:/sbin:/bin:/usr/bin/X11 LDFLAGS="" CFLAGS="" HOSTLDFLAGS="-fuse-ld=lld --rtlib=compiler-rt" /usr/bin/make -C /buildd/sources KERNELRELEASE=4.19.325-samsung-gta4l ARCH=arm64 CROSS_COMPILE=aarch64-linux-android- CROSS_COMPILE_ARM32=aarch64-linux-android- CLANG_TRIPLE=aarch64-linux-gnu- -j8 LLVM=1 LLVM_IAS=1 O=/buildd/sources/out/KERNEL_OBJ CC=clang DTC_EXT=/usr/bin/dtc dtbs
  12. make[2]: Entering directory '/buildd/sources'
  13. make[3]: Entering directory '/buildd/sources/out/KERNEL_OBJ'
  14. GEN ./Makefile
  15. Using /buildd/sources as source for kernel
  16. CALL /buildd/sources/scripts/checksyscalls.sh
  17. make[6]: *** No rule to make target 'arch/arm64/boot/dts/vendor/qcom/bengal.dtb', needed by 'arch/arm64/boot/dts/vendor/qcom/P85946-qrd-overlay.dtbo'. Stop.
  18. make[5]: *** [/buildd/sources/scripts/Makefile.build:642: arch/arm64/boot/dts/vendor/qcom] Error 2
  19. make[4]: *** [/buildd/sources/scripts/Makefile.build:642: arch/arm64/boot/dts/vendor] Error 2
  20. make[3]: *** [arch/arm64/Makefile:172: dtbs] Error 2
  21. make[3]: Leaving directory '/buildd/sources/out/KERNEL_OBJ'
  22. make[2]: *** [Makefile:153: sub-make] Error 2
  23. make[2]: Leaving directory '/buildd/sources'
  24. make[1]: *** [/usr/share/linux-packaging-snippets/kernel-snippet.mk:129: out/dtb-stamp] Error 2
  25. make[1]: Leaving directory '/buildd/sources'
  26. make: *** [debian/rules:7: build-arch] Error 2
  27.  
Advertisement
Add Comment
Please, Sign In to add comment