Guest User

Errors

a guest
Jul 1st, 2023
38
0
Never
Not a member of Pastebin yet? Sign Up, it unlocks many cool features!
text 7.29 KB | None | 0 0
  1. CommandInvokationFailure: Gradle build failed.
  2. C:\Program Files\UnityEditor\2022.3.1f1\Editor\Data\PlaybackEngines\AndroidPlayer\OpenJDK\bin\java.exe -classpath "C:\Program Files\UnityEditor\2022.3.1f1\Editor\Data\PlaybackEngines\AndroidPlayer\Tools\gradle\lib\gradle-launcher-7.2.jar" org.gradle.launcher.GradleMain "-Dorg.gradle.jvmargs=-Xmx4096m" "assembleDebug"
  3.  
  4. Environment Variables:
  5. SHIM_MCCOMPAT = 0x810000001
  6. PROCESSOR_ARCHITECTURE = AMD64
  7. BURST_ANDROID_MIN_API_LEVEL = 22
  8. FPS_BROWSER_APP_PROFILE_STRING = Internet Explorer
  9. USERDOMAIN = ALI-AM
  10. CommonProgramFiles(x86) = C:\Program Files (x86)\Common Files
  11. COMPUTERNAME = ALI-AM
  12. DEBUG_ENV_VAR = UnityHub
  13. LOGONSERVER = \\ALI-AM
  14. PUBLIC = C:\Users\Public
  15. ProgramData = C:\ProgramData
  16. SESSIONNAME = Console
  17. NVIDIAWHITELISTED = 0x01
  18. ALLUSERSPROFILE = C:\ProgramData
  19. RegionCode = APJ
  20. SystemRoot = C:\WINDOWS
  21. windir = C:\WINDOWS
  22. ProgramFiles(x86) = C:\Program Files (x86)
  23. ProgramW6432 = C:\Program Files
  24. INTEL_DEV_REDIST = C:\Program Files (x86)\Common Files\Intel\Shared Libraries\
  25. DriverData = C:\Windows\System32\Drivers\DriverData
  26. OS = Windows_NT
  27. ANDROID_NDK_ROOT = C:\Program Files\UnityEditor\2022.3.1f1\Editor\Data\PlaybackEngines\AndroidPlayer\NDK
  28. DART_SDK = C:\Program Files\Dart\dart-sdk
  29. PROCESSOR_IDENTIFIER = AMD64 Family 23 Model 24 Stepping 1, AuthenticAMD
  30. HEAP_CLIENT_TOKEN_STAGING = 3786794399
  31. HOMEPATH = \Users\ALI
  32. FPS_BROWSER_USER_PROFILE_STRING = Default
  33. GIT_LFS_PATH = C:\Program Files\Git LFS
  34. CHROME_CRASHPAD_PIPE_NAME = \\.\pipe\crashpad_9380_TIFXITQMFFGJEKFP
  35. PROCESSOR_LEVEL = 23
  36. MIC_LD_LIBRARY_PATH = C:\Program Files (x86)\Common Files\Intel\Shared Libraries\compiler\lib\mic
  37. JAVA_TOOL_OPTIONS = -Dfile.encoding=UTF-8
  38. platformcode = KV
  39. CommonProgramFiles = C:\Program Files\Common Files
  40. USERDOMAIN_ROAMINGPROFILE = ALI-AM
  41. TEMP = C:\Users\ALI\AppData\Local\Temp
  42. CommonProgramW6432 = C:\Program Files\Common Files
  43. JAVA_HOME = C:\Program Files\UnityEditor\2022.3.1f1\Editor\Data\PlaybackEngines\AndroidPlayer\OpenJDK
  44. VBOX_HWVIRTEX_IGNORE_SVM_IN_USE = 1
  45. HOMEDRIVE = C:
  46. AMPLITUDE_API_KEY_STAGING = 83ee04fccc67e4fcc7dd527c4c6f1e21
  47. LAUNCH_DARKLY_CLIENT_TOKEN = 60a7e30fafc7e60e33446283
  48. USERNAME = ALI
  49. OneDrive = C:\Users\ALI\OneDrive
  50. PATHEXT = .COM;.EXE;.BAT;.CMD;.VBS;.VBE;.JS;.JSE;.WSF;.WSH;.MSC
  51. AMDRMSDKPATH = C:\Program Files\AMD\RyzenMasterSDK\
  52. NUMBER_OF_PROCESSORS = 8
  53. LAUNCH_DARKLY_CLIENT_TOKEN_STAGING = 60a7e30fafc7e60e33446282
  54. ProgramFiles = C:\Program Files
  55. MOZ_PLUGIN_PATH = C:\Program Files (x86)\Foxit Software\Foxit Reader\plugins\
  56. ComSpec = C:\WINDOWS\system32\cmd.exe
  57. ORIGINAL_XDG_CURRENT_DESKTOP = undefined
  58. PROCESSOR_REVISION = 1801
  59. TMP = C:\Users\ALI\AppData\Local\Temp
  60. SystemDrive = C:
  61. OnlineServices = Online Services
  62. AMPLITUDE_API_KEY = 28f3cae0b33b8b3702120c9ed1a935aa
  63. OneDriveConsumer = C:\Users\ALI\OneDrive
  64. EFC_7948 = 1
  65. SENTRY_ACCESS_TOKEN = 3df78d9e53f8456aa90fbae044ce1a6261421ab1d0014674bc2e933477289017
  66. HEAP_CLIENT_TOKEN = 1717415662
  67. APPDATA = C:\Users\ALI\AppData\Roaming
  68. Path = C:\Program Files (x86)\Common Files\Intel\Shared Libraries\redist\intel64\compiler;C:\windows\system32;C:\windows;C:\windows\System32\Wbem;C:\windows\System32\WindowsPowerShell\v1.0\;C:\windows\System32\OpenSSH\;C:\Program Files (x86)\NVIDIA Corporation\PhysX\Common;C:\Program Files\NVIDIA Corporation\NVIDIA NvDLISR;C:\Program Files\Git\cmd;C:\Program Files\dotnet\;C:\Program Files\PuTTY\;;C:\WINDOWS\system32;C:\WINDOWS;C:\WINDOWS\System32\Wbem;C:\WINDOWS\System32\WindowsPowerShell\v1.0\;C:\WINDOWS\System32\OpenSSH\;C:\Program Files\Git LFS;C:\Program Files\Dart\dart-sdk\bin;C:\Users\ALI\AppData\Local\Microsoft\WindowsApps;C:\Users\ALI\AppData\Local\Programs\Microsoft VS Code\bin;C:\Users\ALI\.dotnet\tools;C:\Users\ALI\.dotnet\tools;C:\Users\ALI\AppData\Local\Microsoft\WindowsApps;
  69. PSModulePath = C:\Program Files\WindowsPowerShell\Modules;C:\WINDOWS\system32\WindowsPowerShell\v1.0\Modules
  70. LOCALAPPDATA = C:\Users\ALI\AppData\Local
  71. USERPROFILE = C:\Users\ALI
  72. WOOTRIC_CLIENT_TOKEN = NPS-aa8be4c3
  73.  
  74.  
  75. stderr[
  76. Picked up JAVA_TOOL_OPTIONS: -Dfile.encoding=UTF-8
  77.  
  78. FAILURE: Build failed with an exception.
  79.  
  80. * Where:
  81. Build file 'C:\Project\Fork\pln-ar-portal\Library\Bee\Android\Prj\IL2CPP\Gradle\launcher\build.gradle' line: 1
  82.  
  83. * What went wrong:
  84. A problem occurred evaluating project ':launcher'.
  85. > Failed to apply plugin 'com.android.internal.version-check'.
  86. > Cannot parse project property android.enableR8='' of type 'class java.lang.String' as boolean. Expected 'true' or 'false'.
  87.  
  88. * Try:
  89. Run with --stacktrace option to get the stack trace. Run with --info or --debug option to get more log output. Run with --scan to get full insights.
  90.  
  91. * Get more help at https://help.gradle.org
  92.  
  93. BUILD FAILED in 2s
  94. ]
  95. stdout[
  96.  
  97. > Configure project :
  98. Build was configured to prefer settings repositories over project repositories but repository 'Google' was added by build file 'build.gradle'
  99. Build was configured to prefer settings repositories over project repositories but repository 'BintrayJCenter' was added by build file 'build.gradle'
  100. Build was configured to prefer settings repositories over project repositories but repository 'flatDir' was added by build file 'build.gradle'
  101.  
  102. Deprecated Gradle features were used in this build, making it incompatible with Gradle 8.0.
  103.  
  104. You can use '--warning-mode all' to show the individual deprecation warnings and determine if they come from your own scripts or plugins.
  105.  
  106. See https://docs.gradle.org/7.2/userguide/command_line_interface.html#sec:command_line_warnings
  107. ]
  108. exit code: 1
  109. UnityEditor.Android.Command.WaitForProgramToRun (UnityEditor.Utils.Program p, UnityEditor.Android.Command+WaitingForProcessToExit waitingForProcessToExit, System.String errorMsg) (at <9b16f93a6ed84389a6076e762cd925b0>:0)
  110. UnityEditor.Android.Command.Run (System.Diagnostics.ProcessStartInfo psi, UnityEditor.Android.Command+WaitingForProcessToExit waitingForProcessToExit, System.String errorMsg) (at <9b16f93a6ed84389a6076e762cd925b0>:0)
  111. UnityEditor.Android.Command.Run (System.String command, System.String args, System.String workingdir, UnityEditor.Android.Command+WaitingForProcessToExit waitingForProcessToExit, System.String errorMsg) (at <9b16f93a6ed84389a6076e762cd925b0>:0)
  112. UnityEditor.Android.AndroidJavaTools.RunJava (System.String args, System.String workingdir, System.Action`1[T] progress, System.String error) (at <9b16f93a6ed84389a6076e762cd925b0>:0)
  113. UnityEditor.Android.GradleWrapper.Run (UnityEditor.Android.AndroidJavaTools javaTools, Unity.Android.Gradle.AndroidGradle androidGradle, System.String workingdir, System.String task, System.Action`1[T] progress) (at <9b16f93a6ed84389a6076e762cd925b0>:0)
  114. Rethrow as GradleInvokationException: Gradle build failed
  115. UnityEditor.Android.GradleWrapper.Run (UnityEditor.Android.AndroidJavaTools javaTools, Unity.Android.Gradle.AndroidGradle androidGradle, System.String workingdir, System.String task, System.Action`1[T] progress) (at <9b16f93a6ed84389a6076e762cd925b0>:0)
  116. UnityEditor.Android.PostProcessor.Tasks.BuildGradleProject.Execute (UnityEditor.Android.PostProcessor.PostProcessorContext context) (at <9b16f93a6ed84389a6076e762cd925b0>:0)
  117. UnityEditor.Android.PostProcessor.PostProcessRunner.RunAllTasks (UnityEditor.Android.PostProcessor.PostProcessorContext context) (at <9b16f93a6ed84389a6076e762cd925b0>:0)
  118. UnityEngine.GUIUtility:ProcessEvent(Int32, IntPtr, Boolean&)
  119.  
Add Comment
Please, Sign In to add comment