SHARE
TWEET

Untitled

a guest Apr 23rd, 2015 231 Never
Not a member of Pastebin yet? Sign Up, it unlocks many cool features!
  1. [ 16%] Building CXX object CMakeFiles/minetest_mapper.dir/TileGenerator.cpp.o
  2. /home/kristopher/.minetest/util/minetest-mapper-cpp/TileGenerator.cpp:13:22: fatal error: gdfontmb.h: No such file or directory
  3.  #include <gdfontmb.h>
  4.                       ^
  5. compilation terminated.
  6. make[2]: *** [CMakeFiles/minetest_mapper.dir/TileGenerator.cpp.o] Error 1
  7. make[1]: *** [CMakeFiles/minetest_mapper.dir/all] Error 2
  8. make: *** [all] Error 2
RAW Paste Data
We use cookies for various purposes including analytics. By continuing to use Pastebin, you agree to our use of cookies as described in the Cookies Policy. OK, I Understand
 
Top