Ledger Nano X - The secure hardware wallet
SHARE
TWEET

jayatana build error

a guest Mar 11th, 2018 104 Never
Not a member of Pastebin yet? Sign Up, it unlocks many cool features!
  1. [ 28%] Building Java objects for jayatana-java.jar
  2. Picked up _JAVA_OPTIONS:  -javaagent:/usr/share/java/jayatanaag.jar
  3. Error opening zip file or JAR manifest missing : /usr/share/java/jayatanaag.jar
  4. Error occurred during initialization of VM
  5. agent library failed to init: instrument
  6. make[2]: *** [subprojects/jayatana/java/CMakeFiles/jayatana-java.dir/build.make:80: subprojects/jayatana/java/CMakeFiles/jayatana-java.dir/java_compiled_jayatana-java] Error 1
  7. make[1]: *** [CMakeFiles/Makefile2:614: subprojects/jayatana/java/CMakeFiles/jayatana-java.dir/all] Error 2
  8. make: *** [Makefile:163: all] Error 2
RAW Paste Data
We use cookies for various purposes including analytics. By continuing to use Pastebin, you agree to our use of cookies as described in the Cookies Policy. OK, I Understand
Top