SHARE
TWEET

lib32-gstreamer0.10-base-plugins 0.10.36-6 build error

a guest Nov 1st, 2014 135 Never
Not a member of Pastebin yet? Sign Up, it unlocks many cool features!
  1. g-ir-scanner: link: ../../../libtool --mode=link --tag=CC gcc -m32 -std=gnu99 -o /tmp/makepkg/lib32-gstreamer0.10-base/src/gst-plugins-base-0.10.36/gst-libs/gst/tag/tmp-introspectRp31_f/GstTag-0.10 -export-dynamic -D_FORTIFY_SOURCE=2 -march=x86-64 -mtune=generic -O2 -pipe -fstack-protector --param=ssp-buffer-size=4 -Wl,-O1,--sort-common,--as-needed,-z,relro /tmp/makepkg/lib32-gstreamer0.10-base/src/gst-plugins-base-0.10.36/gst-libs/gst/tag/tmp-introspectRp31_f/GstTag-0.10.o -L. libgsttag-0.10.la -L/usr/lib32 -lgio-2.0 -Wl,--export-dynamic -lgmodule-2.0 -pthread -lgstbase-0.10 -lgstreamer-0.10 -lgobject-2.0 -lgmodule-2.0 -pthread -lgthread-2.0 -pthread -lglib-2.0 -lxml2
  2. libtool: link: gcc -m32 -std=gnu99 -o /tmp/makepkg/lib32-gstreamer0.10-base/src/gst-plugins-base-0.10.36/gst-libs/gst/tag/tmp-introspectRp31_f/.libs/GstTag-0.10 -D_FORTIFY_SOURCE=2 -march=x86-64 -mtune=generic -O2 -pipe -fstack-protector --param=ssp-buffer-size=4 -Wl,-O1 -Wl,--sort-common -Wl,--as-needed -Wl,-z -Wl,relro /tmp/makepkg/lib32-gstreamer0.10-base/src/gst-plugins-base-0.10.36/gst-libs/gst/tag/tmp-introspectRp31_f/GstTag-0.10.o -Wl,--export-dynamic -pthread -pthread -pthread -Wl,--export-dynamic  -L. ./.libs/libgsttag-0.10.so -L/usr/lib32 -lgio-2.0 -lgstbase-0.10 -lgstreamer-0.10 -lgobject-2.0 -lgmodule-2.0 -lgthread-2.0 -lglib-2.0 -lxml2 -pthread
  3.  
  4. (lt-GstTag-0.10:29615): GLib-ERROR **: gmem.c:353: overflow allocating 1347634242*4 bytes
  5. Command '['/tmp/makepkg/lib32-gstreamer0.10-base/src/gst-plugins-base-0.10.36/gst-libs/gst/tag/tmp-introspectRp31_f/GstTag-0.10', '--introspect-dump=/tmp/makepkg/lib32-gstreamer0.10-base/src/gst-plugins-base-0.10.36/gst-libs/gst/tag/tmp-introspectRp31_f/functions.txt,/tmp/makepkg/lib32-gstreamer0.10-base/src/gst-plugins-base-0.10.36/gst-libs/gst/tag/tmp-introspectRp31_f/dump.xml']' returned non-zero exit status -5
  6. Makefile:1069: recipe for target 'GstTag-0.10.gir' failed
  7. make[4]: *** [GstTag-0.10.gir] Error 1
  8. make[4]: Leaving directory '/tmp/makepkg/lib32-gstreamer0.10-base/src/gst-plugins-base-0.10.36/gst-libs/gst/tag'
  9. Makefile:817: recipe for target 'tag' failed
  10. make[3]: *** [tag] Error 2
  11. make[3]: Leaving directory '/tmp/makepkg/lib32-gstreamer0.10-base/src/gst-plugins-base-0.10.36/gst-libs/gst'
  12. Makefile:471: recipe for target 'all-recursive' failed
  13. make[2]: *** [all-recursive] Error 1
  14. make[2]: Leaving directory '/tmp/makepkg/lib32-gstreamer0.10-base/src/gst-plugins-base-0.10.36/gst-libs'
  15. Makefile:591: recipe for target 'all-recursive' failed
  16. make[1]: *** [all-recursive] Error 1
  17. make[1]: Leaving directory '/tmp/makepkg/lib32-gstreamer0.10-base/src/gst-plugins-base-0.10.36'
  18. Makefile:519: recipe for target 'all' failed
  19. make: *** [all] Error 2
RAW Paste Data
We use cookies for various purposes including analytics. By continuing to use Pastebin, you agree to our use of cookies as described in the Cookies Policy. OK, I Understand
 
Top