SHARE
TWEET

Untitled

a guest May 16th, 2017 125 Never
Not a member of Pastebin yet? Sign Up, it unlocks many cool features!
  1. checking FOR x86_64-unknown-linux-gnu-gcc... /home/bchao/rpmbuild/SOURCES/gcc4.5/host-x86_64-unknown-linux-gnu/gcc/xgcc -B/home/bchao/rpmbuild/SOURCES/gcc4.5/host-x86_64-unknown-linux-gnu/gcc/ -B/usr/LOCAL/x86_64-unknown-linux-gnu/bin/ -B/usr/LOCAL/x86_64-unknown-linux-gnu/lib/ -isystem /usr/LOCAL/x86_64-unknown-linux-gnu/include -isystem /usr/LOCAL/x86_64-unknown-linux-gnu/sys-include
  2. checking FOR suffix of object files... configure: error: in `/home/bchao/rpmbuild/SOURCES/gcc4.5/x86_64-unknown-linux-gnu/libgcc':
  3. configure: error: cannot compute suffix of object files: cannot compile
  4. See `config.log' FOR more details.
  5. make[2]: *** [configure-stage1-target-libgcc] Error 1
  6. make[2]: Leaving directory `/home/bchao/rpmbuild/SOURCES/gcc4.5'
  7. make[1]: *** [stage1-bubble] Error 2
  8. make[1]: Leaving directory `/home/bchao/rpmbuild/SOURCES/gcc4.5'
  9. make: *** [all] Error 2
RAW Paste Data
We use cookies for various purposes including analytics. By continuing to use Pastebin, you agree to our use of cookies as described in the Cookies Policy. OK, I Understand
Not a member of Pastebin yet?
Sign Up, it unlocks many cool features!
 
Top