Advertisement
Guest User

sgfxi.log.NVIDIA.331.20.NOTworking

a guest
Jan 3rd, 2014
107
0
Never
Not a member of Pastebin yet? Sign Up, it unlocks many cool features!
text 176.45 KB | None | 0 0
  1. =========================================================
  2. START sgfxi LOGGING:
  3. =========================================================
  4. Script started: 2014-01-03-12:01:22
  5. Video Card Information: NVIDIA Corporation GF108 [GeForce GT 440] (rev a1)
  6. Video Card Type: 10de
  7. Video Card Number: 0de0
  8. Xorg Version: 1.14
  9. Installing driver to kernel: 3.11-2.slh.2-aptosid-amd64
  10. sgfxi script version: 4.22.04
  11. sgfxi start options:
  12. SYSTEM_BASE: debian
  13. SYSTEM_CODENAME: sid
  14. DISTRIB_CODENAME: sid
  15. DISTRIB_ID: aptosid
  16. DISTRIB_RELEASE:
  17. SIS: aptosid-sid-64
  18. BITS: 64
  19. FG_DISTRIB_CODENAME: sid
  20. FG_DISTRIB_ID: Debian
  21. APT_TYPE: apt-get
  22. SUDO_START:
  23. B_SYSTEMD: false
  24. B_SYSTEMD_GRAPHICAL: false
  25. =========================================================
  26. X is Running: false
  27. Current Runlevel: 5
  28. Connection is live (0=true): 0
  29. =========================================================
  30. INSTALL_TO_KERNEL:
  31. KERNEL_FULL: 3.11-2.slh.2-aptosid-amd64
  32. KERNEL_BASE: 3
  33. KERNEL_NUMBER: 3.11
  34. KERNEL_MATH: 11
  35. B_IS_XEN: true
  36. Function: create_x_conf - Primary: Start
  37. xorg is present with xorg.conf file
  38. Function: create_x_conf - Primary: End
  39. Function: check_package_manager_updated - Utility: Start
  40. sizeWorking: 0
  41. Function: update_package_manager - Utility: Start
  42. Args: update
  43. Update apt-get successful
  44. Function: update_package_manager - Utility: End
  45. Function: check_package_manager_updated - Utility: End
  46. Function: check_supported_driver - Utility: Start
  47. Function: check_supported_driver - Utility: End
  48. Function: set_cpu_data - Utility: Start
  49. BITS: 64 - arch: _64
  50. Function: set_cpu_data - Utility: End
  51. Function: set_driver_install_version - Primary: Start
  52. Function: check_supported_driver - Utility: Start
  53. Args: last-check
  54. Function: check_supported_driver - Utility: End
  55. Function: print_information_continue - Utility: Start
  56. Args: standard The graphics installer will be installing the nvidia driver: 331.20
  57. Function: check_ia32_libs - Utility: Start
  58. Args: test
  59. Function: check_package_status - Utility: Start
  60. Args: ia32-libs-i386:i386 i
  61. Package Version:
  62. Function: check_package_status - Utility: End
  63. 32 bit nvidia supported. Showing install option.
  64. Function: check_ia32_libs - Utility: End
  65. Function: print_information_continue - Utility: End
  66. Installing this driver: 331.20
  67. Function: set_driver_install_version - Primary: End
  68. Function: driver_support_tests - Utility: Start
  69. Args: supported-driver
  70. Function: driver_support_tests - Utility: End
  71. Function: check_kernel_headers - Utility: Start
  72. Function: check_package_status - Utility: Start
  73. Args: linux-headers-3.11-2.slh.2-aptosid-amd64 i
  74. Package Version: 3.11-11
  75. Function: check_package_status - Utility: End
  76. Function: check_package_status - Utility: Start
  77. Args: linux-headers-3.11-2.slh.2-aptosid-amd64 c
  78. Package Version:
  79. Function: check_package_status - Utility: End
  80. headerPresent: arch
  81. block
  82. crypto
  83. drivers
  84. fs
  85. include
  86. init
  87. ipc
  88. Kconfig
  89. kernel
  90. lib
  91. Makefile
  92. mm
  93. Module.symvers
  94. net
  95. samples
  96. scripts
  97. security
  98. sound
  99. usr
  100. virt
  101. headerName: linux-headers-3.11-2.slh.2-aptosid-amd64
  102. headerInstalled: 3.11-11
  103. headerAvailable:
  104. headerFile:
  105. Function: check_kernel_headers - Utility: End
  106. Function: check_run_package_tools - Primary: Start
  107. Function: check_run_package_tools - Primary: End
  108. Function: set_download_info - Primary: Start
  109. download url: ftp://download.nvidia.com/XFree86/Linux-x86_64/331.20/ - driver file: NVIDIA-Linux-x86_64-331.20
  110. Function: set_download_info - Primary: End
  111. Function: test_module_build_ok - Primary: Start
  112. Args: return
  113. returnValue: 1
  114. Error Data: No Driver Run Package:
  115. Function: download_extract_driver - Primary: Start
  116. Args: ftp://download.nvidia.com/XFree86/Linux-x86_64/331.20/ NVIDIA-Linux-x86_64-331.20
  117. Function: pre_extract_clean_set_up - Utility: Start
  118. Args: NVIDIA-Linux-x86_64-331.20
  119. Function: pre_extract_clean_set_up - Utility: End
  120. Creating directory NVIDIA-Linux-x86_64-331.20
  121. Verifying archive integrity... OK
  122. Uncompressing NVIDIA Accelerated Graphics Driver for Linux-x86_64 331.20.......................................................................................................................................................................................................................
  123. Function: download_extract_driver - Primary: End
  124. Function: set_install_directory - set to: /usr/src/sgfxi-downloads/NVIDIA-Linux-x86_64-331.20
  125. Function: run_driver_patches - Primary: Start
  126. Function: run_driver_patches - Primary: End
  127. Function: x_start_stop_master - Primary: Start
  128. Args: stop
  129. Function: start_stop_x - Utility: Start
  130. Args: stop
  131. Function: get_default_display_manager - Utility: Start
  132. defaultDM: kdm
  133. Function: get_default_display_manager - Utility: End
  134. default runlevel: 5
  135. current runlevel: 5
  136. dmanCommand: service kdm stop
  137. Display manager stop status: true
  138. Function: x_is_running - Utility: Start
  139. X ps aux:
  140. returnVal: false
  141. Function: x_is_running - Utility: End
  142. Function: start_stop_x - Utility: End
  143. Function: x_start_stop_master - Primary: End
  144. Function: check_driver_install_tools - Primary: Start
  145. Function: check_package_status - Utility: Start
  146. Args: module-assistant i
  147. Package Version: 0.11.6
  148. Function: check_package_status - Utility: End
  149. Function: check_package_status - Utility: Start
  150. Args: build-essential i
  151. Package Version: 11.6
  152. Function: check_package_status - Utility: End
  153. Function: check_driver_install_tools - Primary: End
  154. Function: prep_install - Primary: Start
  155. Function: prep_install - Primary: End
  156. Function: preinstall_cleanup - Primary: Start
  157. Using nvidia uninstaller: /usr/bin/nvidia-installer
  158.  
  159. ERROR: File '/usr/lib/xorg/modules/extensions/libglx.so' is not a symbolic
  160. link.
  161.  
  162.  
  163. WARNING: Your driver installation has been altered since it was initially
  164. installed; this may happen, for example, if you have since
  165. installed the NVIDIA driver through a mechanism other than
  166. nvidia-installer (such as your distribution's native package
  167. management system). nvidia-installer will attempt to uninstall as
  168. best it can. Please see the file '/var/log/nvidia-installer.log'
  169. for details.
  170.  
  171. Pre Remove: nvidia.ko files:
  172.  
  173. Function: list_installed_packages - Utility: Start
  174. Args: nvidia (libkwinnvidiahack|libgl1-nvidia-glx-ia32|libgl1-nvidia-glx:386|modalias|libvdpau|nvidia-bl-dkms|nvidia-cg-toolkit)
  175. packageList:
  176. Function: list_installed_packages - Utility: End
  177. Post Purge/Remove: nvidia.ko files:
  178.  
  179. rm: cannot remove ‘/usr/src/nvidia-310.19’: Is a directory
  180. rm: cannot remove ‘/usr/src/nvidia-319.23’: Is a directory
  181. rm: cannot remove ‘/usr/src/nvidia-319.32’: Is a directory
  182. rm: cannot remove ‘/usr/src/nvidia-325.15’: Is a directory
  183. Function: remove_module - Primary: Start
  184. Args: nvidia
  185. operation outcome: unset
  186. Function: remove_module - Primary: End
  187. Function: remove_module - Primary: Start
  188. Args: nouveau
  189. operation outcome: unset
  190. Function: set_modesetting_off - Primary: End
  191. Function: add_grub_nomodeset_blacklist_item - Utility: Start
  192. Args: nouveau
  193. Function: get_active_grub_files - Utility: Start
  194. grub files: /boot/grub/grub.cfg /etc/default/grub
  195. Function: get_active_grub_files - Utility: End
  196. Function: add_grub_nomodeset_blacklist_item - Utility: End
  197. Function: add_modprobe_d_blacklist_item - Utility: Start
  198. Args: nouveau
  199. Function: add_modprobe_d_blacklist_item - Utility: End
  200. Function: set_modesetting_off - Primary: Start
  201. Args: nouveau unset
  202. Function: remove_module - Primary: End
  203. Function: list_installed_packages - Utility: Start
  204. Args: fglrx modalias
  205. packageList:
  206. Function: list_installed_packages - Utility: End
  207. Function: remove_module - Primary: Start
  208. Args: fglrx
  209. operation outcome: unset
  210. Function: remove_module - Primary: End
  211. Function: clean_dkms - Primary: Start
  212. Function: clean_dkms - Primary: End
  213. Function: preinstall_cleanup - Primary: End
  214. Function: run_driver_installer - Primary: Start
  215. driver: 331.20
  216.  
  217. ERROR: Unable to build the Unified Memory kernel module.
  218.  
  219.  
  220. ERROR: The Unified Memory kernel module failed to build. To work around
  221. this issue, you may attempt to install this driver package again
  222. with the '--no-unified-memory' option.
  223.  
  224.  
  225. ERROR: Installation has failed. Please see the file
  226. '/var/log/nvidia-installer.log' for details. You may find
  227. suggestions on fixing installation problems in the README available
  228. on the Linux driver download page at www.nvidia.com.
  229.  
  230. - - - - - - - - - - - - - - - - - - - - - - - - - - - - - - - - -
  231. Error logs from nvidia install:
  232. - - - - - - - - - - - - - - - - - - - - - - - - - - - - - - - - -
  233. nvidia-installer log file '/var/log/nvidia-installer.log'
  234. creation time: Fri Jan 3 12:03:57 2014
  235. installer version: 331.20
  236.  
  237. PATH: /usr/local/sbin:/usr/local/bin:/usr/sbin:/usr/bin:/sbin:/bin
  238.  
  239. nvidia-installer command line:
  240. ./nvidia-installer
  241. -s
  242. -N
  243. --x-module-path=/usr/lib/xorg/modules
  244. --x-library-path=/usr/lib
  245. -k
  246. 3.11-2.slh.2-aptosid-amd64
  247.  
  248. Using built-in stream user interface
  249. -> License accepted by command line option.
  250. -> Installing NVIDIA driver version 331.20.
  251. -> Not probing for precompiled kernel interfaces.
  252. -> Performing CC sanity check with CC="/usr/bin/gcc-4.8".
  253. -> Kernel source path: '/lib/modules/3.11-2.slh.2-aptosid-amd64/build'
  254. -> Kernel output path: '/lib/modules/3.11-2.slh.2-aptosid-amd64/build'
  255. -> Performing rivafb check.
  256. -> Performing nvidiafb check.
  257. -> Performing Xen check.
  258. -> Performing PREEMPT_RT check.
  259. -> Cleaning kernel module build directory.
  260. executing: 'cd ./kernel; make clean'...
  261. -> Building NVIDIA kernel module:
  262. executing: 'cd ./kernel; make module SYSSRC=/lib/modules/3.11-2.slh.2-aptosid-amd64/build SYSOUT=/lib/modules/3.11-2.slh.2-aptosid-amd64/build NV_BUILD_MODULE_INSTANCES='...
  263. NVIDIA: calling KBUILD...
  264. make[1]: Entering directory `/usr/src/linux-headers-3.11-2.slh.2-aptosid-amd64'
  265. test -e include/generated/autoconf.h -a -e include/config/auto.conf || ( \
  266. echo >&2; \
  267. echo >&2 " ERROR: Kernel configuration is invalid."; \
  268. echo >&2 " include/generated/autoconf.h or include/config/auto.conf are missing.";\
  269. echo >&2 " Run 'make oldconfig && make prepare' on kernel src to fix it."; \
  270. echo >&2 ; \
  271. /bin/false)
  272. mkdir -p /usr/src/sgfxi-downloads/NVIDIA-Linux-x86_64-331.20/kernel/.tmp_versions ; rm -f /usr/src/sgfxi-downloads/NVIDIA-Linux-x86_64-331.20/kernel/.tmp_versions/*
  273. make -f scripts/Makefile.build obj=/usr/src/sgfxi-downloads/NVIDIA-Linux-x86_64-331.20/kernel
  274. /usr/bin/gcc-4.8 -Wp,-MD,/usr/src/sgfxi-downloads/NVIDIA-Linux-x86_64-331.20/kernel/.nv.o.d -nostdinc -isystem /usr/lib/gcc/x86_64-linux-gnu/4.8/include -I/usr/src/linux-headers-3.11-2.slh.2-aptosid-amd64/arch/x86/include -Iarch/x86/include/generated -Iinclude -I/usr/src/linux-headers-3.1
  275. 1-2.slh.2-aptosid-amd64/arch/x86/include/uapi -Iarch/x86/include/generated/uapi -I/usr/src/linux-headers-3.11-2.slh.2-aptosid-amd64/include/uapi -Iinclude/generated/uapi -include /usr/src/linux-headers-3.11-2.slh.2-aptosid-amd64/include/linux/kconfig.h -D__KERNEL__ -Wall -Wundef -Wstrict-prototypes -Wno-trigraphs -fno-strict-aliasing -fno-common -Werror-implicit-function-declaration -Wno-format-security -fno-delete-null-pointer-checks -Os -Wno-maybe-uninitialized -m64 -mno-sse -mpreferred-stack-boundary=3 -mtune=generic -mno-red-zone -mcmodel=kernel -funit-at-a-time -maccumulate-outgoing-args -fstack-protector -DCONFIG_AS_CFI=1 -DCONFIG_AS_CFI_SIGNAL_FRAME=1 -DCONFIG_AS_CFI_SECTIONS=1 -DCONFIG_AS_FXSAVEQ=1 -DCONFIG_AS_AVX=1 -DCONFIG_AS_AVX2=1 -pipe -Wno-sign-compare -fno-asynchronous-unwind-tables -mno-sse -mno-mmx -mno-sse2 -mno-3dnow -mno-avx -Wframe-larger-than=2048 -Wno-unused-but-set-variable -fomit-frame-pointer -Wdeclaration-after-statement -Wno-pointer-sign -fno-strict-overflow -fconserve-stack -
  276. DCC_H
  277. AVE_ASM_GOTO -DNV_MODULE_INSTANCE=0 -DNV_BUILD_MODULE_INSTANCES=0 -UDEBUG -U_DEBUG -DNDEBUG -I/usr/src/sgfxi-downloads/NVIDIA-Linux-x86_64-331.20/kernel -Wall -MD -Wsign-compare -Wno-cast-qual -Wno-error -D__KERNEL__ -DMODULE -DNVRM -DNV_VERSION_STRING=\"331.20\" -Wno-unused-function -Wuninitialized -mno-red-zone -mcmodel=kernel -DNV_UVM_ENABLE -D__linux__ -DNV_DEV_NAME=\"nvidia\" -DMODULE -D"KBUILD_STR(s)=#s" -D"KBUILD_BASENAME=KBUILD_STR(nv)" -D"KBUILD_MODNAME=KBUILD_STR(nvidia)" -c -o /usr/src/sgfxi-downloads/NVIDIA-Linux-x86_64-331.20/kernel/.tmp_nv.o /usr/src/sgfxi-downloads/NVIDIA-Linux-x86_64-331.20/kernel/nv.c
  278. In file included from /usr/src/linux-headers-3.11-2.slh.2-aptosid-amd64/arch/x86/include/asm/bitops.h:514:0,
  279. from include/linux/bitops.h:22,
  280. from include/linux/kernel.h:10,
  281. from include/linux/sched.h:15,
  282. from include/linux/utsname.h:5,
  283. from /usr/src/sgfxi-downloads/NVIDIA-Linux-x86_64-331.20/kernel/nv-linux.h:44,
  284. from /usr/src/sgfxi-downloads/NVIDIA-Linux-x86_64-331.20/kernel/nv.c:13:
  285. include/linux/bitops.h: In function ‘hweight_long’:
  286. include/asm-generic/bitops/const_hweight.h:27:70: warning: signed and unsigned type in conditional expression [-Wsign-compare]
  287. #define hweight64(w) (__builtin_constant_p(w) ? __const_hweight64(w) : __arch_hweight64(w))
  288. ^
  289. include/linux/bitops.h:66:41: note: in expansion of macro ‘hweight64’
  290. return sizeof(w) == 4 ? hweight32(w) : hweight64(w);
  291. ^
  292. In file included from /usr/src/linux-headers-3.11-2.slh.2-aptosid-amd64/arch/x86/include/asm/cpumask.h:4:0,
  293. from /usr/src/linux-headers-3.11-2.slh.2-aptosid-amd64/arch/x86/include/asm/msr.h:10,
  294. from /usr/src/linux-headers-3.11-2.slh.2-aptosid-amd64/arch/x86/include/asm/processor.h:20,
  295. from /usr/src/linux-headers-3.11-2.slh.2-aptosid-amd64/arch/x86/include/asm/thread_info.h:22,
  296. from include/linux/thread_info.h:54,
  297. from include/linux/preempt.h:9,
  298. from include/linux/spinlock.h:50,
  299. from include/linux/seqlock.h:29,
  300. from include/linux/time.h:5,
  301. from include/uapi/linux/timex.h:56,
  302. from include/linux/timex.h:56,
  303. from include/linux/sched.h:17,
  304. from include/linux/utsname.h:5,
  305. from /usr/src/sgfxi-downloads/NVIDIA-Linux-x86_64-331.20/kernel/nv-linux.h:44,
  306. from /usr/src/sgfxi-downloads/NVIDIA-Linux-x86_64-331.20/kernel/nv.c:13:
  307. include/linux/cpumask.h: In function ‘cpumask_parse’:
  308. include/linux/cpumask.h:603:26: warning: signed and unsigned type in conditional expression [-Wsign-compare]
  309. int len = nl ? nl - buf : strlen(buf);
  310. ^
  311. In file included from include/uapi/linux/stddef.h:1:0,
  312. from include/linux/stddef.h:4,
  313. from /usr/src/linux-headers-3.11-2.slh.2-aptosid-amd64/include/uapi/linux/posix_types.h:4,
  314. from include/uapi/linux/types.h:13,
  315. from include/linux/types.h:5,
  316. from include/uapi/linux/capability.h:16,
  317. from include/linux/capability.h:15,
  318. from include/linux/sched.h:13,
  319. from include/linux/utsname.h:5,
  320. from /usr/src/sgfxi-downloads/NVIDIA-Linux-x86_64-331.20/kernel/nv-linux.h:44,
  321. from /usr/src/sgfxi-downloads/NVIDIA-Linux-x86_64-331.20/kernel/nv.c:13:
  322. /usr/src/linux-headers-3.11-2.slh.2-aptosid-amd64/arch/x86/include/asm/uaccess_64.h: In function ‘copy_from_user’:
  323. /usr/src/linux-headers-3.11-2.slh.2-aptosid-amd64/arch/x86/include/asm/uaccess_64.h:62:28: warning: comparison between signed and unsigned integer expressions [-Wsign-compare]
  324. if (likely(sz == -1 || sz >= n))
  325. ^
  326. include/linux/compiler.h:152:40: note: in definition of macro ‘likely’
  327. # define likely(x) __builtin_expect(!!(x), 1)
  328. ^
  329. /usr/bin/gcc-4.8 -Wp,-MD,/usr/src/sgfxi-downloads/NVIDIA-Linux-x86_64-331.20/kernel/.nv-acpi.o.d -nostdinc -isystem /usr/lib/gcc/x86_64-linux-gnu/4.8/include -I/usr/src/linux-headers-3.11-2.slh.2-aptosid-amd64/arch/x86/include -Iarch/x86/include/generated -Iinclude -I/usr/src/linux-headers-3.11-2.slh.2-aptosid-amd64/arch/x86/include/uapi -Iarch/x86/include/generated/uapi -I/usr/src/linux-headers-3.11-2.slh.2-aptosid-amd64/include/uapi -Iinclude/generated/uapi -include /usr/src/linux-headers-3.11-2.slh.2-aptosid-amd64/include/linux/kconfig.h -D__KERNEL__ -Wall -Wundef -Wstrict-prototypes -Wno-trigraphs -fno-strict-aliasing -fno-common -Werror-implicit-function-declaration -Wno-format-security -fno-delete-null-pointer-checks -Os -Wno-maybe-uninitialized -m64 -mno-sse -mpreferred-stack-boundary=3 -mtune=generic -mno-red-zone -mcmodel=kernel -funit-at-a-time -maccumulate-outgoing-args -fstack-protector -DCONFIG_AS_CFI=1 -DCONFIG_AS_CFI_S
  330. IGNAL_FRAME=1 -DCONFIG_AS_CFI_SECTIONS=1 -DCONFIG_AS_FXSAVEQ=1 -DCONFIG_AS_AVX=1 -DCONFIG_AS_AVX2=1 -pipe -Wno-sign-compare -fno-asynchronous-unwind-tables -mno-sse -mno-mmx -mno-sse2 -mno-3dnow -mno-avx -Wframe-larger-than=2048 -Wno-unused-but-set-variable -fomit-frame-pointer -Wdeclaration-after-statement -Wno-pointer-sign -fno-strict-overflow -fconserve-stack -DCC_HAVE_ASM_GOTO -DNV_MODULE_INSTANCE=0 -DNV_BUILD_MODULE_INSTANCES=0 -UDEBUG -U_DEBUG -DNDEBUG -I/usr/src/sgfxi-downloads/NVIDIA-Linux-x86_64-331.20/kernel -Wall -MD -Wsign-compare -Wno-cast-qual -Wno-error -D__KERNEL__ -DMODULE -DNVRM -DNV_VERSION_STRING=\"331.20\" -Wno-unused-function -Wuninitialized -mno-red-zone -mcmodel=kernel -DNV_UVM_ENABLE -D__linux__ -DNV_DEV_NAME=\"nvidia\" -DMODULE -D"KBUILD_STR(s)=#s" -D"KBUILD_BASENAME=KBUILD_STR(nv_acpi)" -D"KBUILD_MODNAME=KBUILD_STR(nvidia)" -c -o /usr/src/sgfxi-downloads/NVIDIA-Linux-x86_64-331.20/kernel/.tmp_nv-acpi.o /usr/src/sgfxi-downloads/NVIDIA-Linux-x86_64-331.20/kernel/nv-acpi.c
  331. In file included from /usr/src/linux-headers-3.11-2.slh.2-aptosid-amd64/arch/x86/include/asm/bitops.h:514:0,
  332. from include/linux/bitops.h:22,
  333. from include/linux/kernel.h:10,
  334. from include/linux/sched.h:15,
  335. from include/linux/utsname.h:5,
  336. from /usr/src/sgfxi-downloads/NVIDIA-Linux-x86_64-331.20/kernel/nv-linux.h:44,
  337. from /usr/src/sgfxi-downloads/NVIDIA-Linux-x86_64-331.20/kernel/nv-acpi.c:15:
  338. include/linux/bitops.h: In function ‘hweight_long’:
  339. include/asm-generic/bitops/const_hweight.h:27:70: warning: signed and unsigned type in conditional expression [-Wsign-compare]
  340. #define hweight64(w) (__builtin_constant_p(w) ? __const_hweight64(w) : __arch_hweight64(w))
  341. ^
  342. include/linux/bitops.h:66:41: note: in expansion of macro ‘hweight64’
  343. return sizeof(w) == 4 ? hweight32(w) : hweight64(w);
  344. ^
  345. In file included from /usr/src/linux-headers-3.11-2.slh.2-aptosid-amd64/arch/x86/include/asm/cpumask.h:4:0,
  346. from /usr/src/linux-headers-3.11-2.slh.2-aptosid-amd64/arch/x86/include/asm/msr.h:10,
  347. from /usr/src/linux-headers-3.11-2.slh.2-aptosid-amd64/arch/x86/include/asm/processor.h:20,
  348. from /usr/src/linux-headers-3.11-2.slh.2-aptosid-amd64/arch/x86/include/asm/thread_info.h:22,
  349. from include/linux/thread_info.h:54,
  350. from include/linux/preempt.h:9,
  351. from include/linux/spinlock.h:50,
  352. from include/linux/seqlock.h:29,
  353. from include/linux/time.h:5,
  354. from include/uapi/linux/timex.h:56,
  355. from include/linux/timex.h:56,
  356. from include/linux/sched.h:17,
  357. from include/linux/utsname.h:5,
  358. from /usr/src/sgfxi-downloads/NVIDIA-Linux-x86_64-331.20/kernel/nv-linux.h:44,
  359. from /usr/src/sgfxi-downloads/NVIDIA-Linux-x86_64-331.20/kernel/nv-acpi.c:15:
  360. include/linux/cpumask.h: In function ‘cpumask_parse’:
  361. include/linux/cpumask.h:603:26: warning: signed and unsigned type in conditional expression [-Wsign-compare]
  362. int len = nl ? nl - buf : strlen(buf);
  363. ^
  364. In file included from include/uapi/linux/stddef.h:1:0,
  365. from include/linux/stddef.h:4,
  366. from /usr/src/linux-headers-3.11-2.slh.2-aptosid-amd64/include/uapi/linux/posix_types.h:4,
  367. from include/uapi/linux/types.h:13,
  368. from include/linux/types.h:5,
  369. from include/uapi/linux/capability.h:16,
  370. from include/linux/capability.h:15,
  371. from include/linux/sched.h:13,
  372. from include/linux/utsname.h:5,
  373. from /usr/src/sgfxi-downloads/NVIDIA-Linux-x86_64-331.20/kernel/nv-linux.h:44,
  374. from /usr/src/sgfxi-downloads/NVIDIA-Linux-x86_64-331.20/kernel/nv-acpi.c:15:
  375. /usr/src/linux-headers-3.11-2.slh.2-aptosid-amd64/arch/x86/include/asm/uaccess_64.h: In function ‘copy_from_user’:
  376. /usr/src/linux-headers-3.11-2.slh.2-aptosid-amd64/arch/x86/include/asm/uaccess_64.h:62:28: warning: comparison between signed and unsigned integer expressions [-Wsign-compare]
  377. if (likely(sz == -1 || sz >= n))
  378. ^
  379. include/linux/compiler.h:152:40: note: in definition of macro ‘likely’
  380. # define likely(x) __builtin_expect(!!(x), 1)
  381. ^
  382. /usr/src/sgfxi-downloads/NVIDIA-Linux-x86_64-331.20/kernel/nv-acpi.c: At top level:
  383. /usr/src/sgfxi-downloads/NVIDIA-Linux-x86_64-331.20/kernel/nv-acpi.c:70:9: warning: initialization from incompatible pointer type [enabled by default]
  384. .remove = nv_acpi_remove,
  385. ^
  386. /usr/src/sgfxi-downloads/NVIDIA-Linux-x86_64-331.20/kernel/nv-acpi.c:70:9: warning: (near initialization for ‘nv_acpi_driver_template.ops.remove’) [enabled by default]
  387. /usr/bin/gcc-4.8 -Wp,-MD,/usr/src/sgfxi-downloads/NVIDIA-Linux-x86_64-331.20/kernel/.nv-chrdev.o.d -nostdinc -isystem /usr/lib/gcc/x86_64-linux-gnu/4.8/include -I/usr/src/linux-headers-3.11-2.slh.2-aptosid-amd64/arch/x86/include -Iarch/x86/include/generated -Iinclude -I/usr/src/linux-headers-3.11-2.slh.2-aptosid-amd64/arch/x86/include/uapi -Iarch/x86/include/generated/uapi -I/usr/src/linux-headers-3.11-2.slh.2-aptosid-amd64/include/uapi -Iinclude/generated/uapi -include /usr/src/linux-headers-3.11-2.slh.2-aptosid-amd64/include/linux/kconfig.h -D__KERNEL__ -Wall -Wundef -Wstrict-prototypes -Wno-trigraphs -fno-strict-aliasing -fno-common -Werror-implicit-function-declaration -Wno-format-security -fno-delete-null-pointer-checks -Os -Wno-maybe-uninitialized -m64 -mno-sse -mpreferred-stack-boundary=3 -mtune=generic -mno-red-zone -mcmodel=kernel -funit-at-a-time -maccumulate-outgoing-args -fstack-protector -DCONFIG_AS_CFI=1 -DCONFIG_AS_CFI_SIGNAL_FRAME=1 -DCONFIG_AS_CFI_SECTIONS=1 -DCONFIG_AS_FXSAVEQ=1 -
  388. DCONFIG_AS_AVX=1 -DCONFIG_AS_AVX2=1 -pipe -Wno-sign-compare -fno-asynchronous-unwind-tables -mno-sse -mn
  389. o-mmx -mno-sse2 -mno-3dnow -mno-avx -Wframe-larger-than=2048 -Wno-unused-but-set-variable -fomit-frame-pointer -Wdeclaration-after-statement -Wno-pointer-sign -fno-strict-overflow -fconserve-stack -DCC_HAVE_ASM_GOTO -DNV_MODULE_INSTANCE=0 -DNV_BUILD_MODULE_INSTANCES=0 -UDEBUG -U_DEBUG -DNDEBUG -I/usr/src/sgfxi-downloads/NVIDIA-Linux-x86_64-331.20/kernel -Wall -MD -Wsign-compare -Wno-cast-qual -Wno-error -D__KERNEL__ -DMODULE -DNVRM -DNV_VERSION_STRING=\"331.20\" -Wno-unused-function -Wuninitialized -mno-red-zone -mcmodel=kernel -DNV_UVM_ENABLE -D__linux__ -DNV_DEV_NAME=\"nvidia\" -DMODULE -D"KBUILD_STR(s)=#s" -D"KBUILD_BASENAME=KBUILD_STR(nv_chrdev)" -D"KBUILD_MODNAME=KBUILD_STR(nvidia)" -c -o /usr/src/sgfxi-downloads/NVIDIA-Linux-x86_64-331.20/kernel/.tmp_nv-chrdev.o /usr/src/sgfxi-downloads/NVIDIA-Linux-x86_64-331.20/kernel/nv-chrdev.c
  390. In file included from /usr/src/linux-headers-3.11-2.slh.2-aptosid-amd64/arch/x86/include/asm/bitops.h:514:0,
  391. from include/linux/bitops.h:22,
  392. from include/linux/kernel.h:10,
  393. from include/linux/sched.h:15,
  394. from include/linux/utsname.h:5,
  395. from /usr/src/sgfxi-downloads/NVIDIA-Linux-x86_64-331.20/kernel/nv-linux.h:44,
  396. from /usr/src/sgfxi-downloads/NVIDIA-Linux-x86_64-331.20/kernel/nv-chrdev.c:15:
  397. include/linux/bitops.h: In function ‘hweight_long’:
  398. include/asm-generic/bitops/const_hweight.h:27:70: warning: signed and unsigned type in conditional expression [-Wsign-compare]
  399. #define hweight64(w) (__builtin_constant_p(w) ? __const_hweight64(w) : __arch_hweight64(w))
  400. ^
  401. include/linux/bitops.h:66:41: note: in expansion of macro ‘hweight64’
  402. return sizeof(w) == 4 ? hweight32(w) : hweight64(w);
  403. ^
  404. In file included from /usr/src/linux-headers-3.11-2.slh.2-aptosid-amd64/arch/x86/include/asm/cpumask.h:4:0,
  405. from /usr/src/linux-headers-3.11-2.slh.2-aptosid-amd64/arch/x86/include/asm/msr.h:10,
  406. from /usr/src/linux-headers-3.11-2.slh.2-aptosid-amd64/arch/x86/include/asm/processor.h:20,
  407. from /usr/src/linux-headers-3.11-2.slh.2-aptosid-amd64/arch/x86/include/asm/thread_info.h:22,
  408. from include/linux/thread_info.h:54,
  409. from include/linux/preempt.h:9,
  410. from include/linux/spinlock.h:50,
  411. from include/linux/seqlock.h:29,
  412. from include/linux/time.h:5,
  413. from include/uapi/linux/timex.h:56,
  414. from include/linux/timex.h:56,
  415. from include/linux/sched.h:17,
  416. from include/linux/utsname.h:5,
  417. from /usr/src/sgfxi-downloads/NVIDIA-Linux-x86_64-331.20/kernel/nv-linux.h:44,
  418. from /usr/src/sgfxi-downloads/NVIDIA-Linux-x86_64-331.20/kernel/nv-chrdev.c:15:
  419. include/linux/cpumask.h: In function ‘cpumask_parse’:
  420. include/linux/cpumask.h:603:26: warning: signed and unsigned type in conditional expression [-Wsign-compare]
  421. int len = nl ? nl - buf : strlen(buf);
  422. ^
  423. In file included from include/uapi/linux/stddef.h:1:0,
  424. from include/linux/stddef.h:4,
  425. from /usr/src/linux-headers-3.11-2.slh.2-aptosid-amd64/include/uapi/linux/posix_types.h:4,
  426. from include/uapi/linux/types.h:13,
  427. from include/linux/types.h:5,
  428. from include/uapi/linux/capability.h:16,
  429. from include/linux/capability.h:15,
  430. from include/linux/sched.h:13,
  431. from include/linux/utsname.h:5,
  432. from /usr/src/sgfxi-downloads/NVIDIA-Linux-x86_64-331.20/kernel/nv-linux.h:44,
  433. from /usr/src/sgfxi-downloads/NVIDIA-Linux-x86_64-331.20/kernel/nv-chrdev.c:15:
  434. /usr/src/linux-headers-3.11-2.slh.2-aptosid-amd64/arch/x86/include/asm/uaccess_64.h: In function ‘copy_from_user’:
  435. /usr/src/linux-headers-3.11-2.slh.2-aptosid-amd64/arch/x86/include/asm/uaccess_64.h:62:28: warning: comparison between signed and unsigned integer expressions [-Wsign-compare]
  436. if (likely(sz == -1 || sz >= n))
  437. ^
  438. include/linux/compiler.h:152:40: note: in definition of macro ‘likely’
  439. # define likely(x) __builtin_expect(!!(x), 1)
  440. ^
  441. /usr/bin/gcc-4.8 -Wp,-MD,/usr/src/sgfxi-downloads/NVIDIA-Linux-x86_64-331.20/kernel/.nv-cray.o.d -nostdinc -isystem /usr/lib/gcc/x86_64-linux-gnu/4.8/include -I/usr/src/linux-headers-3.11-2.slh.2-aptosid-amd64/arch/x86/include -Iarch/x86/include/generated -Iinclude -I/usr/src/linux-headers-3.11-2.slh.2-aptosid-amd64/arch/x86/include/uapi -Iarch/x86/include/generated/uapi -I/usr/src/linux-headers-3.11-2.slh.2-aptosid-amd64/include/uapi -Iinclude/generated/uapi -include /usr/src/linux-headers-3.11-2.slh.2-aptosid-amd64/include/linux/kconfig.h -D__KERNEL__ -Wall -Wundef -Wstrict-prototypes -Wno-trigraphs -fno-strict-aliasing -fno-common -Werror-implicit-function-declaration -Wno-format-security -
  442. fno-delete-null-pointer-checks -Os -Wno-maybe-uninitialized -m64 -mno-sse -mpreferred-stack-boundary=3 -mtune=generic -mno-red-zone -mcmodel=kernel -funit-at-a-time -maccumulate-outgoing-args -fstack-protector -DCONFIG_AS_CFI=1 -DCONFIG_AS_CFI_SIGNAL_FRAME=1 -DCONFIG_AS_CFI_SECTIONS=1 -DCONFIG_AS_FXSAVEQ=1 -DCONFIG_AS_AVX=1 -DCONFIG_AS_AVX2=1 -pipe -Wno-sign-compare -fno-asynchronous-unwind-tables -mno-sse -mno-mmx -mno-sse2 -mno-3dnow -mno-avx -Wframe-larger-than=2048 -Wno-unused-but-set-variable -fomit-frame-pointer -Wdeclaration-after-statement -Wno-pointer-sign -fno-strict-overflow -fconserve-stack -DCC_HAVE_ASM_GOTO -DNV_MODULE_INSTANCE=0 -DNV_BUILD_MODULE_INSTANCES=0 -UDEBUG -U_DEBUG -DNDEBUG -I/usr/src/sgfxi-downloads/NVIDIA-Linux-x86_64-331.20/kernel -Wall -MD -Wsign-compare -Wno-cast-qual -Wno-error -D__KERNEL__ -DMODULE -DNVRM -DNV_VERSION_STRING=\"331.20\" -Wno-unused-function -Wuninitialized -mno-red-zone -mcmodel=kernel -DNV_UVM_ENABLE -D__linux__ -DNV_DEV_NAME=\"nvidia\" -DMODULE -D"KBUILD_
  443. STR
  444. (s)=#s" -D"KBUILD_BASENAME=KBUILD_STR(nv_cray)" -D"KBUILD_MODNAME=KBUILD_STR(nvidia)" -c -o /usr/src/sgfxi-downloads/NVIDIA-Linux-x86_64-331.20/kernel/.tmp_nv-cray.o /usr/src/sgfxi-downloads/NVIDIA-Linux-x86_64-331.20/kernel/nv-cray.c
  445. In file included from /usr/src/linux-headers-3.11-2.slh.2-aptosid-amd64/arch/x86/include/asm/bitops.h:514:0,
  446. from include/linux/bitops.h:22,
  447. from include/linux/kernel.h:10,
  448. from include/linux/sched.h:15,
  449. from include/linux/utsname.h:5,
  450. from /usr/src/sgfxi-downloads/NVIDIA-Linux-x86_64-331.20/kernel/nv-linux.h:44,
  451. from /usr/src/sgfxi-downloads/NVIDIA-Linux-x86_64-331.20/kernel/nv-cray.c:15:
  452. include/linux/bitops.h: In function ‘hweight_long’:
  453. include/asm-generic/bitops/const_hweight.h:27:70: warning: signed and unsigned type in conditional expression [-Wsign-compare]
  454. #define hweight64(w) (__builtin_constant_p(w) ? __const_hweight64(w) : __arch_hweight64(w))
  455. ^
  456. include/linux/bitops.h:66:41: note: in expansion of macro ‘hweight64’
  457. return sizeof(w) == 4 ? hweight32(w) : hweight64(w);
  458. ^
  459. In file included from /usr/src/linux-headers-3.11-2.slh.2-aptosid-amd64/arch/x86/include/asm/cpumask.h:4:0,
  460. from /usr/src/linux-headers-3.11-2.slh.2-aptosid-amd64/arch/x86/include/asm/msr.h:10,
  461. from /usr/src/linux-headers-3.11-2.slh.2-aptosid-amd64/arch/x86/include/asm/processor.h:20,
  462. from /usr/src/linux-headers-3.11-2.slh.2-aptosid-amd64/arch/x86/include/asm/thread_info.h:22,
  463. from include/linux/thread_info.h:54,
  464. from include/linux/preempt.h:9,
  465. from include/linux/spinlock.h:50,
  466. from include/linux/seqlock.h:29,
  467. from include/linux/time.h:5,
  468. from include/uapi/linux/timex.h:56,
  469. from include/linux/timex.h:56,
  470. from include/linux/sched.h:17,
  471. from include/linux/utsname.h:5,
  472. from /usr/src/sgfxi-downloads/NVIDIA-Linux-x86_64-331.20/kernel/nv-linux.h:44,
  473. from /usr/src/sgfxi-downloads/NVIDIA-Linux-x86_64-331.20/kernel/nv-cray.c:15:
  474. include/linux/cpumask.h: In function ‘cpumask_parse’:
  475. include/linux/cpumask.h:603:26: warning: signed and unsigned type in conditional expression [-Wsign-compare]
  476. int len = nl ? nl - buf : strlen(buf);
  477. ^
  478. In file included from include/uapi/linux/stddef.h:1:0,
  479. from include/linux/stddef.h:4,
  480. from /usr/src/linux-headers-3.11-2.slh.2-aptosid-amd64/include/uapi/linux/posix_types.h:4,
  481. from include/uapi/linux/types.h:13,
  482. from include/linux/types.h:5,
  483. from include/uapi/linux/capability.h:16,
  484. from include/linux/capability.h:15,
  485. from include/linux/sched.h:13,
  486. from include/linux/utsname.h:5,
  487. from /usr/src/sgfxi-downloads/NVIDIA-Linux-x86_64-331.20/kernel/nv-linux.h:44,
  488. from /usr/src/sgfxi-downloads/NVIDIA-Linux-x86_64-331.20/kernel/nv-cray.c:15:
  489. /usr/src/linux-headers-3.11-2.slh.2-aptosid-amd64/arch/x86/include/asm/uaccess_64.h: In function ‘copy_from_user’:
  490. /usr/src/linux-headers-3.11-2.slh.2-aptosid-amd64/arch/x86/include/asm/uaccess_64.h:62:28: warning: comparison between signed and unsigned integer expressions [-Wsign-compare]
  491. if (likely(sz == -1 || sz >= n))
  492. ^
  493. include/linux/compiler.h:152:40: note: in definition of macro ‘likely’
  494. # define likely(x) __builtin_expect(!!(x), 1)
  495. ^
  496. /usr/bin/gcc-4.8 -Wp,-MD,/usr/src/sgfxi-downloads/NVIDIA-Linux-x86_64-331.20/kernel/.nv-drm.o.d -nostdinc -isystem /usr/lib/gcc/x86_64-linux-gnu/4.8/include -I/usr/src/linux-headers-3.11-2.slh.2-aptosid-amd64/arch/x86/include -Iarch/x86/include/generated -Iinclude -I/usr/src/linux-headers-3.11-2.slh.
  497. 2-aptosid-amd64/arch/x86/include/uapi -Iarch/x86/include/generated/uapi -I/usr/src/linux-headers-3.11-2.slh.2-aptosid-amd64/include/uapi -Iinclude/generated/uapi -include /usr/src/linux-headers-3.11-2.slh.2-aptosid-amd64/include/linux/kconfig.h -D__KERNEL__ -Wall -Wundef -Wstrict-prototypes -Wno-trigraphs -fno-strict-aliasing -fno-common -Werror-implicit-function-declaration -Wno-format-security -fno-delete-null-pointer-checks -Os -Wno-maybe-uninitialized -m64 -mno-sse -mpreferred-stack-boundary=3 -mtune=generic -mno-red-zone -mcmodel=kernel -funit-at-a-time -maccumulate-outgoing-args -fstack-protector -DCONFIG_AS_CFI=1 -DCONFIG_AS_CFI_SIGNAL_FRAME=1 -DCONFIG_AS_CFI_SECTIONS=1 -DCONFIG_AS_FXSAVEQ=1 -DCONFIG_AS_AVX=1 -DCONFIG_AS_AVX2=1 -pipe -Wno-sign-compare -fno-asynchronous-unwind-tables -mno-sse -mno-mmx -mno-sse2 -mno-3dnow -mno-avx -Wframe-larger-than=2048 -Wno-unused-but-set-variable -fomit-frame-pointer -Wdeclaration-after-statement -Wno-pointer-sign -fno-strict-overflow -fconserve-stack -DCC_HAVE_
  498. ASM_
  499. GOTO -DNV_MODULE_INSTANCE=0 -DNV_BUILD_MODULE_INSTANCES=0 -UDEBUG -U_DEBUG -DNDEBUG -I/usr/src/sgfxi-downloads/NVIDIA-Linux-x86_64-331.20/kernel -Wall -MD -Wsign-compare -Wno-cast-qual -Wno-error -D__KERNEL__ -DMODULE -DNVRM -DNV_VERSION_STRING=\"331.20\" -Wno-unused-function -Wuninitialized -mno-red-zone -mcmodel=kernel -DNV_UVM_ENABLE -D__linux__ -DNV_DEV_NAME=\"nvidia\" -DMODULE -D"KBUILD_STR(s)=#s" -D"KBUILD_BASENAME=KBUILD_STR(nv_drm)" -D"KBUILD_MODNAME=KBUILD_STR(nvidia)" -c -o /usr/src/sgfxi-downloads/NVIDIA-Linux-x86_64-331.20/kernel/.tmp_nv-drm.o /usr/src/sgfxi-downloads/NVIDIA-Linux-x86_64-331.20/kernel/nv-drm.c
  500. In file included from /usr/src/linux-headers-3.11-2.slh.2-aptosid-amd64/arch/x86/include/asm/bitops.h:514:0,
  501. from include/linux/bitops.h:22,
  502. from include/linux/kernel.h:10,
  503. from include/linux/sched.h:15,
  504. from include/linux/utsname.h:5,
  505. from /usr/src/sgfxi-downloads/NVIDIA-Linux-x86_64-331.20/kernel/nv-linux.h:44,
  506. from /usr/src/sgfxi-downloads/NVIDIA-Linux-x86_64-331.20/kernel/nv-drm.c:15:
  507. include/linux/bitops.h: In function ‘hweight_long’:
  508. include/asm-generic/bitops/const_hweight.h:27:70: warning: signed and unsigned type in conditional expression [-Wsign-compare]
  509. #define hweight64(w) (__builtin_constant_p(w) ? __const_hweight64(w) : __arch_hweight64(w))
  510. ^
  511. include/linux/bitops.h:66:41: note: in expansion of macro ‘hweight64’
  512. return sizeof(w) == 4 ? hweight32(w) : hweight64(w);
  513. ^
  514. In file included from /usr/src/linux-headers-3.11-2.slh.2-aptosid-amd64/arch/x86/include/asm/cpumask.h:4:0,
  515. from /usr/src/linux-headers-3.11-2.slh.2-aptosid-amd64/arch/x86/include/asm/msr.h:10,
  516. from /usr/src/linux-headers-3.11-2.slh.2-aptosid-amd64/arch/x86/include/asm/processor.h:20,
  517. from /usr/src/linux-headers-3.11-2.slh.2-aptosid-amd64/arch/x86/include/asm/thread_info.h:22,
  518. from include/linux/thread_info.h:54,
  519. from include/linux/preempt.h:9,
  520. from include/linux/spinlock.h:50,
  521. from include/linux/seqlock.h:29,
  522. from include/linux/time.h:5,
  523. from include/uapi/linux/timex.h:56,
  524. from include/linux/timex.h:56,
  525. from include/linux/sched.h:17,
  526. from include/linux/utsname.h:5,
  527. from /usr/src/sgfxi-downloads/NVIDIA-Linux-x86_64-331.20/kernel/nv-linux.h:44,
  528. from /usr/src/sgfxi-downloads/NVIDIA-Linux-x86_64-331.20/kernel/nv-drm.c:15:
  529. include/linux/cpumask.h: In function ‘cpumask_parse’:
  530. include/linux/cpumask.h:603:26: warning: signed and unsigned type in conditional expression [-Wsign-compare]
  531. int len = nl ? nl - buf : strlen(buf);
  532. ^
  533. In file included from include/uapi/linux/stddef.h:1:0,
  534. from include/linux/stddef.h:4,
  535. from /usr/src/linux-headers-3.11-2.slh.2-aptosid-amd64/include/uapi/linux/posix_types.h:4,
  536. from include/uapi/linux/types.h:13,
  537. from include/linux/types.h:5,
  538. from include/uapi/linux/capability.h:16,
  539. from include/linux/capability.h:15,
  540. from include/linux/sched.h:13,
  541. from include/linux/utsname.h:5,
  542. from /usr/src/sgfxi-downloads/NVIDIA-Linux-x86_64-331.20/kernel/nv-linux.h:44,
  543. from /usr/src/sgfxi-downloads/NVIDIA-Linux-x86_64-331.20/kernel/nv-drm.c:15:
  544. /usr/src/linux-headers-3.11-2.slh.2-aptosid-amd64/arch/x86/include/asm/uaccess_64.h: In function ‘copy_from_user’:
  545. /usr/src/linux-headers-3.11-2.slh.2-aptosid-amd64/arch/x86/include/asm/uaccess_64.h:62:28: warning: comparison between signed and unsigned integer expressions [-Wsign-compare]
  546. if (likely(sz == -1 || sz >= n))
  547. ^
  548. include/linux/compiler.h:152:40: note: in definition of macro ‘likely’
  549. # define likely(x) __builtin_expect(!!(x), 1)
  550. ^
  551. In file included from include/drm/drm_crtc.h:32:0,
  552. from include/drm/drmP.h:688,
  553. from /usr/src/sgfxi-downloads/NVIDIA-Linux-x86_64-331.20/kernel/nv-drm.c:19:
  554. include/linux/fb.h: In function ‘__fb_pad_aligned_buffer’:
  555. include/linux/fb.h:650:17: warning: comparison between signed and unsigned integer expressions [-Wsign-compare]
  556. for (j = 0; j < s_pitch; j++)
  557. ^
  558. /usr/bin/gcc-4.8 -Wp,-MD,/usr/src/sgfxi-downloads/NVIDIA-Linux-x86_64-331.20/kernel/.nv-gvi.o.d -nostdinc -isystem /usr/lib/gcc/x86_64-linux-gnu/4.8/include -I/usr/src/linux-headers-3.11-2.slh.2-aptosid-amd64/arch/x86/include -Iarch/x86/include/generated -Iinclude -I/usr/src/linux-headers-3.11-2.slh.2-aptosid-amd64/arch/x86/include/uapi -Iarch/x86/include/generated/uapi -I/usr/src/linux-headers-3.11-2.slh.2-aptosid-amd64/include/uapi -Iinclude/generated/uapi -include /usr/src/linux-headers-3.11-2.slh.2-aptos
  559. id-amd64/include/linux/kconfig.h -D__KERNEL__ -Wall -Wundef -Wstrict-prototypes -Wno-trigraphs -fno-strict-aliasing -fno-common -Werror-implicit-function-declaration -Wno-format-security -fno-delete-null-pointer-checks -Os -Wno-maybe-uninitialized -m64 -mno-sse -mpreferred-stack-boundary=3 -mtune=generic -mno-red-zone -mcmodel=kernel -funit-at-a-time -maccumulate-outgoing-args -fstack-protector -DCONFIG_AS_CFI=1 -DCONFIG_AS_CFI_SIGNAL_FRAME=1 -DCONFIG_AS_CFI_SECTIONS=1 -DCONFIG_AS_FXSAVEQ=1 -DCONFIG_AS_AVX=1 -DCONFIG_AS_AVX2=1 -pipe -Wno-sign-compare -fno-asynchronous-unwind-tables -mno-sse -mno-mmx -mno-sse2 -mno-3dnow -mno-avx -Wframe-larger-than=2048 -Wno-unused-but-set-variable -fomit-frame-pointer -Wdeclaration-after-statement -Wno-pointer-sign -fno-strict-overflow -fconserve-stack -DCC_HAVE_ASM_GOTO -DNV_MODULE_INSTANCE=0 -DNV_BUILD_MODULE_INSTANCES=0 -UDEBUG -U_DEBUG -DNDEBUG -I/usr/src/sgfxi-downloads/NVIDIA-Linux-x86_64-331.20/kernel -Wall -MD -Wsign-compare -Wno-cast-qual -Wno-error -D__KERNEL__
  560. -DM
  561. ODULE -DNVRM -DNV_VERSION_STRING=\"331.20\" -Wno-unused-function -Wuninitialized -mno-red-zone -mcmodel=kernel -DNV_UVM_ENABLE -D__linux__ -DNV_DEV_NAME=\"nvidia\" -DMODULE -D"KBUILD_STR(s)=#s" -D"KBUILD_BASENAME=KBUILD_STR(nv_gvi)" -D"KBUILD_MODNAME=KBUILD_STR(nvidia)" -c -o /usr/src/sgfxi-downloads/NVIDIA-Linux-x86_64-331.20/kernel/.tmp_nv-gvi.o /usr/src/sgfxi-downloads/NVIDIA-Linux-x86_64-331.20/kernel/nv-gvi.c
  562. In file included from /usr/src/linux-headers-3.11-2.slh.2-aptosid-amd64/arch/x86/include/asm/bitops.h:514:0,
  563. from include/linux/bitops.h:22,
  564. from include/linux/kernel.h:10,
  565. from include/linux/sched.h:15,
  566. from include/linux/utsname.h:5,
  567. from /usr/src/sgfxi-downloads/NVIDIA-Linux-x86_64-331.20/kernel/nv-linux.h:44,
  568. from /usr/src/sgfxi-downloads/NVIDIA-Linux-x86_64-331.20/kernel/nv-gvi.c:15:
  569. include/linux/bitops.h: In function ‘hweight_long’:
  570. include/asm-generic/bitops/const_hweight.h:27:70: warning: signed and unsigned type in conditional expression [-Wsign-compare]
  571. #define hweight64(w) (__builtin_constant_p(w) ? __const_hweight64(w) : __arch_hweight64(w))
  572. ^
  573. include/linux/bitops.h:66:41: note: in expansion of macro ‘hweight64’
  574. return sizeof(w) == 4 ? hweight32(w) : hweight64(w);
  575. ^
  576. In file included from /usr/src/linux-headers-3.11-2.slh.2-aptosid-amd64/arch/x86/include/asm/cpumask.h:4:0,
  577. from /usr/src/linux-headers-3.11-2.slh.2-aptosid-amd64/arch/x86/include/asm/msr.h:10,
  578. from /usr/src/linux-headers-3.11-2.slh.2-aptosid-amd64/arch/x86/include/asm/processor.h:20,
  579. from /usr/src/linux-headers-3.11-2.slh.2-aptosid-amd64/arch/x86/include/asm/thread_info.h:22,
  580. from include/linux/thread_info.h:54,
  581. from include/linux/preempt.h:9,
  582. from include/linux/spinlock.h:50,
  583. from include/linux/seqlock.h:29,
  584. from include/linux/time.h:5,
  585. from include/uapi/linux/timex.h:56,
  586. from include/linux/timex.h:56,
  587. from include/linux/sched.h:17,
  588. from include/linux/utsname.h:5,
  589. from /usr/src/sgfxi-downloads/NVIDIA-Linux-x86_64-331.20/kernel/nv-linux.h:44,
  590. from /usr/src/sgfxi-downloads/NVIDIA-Linux-x86_64-331.20/kernel/nv-gvi.c:15:
  591. include/linux/cpumask.h: In function ‘cpumask_parse’:
  592. include/linux/cpumask.h:603:26: warning: signed and unsigned type in conditional expression [-Wsign-compare]
  593. int len = nl ? nl - buf : strlen(buf);
  594. ^
  595. In file included from include/uapi/linux/stddef.h:1:0,
  596. from include/linux/stddef.h:4,
  597. from /usr/src/linux-headers-3.11-2.slh.2-aptosid-amd64/include/uapi/linux/posix_types.h:4,
  598. from include/uapi/linux/types.h:13,
  599. from include/linux/types.h:5,
  600. from include/uapi/linux/capability.h:16,
  601. from include/linux/capability.h:15,
  602. from include/linux/sched.h:13,
  603. from include/linux/utsname.h:5,
  604. from /usr/src/sgfxi-downloads/NVIDIA-Linux-x86_64-331.20/kernel/nv-linux.h:44,
  605. from /usr/src/sgfxi-downloads/NVIDIA-Linux-x86_64-331.20/kernel/nv-gvi.c:15:
  606. /usr/src/linux-headers-3.11-2.slh.2-aptosid-amd64/arch/x86/include/asm/uaccess_64.h: In function ‘copy_from_user’:
  607. /usr/src/linux-headers-3.11-2.slh.2-aptosid-amd64/arch/x86/include/asm/uaccess_64.h:62:28: warning: comparison between signed and unsigned integer expressions [-Wsign-compare]
  608. if (likely(sz == -1 || sz >= n))
  609. ^
  610. include/linux/compiler.h:152:40: note: in definition of macro ‘likely’
  611. # define likely(x) __builtin_expect(!!(x), 1)
  612. ^
  613. /usr/bin/gcc-4.8 -Wp,-MD,/usr/src/sgfxi-downloads/NVIDIA-Linux-x86_64-331.20/kernel/.nv-i2c.o.d -nostdinc -isystem /usr/lib/gcc/x86_64-linux-gnu/4.8/include -I/usr/src/linux-headers-3.11-2.slh.2-aptosid-amd64/arch/x86/include -Iarch/x86/include/generated -Iinclude -I/usr/src/linux-headers-3.11-2.slh.2-aptosid-amd64/arch/x86/include/uapi -Iarch/x86/include/generated/uapi -I/usr/src/linux-headers-3.11-2.slh.2-aptosid-amd64/include/uapi -Iinclude/generated/uapi -include /usr/src/linux-headers-3.11-2.slh.2-aptosid-amd64/include/linux/kconfig.h -D__KERNEL__ -Wall -Wundef -Wstrict-prototypes -Wno-trigraphs -fno-strict-aliasing -fno-common -Werror-implicit-function-declaration -Wno-format-security -fno-delete-null-pointer-checks -Os -Wno-maybe-uninitialized -m64 -mno-sse -mpreferred-stack-boundary=3 -mtune=generic -mno-red-zone -mcmodel=kernel -funit-at-a-time -maccumulate-outgoing-args -fstack-protector -DCONFIG_AS_CFI=1 -DCONFIG_AS_CFI_SIGNAL_FRAME=1 -DCONFIG_AS_CFI_SECTIONS=1 -DCONFIG_AS_FXSAVEQ=1 -
  614. DCONFIG_AS_AVX=1 -DCONFIG_AS_AVX2=1 -pipe -Wno-sign-compare -fno-asynchronous-unwind-tables -mno-sse -mno-mmx -mno-sse2 -mno-3dnow -m
  615. no-avx -Wframe-larger-than=2048 -Wno-unused-but-set-variable -fomit-frame-pointer -Wdeclaration-after-statement -Wno-pointer-sign -fno-strict-overflow -fconserve-stack -DCC_HAVE_ASM_GOTO -DNV_MODULE_INSTANCE=0 -DNV_BUILD_MODULE_INSTANCES=0 -UDEBUG -U_DEBUG -DNDEBUG -I/usr/src/sgfxi-downloads/NVIDIA-Linux-x86_64-331.20/kernel -Wall -MD -Wsign-compare -Wno-cast-qual -Wno-error -D__KERNEL__ -DMODULE -DNVRM -DNV_VERSION_STRING=\"331.20\" -Wno-unused-function -Wuninitialized -mno-red-zone -mcmodel=kernel -DNV_UVM_ENABLE -D__linux__ -DNV_DEV_NAME=\"nvidia\" -DMODULE -D"KBUILD_STR(s)=#s" -D"KBUILD_BASENAME=KBUILD_STR(nv_i2c)" -D"KBUILD_MODNAME=KBUILD_STR(nvidia)" -c -o /usr/src/sgfxi-downloads/NVIDIA-Linux-x86_64-331.20/kernel/.tmp_nv-i2c.o /usr/src/sgfxi-downloads/NVIDIA-Linux-x86_64-331.20/kernel/nv-i2c.c
  616. In file included from /usr/src/linux-headers-3.11-2.slh.2-aptosid-amd64/arch/x86/include/asm/bitops.h:514:0,
  617. from include/linux/bitops.h:22,
  618. from include/linux/kernel.h:10,
  619. from include/linux/sched.h:15,
  620. from include/linux/utsname.h:5,
  621. from /usr/src/sgfxi-downloads/NVIDIA-Linux-x86_64-331.20/kernel/nv-linux.h:44,
  622. from /usr/src/sgfxi-downloads/NVIDIA-Linux-x86_64-331.20/kernel/nv-i2c.c:15:
  623. include/linux/bitops.h: In function ‘hweight_long’:
  624. include/asm-generic/bitops/const_hweight.h:27:70: warning: signed and unsigned type in conditional expression [-Wsign-compare]
  625. #define hweight64(w) (__builtin_constant_p(w) ? __const_hweight64(w) : __arch_hweight64(w))
  626. ^
  627. include/linux/bitops.h:66:41: note: in expansion of macro ‘hweight64’
  628. return sizeof(w) == 4 ? hweight32(w) : hweight64(w);
  629. ^
  630. In file included from /usr/src/linux-headers-3.11-2.slh.2-aptosid-amd64/arch/x86/include/asm/cpumask.h:4:0,
  631. from /usr/src/linux-headers-3.11-2.slh.2-aptosid-amd64/arch/x86/include/asm/msr.h:10,
  632. from /usr/src/linux-headers-3.11-2.slh.2-aptosid-amd64/arch/x86/include/asm/processor.h:20,
  633. from /usr/src/linux-headers-3.11-2.slh.2-aptosid-amd64/arch/x86/include/asm/thread_info.h:22,
  634. from include/linux/thread_info.h:54,
  635. from include/linux/preempt.h:9,
  636. from include/linux/spinlock.h:50,
  637. from include/linux/seqlock.h:29,
  638. from include/linux/time.h:5,
  639. from include/uapi/linux/timex.h:56,
  640. from include/linux/timex.h:56,
  641. from include/linux/sched.h:17,
  642. from include/linux/utsname.h:5,
  643. from /usr/src/sgfxi-downloads/NVIDIA-Linux-x86_64-331.20/kernel/nv-linux.h:44,
  644. from /usr/src/sgfxi-downloads/NVIDIA-Linux-x86_64-331.20/kernel/nv-i2c.c:15:
  645. include/linux/cpumask.h: In function ‘cpumask_parse’:
  646. include/linux/cpumask.h:603:26: warning: signed and unsigned type in conditional expression [-Wsign-compare]
  647. int len = nl ? nl - buf : strlen(buf);
  648. ^
  649. In file included from include/uapi/linux/stddef.h:1:0,
  650. from include/linux/stddef.h:4,
  651. from /usr/src/linux-headers-3.11-2.slh.2-aptosid-amd64/include/uapi/linux/posix_types.h:4,
  652. from include/uapi/linux/types.h:13,
  653. from include/linux/types.h:5,
  654. from include/uapi/linux/capability.h:16,
  655. from include/linux/capability.h:15,
  656. from include/linux/sched.h:13,
  657. from include/linux/utsname.h:5,
  658. from /usr/src/sgfxi-downloads/NVIDIA-Linux-x86_64-331.20/kernel/nv-linux.h:44,
  659. from /usr/src/sgfxi-downloads/NVIDIA-Linux-x86_64-331.20/kernel/nv-i2c.c:15:
  660. /usr/src/linux-headers-3.11-2.slh.2-aptosid-amd64/arch/x86/include/asm/uaccess_64.h: In function ‘copy_from_user’:
  661. /usr/src/linux-headers-3.11-2.slh.2-aptosid-amd64/arch/x86/include/asm/uaccess_64.h:62:28: warning: comparison between signed and unsigned integer expressions [-Wsign-compare]
  662. if (likely(sz == -1 || sz >= n))
  663. ^
  664. include/linux/compiler.h:152:40: note: in definition of macro ‘likely’
  665. # define likely(x) __builtin_expect(!!(x), 1)
  666. ^
  667. /usr/bin/gcc-4.8 -Wp,-MD,/usr/src/sgfxi-downloads/NVIDIA-Linux-x86_64-331.20/kernel/.nv-mempool.o.d -nostdinc -isystem /usr/lib/gcc/x86_64-linux-gnu/4.8/include -I/usr/src/linux-headers-3.11-2.slh.2-aptosid-amd64/arch/x86/include -Iarch/x86/include/generated -Iinclude -I/usr/src/linux-headers-3.11-2.slh.2-aptosid-amd64/arch/x86/include/uapi -Iarch/x86/include/generated/uapi -I/usr/src/linux-headers-3.11-2.slh.2-aptosid-amd64/include/uapi -Iinclude/generated/uapi -include /usr/src/linux-headers-3.11-2.slh.2-aptosid-amd64/include/linux/kconfig.h -D__KERNEL__ -Wall -Wundef -Wstrict-prototypes -Wno-trigraphs -fno-strict-aliasing -fno-common -Werror-implicit-function-declaration -Wno-format-security -fno-delete-null-pointer-checks -Os -Wno-mayb
  668. e-uninitialized -m64 -mno-sse -mpreferred-stack-boundary=3 -mtune=generic -mno-red-zone -mcmodel=kernel -funit-at-a-time -maccumulate-outgoing-args -fstack-protector -DCONFIG_AS_CFI=1 -DCONFIG_AS_CFI_SIGNAL_FRAME=1 -DCONFIG_AS_CFI_SECTIONS=1 -DCONFIG_AS_FXSAVEQ=1 -DCONFIG_AS_AVX=1 -DCONFIG_AS_AVX2=1 -pipe -Wno-sign-compare -fno-asynchronous-unwind-tables -mno-sse -mno-mmx -mno-sse2 -mno-3dnow -mno-avx -Wframe-larger-than=2048 -Wno-unused-but-set-variable -fomit-frame-pointer -Wdeclaration-after-statement -Wno-pointer-sign -fno-strict-overflow -fconserve-stack -DCC_HAVE_ASM_GOTO -DNV_MODULE_INSTANCE=0 -DNV_BUILD_MODULE_INSTANCES=0 -UDEBUG -U_DEBUG -DNDEBUG -I/usr/src/sgfxi-downloads/NVIDIA-Linux-x86_64-331.20/kernel -Wall -MD -Wsign-compare -Wno-cast-qual -Wno-error -D__KERNEL__ -DMODULE -DNVRM -DNV_VERSION_STRING=\"331.20\" -Wno-unused-function -Wuninitialized -mno-red-zone -mcmodel=kernel -DNV_UVM_ENABLE -D__linux__ -DNV_DEV_NAME=\"nvidia\" -DMODULE -D"KBUILD_STR(s)=#s" -D"KBUILD_BASENAME=KBUILD_STR(nv_
  669. mem
  670. pool)" -D"KBUILD_MODNAME=KBUILD_STR(nvidia)" -c -o /usr/src/sgfxi-downloads/NVIDIA-Linux-x86_64-331.20/kernel/.tmp_nv-mempool.o /usr/src/sgfxi-downloads/NVIDIA-Linux-x86_64-331.20/kernel/nv-mempool.c
  671. In file included from /usr/src/linux-headers-3.11-2.slh.2-aptosid-amd64/arch/x86/include/asm/bitops.h:514:0,
  672. from include/linux/bitops.h:22,
  673. from include/linux/kernel.h:10,
  674. from include/linux/sched.h:15,
  675. from include/linux/utsname.h:5,
  676. from /usr/src/sgfxi-downloads/NVIDIA-Linux-x86_64-331.20/kernel/nv-linux.h:44,
  677. from /usr/src/sgfxi-downloads/NVIDIA-Linux-x86_64-331.20/kernel/nv-mempool.c:15:
  678. include/linux/bitops.h: In function ‘hweight_long’:
  679. include/asm-generic/bitops/const_hweight.h:27:70: warning: signed and unsigned type in conditional expression [-Wsign-compare]
  680. #define hweight64(w) (__builtin_constant_p(w) ? __const_hweight64(w) : __arch_hweight64(w))
  681. ^
  682. include/linux/bitops.h:66:41: note: in expansion of macro ‘hweight64’
  683. return sizeof(w) == 4 ? hweight32(w) : hweight64(w);
  684. ^
  685. In file included from /usr/src/linux-headers-3.11-2.slh.2-aptosid-amd64/arch/x86/include/asm/cpumask.h:4:0,
  686. from /usr/src/linux-headers-3.11-2.slh.2-aptosid-amd64/arch/x86/include/asm/msr.h:10,
  687. from /usr/src/linux-headers-3.11-2.slh.2-aptosid-amd64/arch/x86/include/asm/processor.h:20,
  688. from /usr/src/linux-headers-3.11-2.slh.2-aptosid-amd64/arch/x86/include/asm/thread_info.h:22,
  689. from include/linux/thread_info.h:54,
  690. from include/linux/preempt.h:9,
  691. from include/linux/spinlock.h:50,
  692. from include/linux/seqlock.h:29,
  693. from include/linux/time.h:5,
  694. from include/uapi/linux/timex.h:56,
  695. from include/linux/timex.h:56,
  696. from include/linux/sched.h:17,
  697. from include/linux/utsname.h:5,
  698. from /usr/src/sgfxi-downloads/NVIDIA-Linux-x86_64-331.20/kernel/nv-linux.h:44,
  699. from /usr/src/sgfxi-downloads/NVIDIA-Linux-x86_64-331.20/kernel/nv-mempool.c:15:
  700. include/linux/cpumask.h: In function ‘cpumask_parse’:
  701. include/linux/cpumask.h:603:26: warning: signed and unsigned type in conditional expression [-Wsign-compare]
  702. int len = nl ? nl - buf : strlen(buf);
  703. ^
  704. In file included from include/uapi/linux/stddef.h:1:0,
  705. from include/linux/stddef.h:4,
  706. from /usr/src/linux-headers-3.11-2.slh.2-aptosid-amd64/include/uapi/linux/posix_types.h:4,
  707. from include/uapi/linux/types.h:13,
  708. from include/linux/types.h:5,
  709. from include/uapi/linux/capability.h:16,
  710. from include/linux/capability.h:15,
  711. from include/linux/sched.h:13,
  712. from include/linux/utsname.h:5,
  713. from /usr/src/sgfxi-downloads/NVIDIA-Linux-x86_64-331.20/kernel/nv-linux.h:44,
  714. from /usr/src/sgfxi-downloads/NVIDIA-Linux-x86_64-331.20/kernel/nv-mempool.c:15:
  715. /usr/src/linux-headers-3.11-2.slh.2-aptosid-amd64/arch/x86/include/asm/uaccess_64.h: In function ‘copy_from_user’:
  716. /usr/src/linux-headers-3.11-2.slh.2-aptosid-amd64/arch/x86/include/asm/uaccess_64.h:62:28: warning: comparison between signed and unsigned integer expressions [-Wsign-compare]
  717. if (likely(sz == -1 || sz >= n))
  718. ^
  719. include/linux/compiler.h:152:40: note: in definition of macro ‘likely’
  720. # define likely(x) __builtin_expect(!!(x), 1)
  721. ^
  722. /usr/bin/gcc-4.8 -Wp,-MD,/usr/src/sgfxi-downloads/NVIDIA-Linux-x86_64-331.20/kernel/.nv-mlock.o.d -nostdinc -isystem /usr/lib/gcc/x86_64-linux-gnu/4.8/include -I/usr/src/linux-headers-3.11-2.slh.2-aptosid-amd64/arch/x86/include -Iarch/x86/include/generated -Iinclude -I/usr/src/linux-headers-3.11-2.slh.2-aptosid-amd64/arch/x86
  723. /include/uapi -Iarch/x86/include/generated/uapi -I/usr/src/linux-headers-3.11-2.slh.2-aptosid-amd64/include/uapi -Iinclude/generated/uapi -include /usr/src/linux-headers-3.11-2.slh.2-aptosid-amd64/include/linux/kconfig.h -D__KERNEL__ -Wall -Wundef -Wstrict-prototypes -Wno-trigraphs -fno-strict-aliasing -fno-common -Werror-implicit-function-declaration -Wno-format-security -fno-delete-null-pointer-checks -Os -Wno-maybe-uninitialized -m64 -mno-sse -mpreferred-stack-boundary=3 -mtune=generic -mno-red-zone -mcmodel=kernel -funit-at-a-time -maccumulate-outgoing-args -fstack-protector -DCONFIG_AS_CFI=1 -DCONFIG_AS_CFI_SIGNAL_FRAME=1 -DCONFIG_AS_CFI_SECTIONS=1 -DCONFIG_AS_FXSAVEQ=1 -DCONFIG_AS_AVX=1 -DCONFIG_AS_AVX2=1 -pipe -Wno-sign-compare -fno-asynchronous-unwind-tables -mno-sse -mno-mmx -mno-sse2 -mno-3dnow -mno-avx -Wframe-larger-than=2048 -Wno-unused-but-set-variable -fomit-frame-pointer -Wdeclaration-after-statement -Wno-pointer-sign -fno-strict-overflow -fconserve-stack -DCC_HAVE_ASM_GOTO -DNV_MODULE_
  724. INSTANC
  725. E=0 -DNV_BUILD_MODULE_INSTANCES=0 -UDEBUG -U_DEBUG -DNDEBUG -I/usr/src/sgfxi-downloads/NVIDIA-Linux-x86_64-331.20/kernel -Wall -MD -Wsign-compare -Wno-cast-qual -Wno-error -D__KERNEL__ -DMODULE -DNVRM -DNV_VERSION_STRING=\"331.20\" -Wno-unused-function -Wuninitialized -mno-red-zone -mcmodel=kernel -DNV_UVM_ENABLE -D__linux__ -DNV_DEV_NAME=\"nvidia\" -DMODULE -D"KBUILD_STR(s)=#s" -D"KBUILD_BASENAME=KBUILD_STR(nv_mlock)" -D"KBUILD_MODNAME=KBUILD_STR(nvidia)" -c -o /usr/src/sgfxi-downloads/NVIDIA-Linux-x86_64-331.20/kernel/.tmp_nv-mlock.o /usr/src/sgfxi-downloads/NVIDIA-Linux-x86_64-331.20/kernel/nv-mlock.c
  726. In file included from /usr/src/linux-headers-3.11-2.slh.2-aptosid-amd64/arch/x86/include/asm/bitops.h:514:0,
  727. from include/linux/bitops.h:22,
  728. from include/linux/kernel.h:10,
  729. from include/linux/sched.h:15,
  730. from include/linux/utsname.h:5,
  731. from /usr/src/sgfxi-downloads/NVIDIA-Linux-x86_64-331.20/kernel/nv-linux.h:44,
  732. from /usr/src/sgfxi-downloads/NVIDIA-Linux-x86_64-331.20/kernel/nv-mlock.c:15:
  733. include/linux/bitops.h: In function ‘hweight_long’:
  734. include/asm-generic/bitops/const_hweight.h:27:70: warning: signed and unsigned type in conditional expression [-Wsign-compare]
  735. #define hweight64(w) (__builtin_constant_p(w) ? __const_hweight64(w) : __arch_hweight64(w))
  736. ^
  737. include/linux/bitops.h:66:41: note: in expansion of macro ‘hweight64’
  738. return sizeof(w) == 4 ? hweight32(w) : hweight64(w);
  739. ^
  740. In file included from /usr/src/linux-headers-3.11-2.slh.2-aptosid-amd64/arch/x86/include/asm/cpumask.h:4:0,
  741. from /usr/src/linux-headers-3.11-2.slh.2-aptosid-amd64/arch/x86/include/asm/msr.h:10,
  742. from /usr/src/linux-headers-3.11-2.slh.2-aptosid-amd64/arch/x86/include/asm/processor.h:20,
  743. from /usr/src/linux-headers-3.11-2.slh.2-aptosid-amd64/arch/x86/include/asm/thread_info.h:22,
  744. from include/linux/thread_info.h:54,
  745. from include/linux/preempt.h:9,
  746. from include/linux/spinlock.h:50,
  747. from include/linux/seqlock.h:29,
  748. from include/linux/time.h:5,
  749. from include/uapi/linux/timex.h:56,
  750. from include/linux/timex.h:56,
  751. from include/linux/sched.h:17,
  752. from include/linux/utsname.h:5,
  753. from /usr/src/sgfxi-downloads/NVIDIA-Linux-x86_64-331.20/kernel/nv-linux.h:44,
  754. from /usr/src/sgfxi-downloads/NVIDIA-Linux-x86_64-331.20/kernel/nv-mlock.c:15:
  755. include/linux/cpumask.h: In function ‘cpumask_parse’:
  756. include/linux/cpumask.h:603:26: warning: signed and unsigned type in conditional expression [-Wsign-compare]
  757. int len = nl ? nl - buf : strlen(buf);
  758. ^
  759. In file included from include/uapi/linux/stddef.h:1:0,
  760. from include/linux/stddef.h:4,
  761. from /usr/src/linux-headers-3.11-2.slh.2-aptosid-amd64/include/uapi/linux/posix_types.h:4,
  762. from include/uapi/linux/types.h:13,
  763. from include/linux/types.h:5,
  764. from include/uapi/linux/capability.h:16,
  765. from include/linux/capability.h:15,
  766. from include/linux/sched.h:13,
  767. from include/linux/utsname.h:5,
  768. from /usr/src/sgfxi-downloads/NVIDIA-Linux-x86_64-331.20/kernel/nv-linux.h:44,
  769. from /usr/src/sgfxi-downloads/NVIDIA-Linux-x86_64-331.20/kernel/nv-mlock.c:15:
  770. /usr/src/linux-headers-3.11-2.slh.2-aptosid-amd64/arch/x86/include/asm/uaccess_64.h: In function ‘copy_from_user’:
  771. /usr/src/linux-headers-3.11-2.slh.2-aptosid-amd64/arch/x86/include/asm/uaccess_64.h:62:28: warning: comparison between signed and unsigned integer expressions [-Wsign-compare]
  772. if (likely(sz == -1 || sz >= n))
  773. ^
  774. include/linux/compiler.h:152:40: note: in definition of macro ‘likely’
  775. # define likely(x) __builtin_expect(!!(x), 1)
  776. ^
  777. /usr/bin/gcc-4.8 -Wp,-MD,/usr/src/sgfxi-downloads/NVIDIA-Linux-x86_64-331.20/kernel/.nv-mmap.o.d -nostdinc -isystem /usr/lib/gcc/x86_64-linux-gnu/4.8/include -I/usr/src/linux-headers-3.11-2.slh.2-aptosid-amd64/arch/x86/include -Iarch/x86/include/generated -Iinclude -I/usr/src/linux-headers-3.11-2.slh.2-aptosid-amd64/arch/x86/include/uapi -Iarch/x86/include/generated/uapi -I/usr/src/linux-headers-3.11-2.slh.2-aptosid-amd64/include/uapi -Iinclude/generated/uapi -include /usr/src/linux-headers-3.11-2.slh.2-aptosid-amd64/include/linux/kconfig.h -D__KERNEL__ -Wall -Wundef -Wstrict-prototypes -Wno-trigraphs -fno-strict-aliasing -fno-common -Werror-implicit-function-declaration -Wno-format-security -fno-delete-null-pointer-checks -Os -Wno-maybe-uninitialized -m64 -mno-sse -mpreferred-stack-boundary=3 -mtune=generic -mno-red-zone -mcmodel=kernel -funit-at-a-time -maccumulate-outgoing-args -fstack-protector -DCONFIG_AS_CFI=1 -DCONFIG_AS_C
  778. FI_SIGNAL_FRAME=1 -DCONFIG_AS_CFI_SECTIONS=1 -DCONFIG_AS_FXSAVEQ=1 -DCONFIG_AS_AVX=1 -DCONFIG_AS_AVX2=1 -pipe -Wno-sign-compare -fno-asynchronous-unwind-tables -mno-sse -mno-mmx -mno-sse2 -mno-3dnow -mno-avx -Wframe-larger-than=2048 -Wno-unused-but-set-variable -fomit-frame-pointer -Wdeclaration-after-statement -Wno-pointer-sign -fno-strict-overflow -fconserve-stack -DCC_HAVE_ASM_GOTO -DNV_MODULE_INSTANCE=0 -DNV_BUILD_MODULE_INSTANCES=0 -UDEBUG -U_DEBUG -DNDEBUG -I/usr/src/sgfxi-downloads/NVIDIA-Linux-x86_64-331.20/kernel -Wall -MD -Wsign-compare -Wno-cast-qual -Wno-error -D__KERNEL__ -DMODULE -DNVRM -DNV_VERSION_STRING=\"331.20\" -Wno-unused-function -Wuninitialized -mno-red-zone -mcmodel=kernel -DNV_UVM_ENABLE -D__linux__ -DNV_DEV_NAME=\"nvidia\" -DMODULE -D"KBUILD_STR(s)=#s" -D"KBUILD_BASENAME=KBUILD_STR(nv_mmap)" -D"KBUILD_MODNAME=KBUILD_STR(nvidia)" -c -o /usr/src/sgfxi-downloads/NVIDIA-Linux-x86_64-331.20/kernel/.tmp_nv-mmap.o /usr/src/sgfxi-downloads/NVIDIA-Linux-x86_64-331.20/kernel/nv-mmap.c
  779. In file included from /usr/src/linux-headers-3.11-2.slh.2-aptosid-amd64/arch/x86/include/asm/bitops.h:514:0,
  780. from include/linux/bitops.h:22,
  781. from include/linux/kernel.h:10,
  782. from include/linux/sched.h:15,
  783. from include/linux/utsname.h:5,
  784. from /usr/src/sgfxi-downloads/NVIDIA-Linux-x86_64-331.20/kernel/nv-linux.h:44,
  785. from /usr/src/sgfxi-downloads/NVIDIA-Linux-x86_64-331.20/kernel/nv-mmap.c:15:
  786. include/linux/bitops.h: In function ‘hweight_long’:
  787. include/asm-generic/bitops/const_hweight.h:27:70: warning: signed and unsigned type in conditional expression [-Wsign-compare]
  788. #define hweight64(w) (__builtin_constant_p(w) ? __const_hweight64(w) : __arch_hweight64(w))
  789. ^
  790. include/linux/bitops.h:66:41: note: in expansion of macro ‘hweight64’
  791. return sizeof(w) == 4 ? hweight32(w) : hweight64(w);
  792. ^
  793. In file included from /usr/src/linux-headers-3.11-2.slh.2-aptosid-amd64/arch/x86/include/asm/cpumask.h:4:0,
  794. from /usr/src/linux-headers-3.11-2.slh.2-aptosid-amd64/arch/x86/include/asm/msr.h:10,
  795. from /usr/src/linux-headers-3.11-2.slh.2-aptosid-amd64/arch/x86/include/asm/processor.h:20,
  796. from /usr/src/linux-headers-3.11-2.slh.2-aptosid-amd64/arch/x86/include/asm/thread_info.h:22,
  797. from include/linux/thread_info.h:54,
  798. from include/linux/preempt.h:9,
  799. from include/linux/spinlock.h:50,
  800. from include/linux/seqlock.h:29,
  801. from include/linux/time.h:5,
  802. from include/uapi/linux/timex.h:56,
  803. from include/linux/timex.h:56,
  804. from include/linux/sched.h:17,
  805. from include/linux/utsname.h:5,
  806. from /usr/src/sgfxi-downloads/NVIDIA-Linux-x86_64-331.20/kernel/nv-linux.h:44,
  807. from /usr/src/sgfxi-downloads/NVIDIA-Linux-x86_64-331.20/kernel/nv-mmap.c:15:
  808. include/linux/cpumask.h: In function ‘cpumask_parse’:
  809. include/linux/cpumask.h:603:26: warning: signed and unsigned type in conditional expression [-Wsign-compare]
  810. int len = nl ? nl - buf : strlen(buf);
  811. ^
  812. In file included from include/uapi/linux/stddef.h:1:0,
  813. from include/linux/stddef.h:4,
  814. from /usr/src/linux-headers-3.11-2.slh.2-aptosid-amd64/include/uapi/linux/posix_types.h:4,
  815. from include/uapi/linux/types.h:13,
  816. from include/linux/types.h:5,
  817. from include/uapi/linux/capability.h:16,
  818. from include/linux/capability.h:15,
  819. from include/linux/sched.h:13,
  820. from include/linux/utsname.h:5,
  821. from /usr/src/sgfxi-downloads/NVIDIA-Linux-x86_64-331.20/kernel/nv-linux.h:44,
  822. from /usr/src/sgfxi-downloads/NVIDIA-Linux-x86_64-331.20/kernel/nv-mmap.c:15:
  823. /usr/src/linux-headers-3.11-2.slh.2-aptosid-amd64/arch/x86/include/asm/uaccess_64.h: In function ‘copy_from_user’:
  824. /usr/src/linux-headers-3.11-2.slh.2-aptosid-amd64/arch/x86/include/asm/uaccess_64.h:62:28: warning: comparison between signed and unsigned integer expressions [-Wsign-compare]
  825. if (likely(sz == -1 || sz >= n))
  826. ^
  827. include/linux/compiler.h:152:40: note: in definition of macro ‘likely’
  828. # define likely(x) __builtin_expect(!!(x), 1)
  829. ^
  830. /usr/bin/gcc-4.8 -Wp,-MD,/usr/src/sgfxi-downloads/NVIDIA-Linux-x86_64-331.20/kernel/.nv-p2p.o.d -nostdinc -isystem /usr/lib/gcc/x86_64-linux-gnu/4.8/include -I/usr/src/linux-headers-3.11-2.slh.2-aptosid-amd64/arch/x86/include -Iarch/x86/include/generated -Iinclude -I/usr/src/linux-headers-3.11-2.slh.2-aptosid-amd64/arch/x86/include/uapi -Iarch/x86/include/generated/uapi -I/usr/src/linux-headers-3.11-2.slh.2-aptosid-amd64/include/uapi -Iinclude/generated/uapi -include /usr/src/linux-headers-3.11-2.slh.2-aptosid-amd64/include/linux/kconfi
  831. g.h -D__KERNEL__ -Wall -Wundef -Wstrict-prototypes -Wno-trigraphs -fno-strict-aliasing -fno-common -Werror-implicit-function-declaration -Wno-format-security -fno-delete-null-pointer-checks -Os -Wno-maybe-uninitialized -m64 -mno-sse -mpreferred-stack-boundary=3 -mtune=generic -mno-red-zone -mcmodel=kernel -funit-at-a-time -maccumulate-outgoing-args -fstack-protector -DCONFIG_AS_CFI=1 -DCONFIG_AS_CFI_SIGNAL_FRAME=1 -DCONFIG_AS_CFI_SECTIONS=1 -DCONFIG_AS_FXSAVEQ=1 -DCONFIG_AS_AVX=1 -DCONFIG_AS_AVX2=1 -pipe -Wno-sign-compare -fno-asynchronous-unwind-tables -mno-sse -mno-mmx -mno-sse2 -mno-3dnow -mno-avx -Wframe-larger-than=2048 -Wno-unused-but-set-variable -fomit-frame-pointer -Wdeclaration-after-statement -Wno-pointer-sign -fno-strict-overflow -fconserve-stack -DCC_HAVE_ASM_GOTO -DNV_MODULE_INSTANCE=0 -DNV_BUILD_MODULE_INSTANCES=0 -UDEBUG -U_DEBUG -DNDEBUG -I/usr/src/sgfxi-downloads/NVIDIA-Linux-x86_64-331.20/kernel -Wall -MD -Wsign-compare -Wno-cast-qual -Wno-error -D__KERNEL__ -DMODULE -DNVRM -DNV_VERSION_
  832. STR
  833. ING=\"331.20\" -Wno-unused-function -Wuninitialized -mno-red-zone -mcmodel=kernel -DNV_UVM_ENABLE -D__linux__ -DNV_DEV_NAME=\"nvidia\" -DMODULE -D"KBUILD_STR(s)=#s" -D"KBUILD_BASENAME=KBUILD_STR(nv_p2p)" -D"KBUILD_MODNAME=KBUILD_STR(nvidia)" -c -o /usr/src/sgfxi-downloads/NVIDIA-Linux-x86_64-331.20/kernel/.tmp_nv-p2p.o /usr/src/sgfxi-downloads/NVIDIA-Linux-x86_64-331.20/kernel/nv-p2p.c
  834. In file included from /usr/src/linux-headers-3.11-2.slh.2-aptosid-amd64/arch/x86/include/asm/bitops.h:514:0,
  835. from include/linux/bitops.h:22,
  836. from include/linux/kernel.h:10,
  837. from include/linux/sched.h:15,
  838. from include/linux/utsname.h:5,
  839. from /usr/src/sgfxi-downloads/NVIDIA-Linux-x86_64-331.20/kernel/nv-linux.h:44,
  840. from /usr/src/sgfxi-downloads/NVIDIA-Linux-x86_64-331.20/kernel/nv-p2p.c:15:
  841. include/linux/bitops.h: In function ‘hweight_long’:
  842. include/asm-generic/bitops/const_hweight.h:27:70: warning: signed and unsigned type in conditional expression [-Wsign-compare]
  843. #define hweight64(w) (__builtin_constant_p(w) ? __const_hweight64(w) : __arch_hweight64(w))
  844. ^
  845. include/linux/bitops.h:66:41: note: in expansion of macro ‘hweight64’
  846. return sizeof(w) == 4 ? hweight32(w) : hweight64(w);
  847. ^
  848. In file included from /usr/src/linux-headers-3.11-2.slh.2-aptosid-amd64/arch/x86/include/asm/cpumask.h:4:0,
  849. from /usr/src/linux-headers-3.11-2.slh.2-aptosid-amd64/arch/x86/include/asm/msr.h:10,
  850. from /usr/src/linux-headers-3.11-2.slh.2-aptosid-amd64/arch/x86/include/asm/processor.h:20,
  851. from /usr/src/linux-headers-3.11-2.slh.2-aptosid-amd64/arch/x86/include/asm/thread_info.h:22,
  852. from include/linux/thread_info.h:54,
  853. from include/linux/preempt.h:9,
  854. from include/linux/spinlock.h:50,
  855. from include/linux/seqlock.h:29,
  856. from include/linux/time.h:5,
  857. from include/uapi/linux/timex.h:56,
  858. from include/linux/timex.h:56,
  859. from include/linux/sched.h:17,
  860. from include/linux/utsname.h:5,
  861. from /usr/src/sgfxi-downloads/NVIDIA-Linux-x86_64-331.20/kernel/nv-linux.h:44,
  862. from /usr/src/sgfxi-downloads/NVIDIA-Linux-x86_64-331.20/kernel/nv-p2p.c:15:
  863. include/linux/cpumask.h: In function ‘cpumask_parse’:
  864. include/linux/cpumask.h:603:26: warning: signed and unsigned type in conditional expression [-Wsign-compare]
  865. int len = nl ? nl - buf : strlen(buf);
  866. ^
  867. In file included from include/uapi/linux/stddef.h:1:0,
  868. from include/linux/stddef.h:4,
  869. from /usr/src/linux-headers-3.11-2.slh.2-aptosid-amd64/include/uapi/linux/posix_types.h:4,
  870. from include/uapi/linux/types.h:13,
  871. from include/linux/types.h:5,
  872. from include/uapi/linux/capability.h:16,
  873. from include/linux/capability.h:15,
  874. from include/linux/sched.h:13,
  875. from include/linux/utsname.h:5,
  876. from /usr/src/sgfxi-downloads/NVIDIA-Linux-x86_64-331.20/kernel/nv-linux.h:44,
  877. from /usr/src/sgfxi-downloads/NVIDIA-Linux-x86_64-331.20/kernel/nv-p2p.c:15:
  878. /usr/src/linux-headers-3.11-2.slh.2-aptosid-amd64/arch/x86/include/asm/uaccess_64.h: In function ‘copy_from_user’:
  879. /usr/src/linux-headers-3.11-2.slh.2-aptosid-amd64/arch/x86/include/asm/uaccess_64.h:62:28: warning: comparison between signed and unsigned integer expressions [-Wsign-compare]
  880. if (likely(sz == -1 || sz >= n))
  881. ^
  882. include/linux/compiler.h:152:40: note: in definition of macro ‘likely’
  883. # define likely(x) __builtin_expect(!!(x), 1)
  884. ^
  885. /usr/bin/gcc-4.8 -Wp,-MD,/usr/src/sgfxi-downloads/NVIDIA-Linux-x86_64-331.20/kernel/.nv-pat.o.d -nostdinc -isystem /usr/lib/gcc/x86_64-linux-gnu/4.8/include -I/usr/src/linux-headers-3.11-2.slh.2-aptosid-amd64/arch/x86/include -Iarch/x86/include/generated -Iinclude -I/usr/src/linux-headers-3.11-2.slh.2-aptosid-amd64/arch/x86/include/uapi -Iarch/x86/include/generated/uapi -I/usr/src/linux-headers-3.11-2.slh.2-aptosid-amd64/include/uapi -Iinclude/generated/uapi -include /usr/src/linux-headers-3.11-2.slh.2-aptosid-amd64/include/linux/kconfig.h -D__KERNEL__ -Wall -Wundef -Wstrict-prototypes -Wno-trigraphs -fno-strict-aliasing -fno-common -Werror-implicit-function-declaration -Wno-format-security -fno-delete-null-pointer-checks -Os -Wno-maybe-uninitialized -m64 -mno-sse -mpreferred-stack-boundary=3 -mtune=generic -mno-red-zone -mcmodel=kernel -funit-at-a-time -maccumulate-outgoing-args -fstack-protector -DCONFIG_AS_CFI=1 -DCONFIG_AS_CFI_SIGNAL_FRAME=1 -DCONFIG_AS_CFI_SECTIONS=1 -DCONFIG_AS_FXSAVEQ=1 -
  886. DCONFIG_AS_AVX=1 -DCONFIG_AS_AVX2=1 -pipe -Wno-sign-compare -fno-asynchronous-unwind-tables -mno-sse -mno-mmx -mno-sse2 -mno-3dnow -mno-avx -Wframe-larger-than=20
  887. 48 -Wno-unused-but-set-variable -fomit-frame-pointer -Wdeclaration-after-statement -Wno-pointer-sign -fno-strict-overflow -fconserve-stack -DCC_HAVE_ASM_GOTO -DNV_MODULE_INSTANCE=0 -DNV_BUILD_MODULE_INSTANCES=0 -UDEBUG -U_DEBUG -DNDEBUG -I/usr/src/sgfxi-downloads/NVIDIA-Linux-x86_64-331.20/kernel -Wall -MD -Wsign-compare -Wno-cast-qual -Wno-error -D__KERNEL__ -DMODULE -DNVRM -DNV_VERSION_STRING=\"331.20\" -Wno-unused-function -Wuninitialized -mno-red-zone -mcmodel=kernel -DNV_UVM_ENABLE -D__linux__ -DNV_DEV_NAME=\"nvidia\" -DMODULE -D"KBUILD_STR(s)=#s" -D"KBUILD_BASENAME=KBUILD_STR(nv_pat)" -D"KBUILD_MODNAME=KBUILD_STR(nvidia)" -c -o /usr/src/sgfxi-downloads/NVIDIA-Linux-x86_64-331.20/kernel/.tmp_nv-pat.o /usr/src/sgfxi-downloads/NVIDIA-Linux-x86_64-331.20/kernel/nv-pat.c
  888. In file included from /usr/src/linux-headers-3.11-2.slh.2-aptosid-amd64/arch/x86/include/asm/bitops.h:514:0,
  889. from include/linux/bitops.h:22,
  890. from include/linux/kernel.h:10,
  891. from include/linux/sched.h:15,
  892. from include/linux/utsname.h:5,
  893. from /usr/src/sgfxi-downloads/NVIDIA-Linux-x86_64-331.20/kernel/nv-linux.h:44,
  894. from /usr/src/sgfxi-downloads/NVIDIA-Linux-x86_64-331.20/kernel/nv-pat.c:15:
  895. include/linux/bitops.h: In function ‘hweight_long’:
  896. include/asm-generic/bitops/const_hweight.h:27:70: warning: signed and unsigned type in conditional expression [-Wsign-compare]
  897. #define hweight64(w) (__builtin_constant_p(w) ? __const_hweight64(w) : __arch_hweight64(w))
  898. ^
  899. include/linux/bitops.h:66:41: note: in expansion of macro ‘hweight64’
  900. return sizeof(w) == 4 ? hweight32(w) : hweight64(w);
  901. ^
  902. In file included from /usr/src/linux-headers-3.11-2.slh.2-aptosid-amd64/arch/x86/include/asm/cpumask.h:4:0,
  903. from /usr/src/linux-headers-3.11-2.slh.2-aptosid-amd64/arch/x86/include/asm/msr.h:10,
  904. from /usr/src/linux-headers-3.11-2.slh.2-aptosid-amd64/arch/x86/include/asm/processor.h:20,
  905. from /usr/src/linux-headers-3.11-2.slh.2-aptosid-amd64/arch/x86/include/asm/thread_info.h:22,
  906. from include/linux/thread_info.h:54,
  907. from include/linux/preempt.h:9,
  908. from include/linux/spinlock.h:50,
  909. from include/linux/seqlock.h:29,
  910. from include/linux/time.h:5,
  911. from include/uapi/linux/timex.h:56,
  912. from include/linux/timex.h:56,
  913. from include/linux/sched.h:17,
  914. from include/linux/utsname.h:5,
  915. from /usr/src/sgfxi-downloads/NVIDIA-Linux-x86_64-331.20/kernel/nv-linux.h:44,
  916. from /usr/src/sgfxi-downloads/NVIDIA-Linux-x86_64-331.20/kernel/nv-pat.c:15:
  917. include/linux/cpumask.h: In function ‘cpumask_parse’:
  918. include/linux/cpumask.h:603:26: warning: signed and unsigned type in conditional expression [-Wsign-compare]
  919. int len = nl ? nl - buf : strlen(buf);
  920. ^
  921. In file included from include/uapi/linux/stddef.h:1:0,
  922. from include/linux/stddef.h:4,
  923. from /usr/src/linux-headers-3.11-2.slh.2-aptosid-amd64/include/uapi/linux/posix_types.h:4,
  924. from include/uapi/linux/types.h:13,
  925. from include/linux/types.h:5,
  926. from include/uapi/linux/capability.h:16,
  927. from include/linux/capability.h:15,
  928. from include/linux/sched.h:13,
  929. from include/linux/utsname.h:5,
  930. from /usr/src/sgfxi-downloads/NVIDIA-Linux-x86_64-331.20/kernel/nv-linux.h:44,
  931. from /usr/src/sgfxi-downloads/NVIDIA-Linux-x86_64-331.20/kernel/nv-pat.c:15:
  932. /usr/src/linux-headers-3.11-2.slh.2-aptosid-amd64/arch/x86/include/asm/uaccess_64.h: In function ‘copy_from_user’:
  933. /usr/src/linux-headers-3.11-2.slh.2-aptosid-amd64/arch/x86/include/asm/uaccess_64.h:62:28: warning: comparison between signed and unsigned integer expressions [-Wsign-compare]
  934. if (likely(sz == -1 || sz >= n))
  935. ^
  936. include/linux/compiler.h:152:40: note: in definition of macro ‘likely’
  937. # define likely(x) __builtin_expect(!!(x), 1)
  938. ^
  939. /usr/bin/gcc-4.8 -Wp,-MD,/usr/src/sgfxi-downloads/NVIDIA-Linux-x86_64-331.20/kernel/.nv-procfs.o.d -nostdinc -isystem /usr/lib/gcc/x86_64-linux-gnu/4.8/include -I/usr/src/linux-headers-3.11-2.slh.2-aptosid-amd64/arch/x86/include -Iarch/x86/include/generated -Iinclude -I/usr/src/linux-headers-3.11-2.slh.2-aptosid-amd64/arch/x86/include/uapi -Iarch/x86/include/generated/uapi -I/usr/src/linux-headers-3.11-2.slh.2-aptosid-amd64/include/uapi -Iinclude/generated/uapi -include /usr/src/linux-headers-3.11-2.slh.2-aptosid-amd64/include/linux/kconfig.h -D__KERNEL__ -Wall -Wundef -Wstrict-prototypes -Wno-trigraphs -fno-strict-aliasing -fno-common -Werror-implicit-function-declaration -Wno-format-security -fno-delete-null-pointer-checks -Os -Wno-maybe-uninitialized -m64 -mno-sse
  940. -mpreferred-stack-boundary=3 -mtune=generic -mno-red-zone -mcmodel=kernel -funit-at-a-time -maccumulate-outgoing-args -fstack-protector -DCONFIG_AS_CFI=1 -DCONFIG_AS_CFI_SIGNAL_FRAME=1 -DCONFIG_AS_CFI_SECTIONS=1 -DCONFIG_AS_FXSAVEQ=1 -DCONFIG_AS_AVX=1 -DCONFIG_AS_AVX2=1 -pipe -Wno-sign-compare -fno-asynchronous-unwind-tables -mno-sse -mno-mmx -mno-sse2 -mno-3dnow -mno-avx -Wframe-larger-than=2048 -Wno-unused-but-set-variable -fomit-frame-pointer -Wdeclaration-after-statement -Wno-pointer-sign -fno-strict-overflow -fconserve-stack -DCC_HAVE_ASM_GOTO -DNV_MODULE_INSTANCE=0 -DNV_BUILD_MODULE_INSTANCES=0 -UDEBUG -U_DEBUG -DNDEBUG -I/usr/src/sgfxi-downloads/NVIDIA-Linux-x86_64-331.20/kernel -Wall -MD -Wsign-compare -Wno-cast-qual -Wno-error -D__KERNEL__ -DMODULE -DNVRM -DNV_VERSION_STRING=\"331.20\" -Wno-unused-function -Wuninitialized -mno-red-zone -mcmodel=kernel -DNV_UVM_ENABLE -D__linux__ -DNV_DEV_NAME=\"nvidia\" -DMODULE -D"KBUILD_STR(s)=#s" -D"KBUILD_BASENAME=KBUILD_STR(nv_procfs)" -D"KBUILD_
  941. MODNAME=KBUIL
  942. D_STR(nvidia)" -c -o /usr/src/sgfxi-downloads/NVIDIA-Linux-x86_64-331.20/kernel/.tmp_nv-procfs.o /usr/src/sgfxi-downloads/NVIDIA-Linux-x86_64-331.20/kernel/nv-procfs.c
  943. In file included from /usr/src/linux-headers-3.11-2.slh.2-aptosid-amd64/arch/x86/include/asm/bitops.h:514:0,
  944. from include/linux/bitops.h:22,
  945. from include/linux/kernel.h:10,
  946. from include/linux/sched.h:15,
  947. from include/linux/utsname.h:5,
  948. from /usr/src/sgfxi-downloads/NVIDIA-Linux-x86_64-331.20/kernel/nv-linux.h:44,
  949. from /usr/src/sgfxi-downloads/NVIDIA-Linux-x86_64-331.20/kernel/nv-procfs.c:15:
  950. include/linux/bitops.h: In function ‘hweight_long’:
  951. include/asm-generic/bitops/const_hweight.h:27:70: warning: signed and unsigned type in conditional expression [-Wsign-compare]
  952. #define hweight64(w) (__builtin_constant_p(w) ? __const_hweight64(w) : __arch_hweight64(w))
  953. ^
  954. include/linux/bitops.h:66:41: note: in expansion of macro ‘hweight64’
  955. return sizeof(w) == 4 ? hweight32(w) : hweight64(w);
  956. ^
  957. In file included from /usr/src/linux-headers-3.11-2.slh.2-aptosid-amd64/arch/x86/include/asm/cpumask.h:4:0,
  958. from /usr/src/linux-headers-3.11-2.slh.2-aptosid-amd64/arch/x86/include/asm/msr.h:10,
  959. from /usr/src/linux-headers-3.11-2.slh.2-aptosid-amd64/arch/x86/include/asm/processor.h:20,
  960. from /usr/src/linux-headers-3.11-2.slh.2-aptosid-amd64/arch/x86/include/asm/thread_info.h:22,
  961. from include/linux/thread_info.h:54,
  962. from include/linux/preempt.h:9,
  963. from include/linux/spinlock.h:50,
  964. from include/linux/seqlock.h:29,
  965. from include/linux/time.h:5,
  966. from include/uapi/linux/timex.h:56,
  967. from include/linux/timex.h:56,
  968. from include/linux/sched.h:17,
  969. from include/linux/utsname.h:5,
  970. from /usr/src/sgfxi-downloads/NVIDIA-Linux-x86_64-331.20/kernel/nv-linux.h:44,
  971. from /usr/src/sgfxi-downloads/NVIDIA-Linux-x86_64-331.20/kernel/nv-procfs.c:15:
  972. include/linux/cpumask.h: In function ‘cpumask_parse’:
  973. include/linux/cpumask.h:603:26: warning: signed and unsigned type in conditional expression [-Wsign-compare]
  974. int len = nl ? nl - buf : strlen(buf);
  975. ^
  976. In file included from include/uapi/linux/stddef.h:1:0,
  977. from include/linux/stddef.h:4,
  978. from /usr/src/linux-headers-3.11-2.slh.2-aptosid-amd64/include/uapi/linux/posix_types.h:4,
  979. from include/uapi/linux/types.h:13,
  980. from include/linux/types.h:5,
  981. from include/uapi/linux/capability.h:16,
  982. from include/linux/capability.h:15,
  983. from include/linux/sched.h:13,
  984. from include/linux/utsname.h:5,
  985. from /usr/src/sgfxi-downloads/NVIDIA-Linux-x86_64-331.20/kernel/nv-linux.h:44,
  986. from /usr/src/sgfxi-downloads/NVIDIA-Linux-x86_64-331.20/kernel/nv-procfs.c:15:
  987. /usr/src/linux-headers-3.11-2.slh.2-aptosid-amd64/arch/x86/include/asm/uaccess_64.h: In function ‘copy_from_user’:
  988. /usr/src/linux-headers-3.11-2.slh.2-aptosid-amd64/arch/x86/include/asm/uaccess_64.h:62:28: warning: comparison between signed and unsigned integer expressions [-Wsign-compare]
  989. if (likely(sz == -1 || sz >= n))
  990. ^
  991. include/linux/compiler.h:152:40: note: in definition of macro ‘likely’
  992. # define likely(x) __builtin_expect(!!(x), 1)
  993. ^
  994. /usr/bin/gcc-4.8 -Wp,-MD,/usr/src/sgfxi-downloads/NVIDIA-Linux-x86_64-331.20/kernel/.nv-usermap.o.d -nostdinc -isystem /usr/lib/gcc/x86_64-linux-gnu/4.8/include -I/usr/src/linux-headers-3.11-2.slh.2-aptosid-amd64/arch/x86/include -Iarch/x86/include/generated -Iinclude -I/usr/src/linux-headers-3.11-2.slh.2-aptosid-amd64/arch/x86/include/uapi -Iarch/x86/include/g
  995. enerated/uapi -I/usr/src/linux-headers-3.11-2.slh.2-aptosid-amd64/include/uapi -Iinclude/generated/uapi -include /usr/src/linux-headers-3.11-2.slh.2-aptosid-amd64/include/linux/kconfig.h -D__KERNEL__ -Wall -Wundef -Wstrict-prototypes -Wno-trigraphs -fno-strict-aliasing -fno-common -Werror-implicit-function-declaration -Wno-format-security -fno-delete-null-pointer-checks -Os -Wno-maybe-uninitialized -m64 -mno-sse -mpreferred-stack-boundary=3 -mtune=generic -mno-red-zone -mcmodel=kernel -funit-at-a-time -maccumulate-outgoing-args -fstack-protector -DCONFIG_AS_CFI=1 -DCONFIG_AS_CFI_SIGNAL_FRAME=1 -DCONFIG_AS_CFI_SECTIONS=1 -DCONFIG_AS_FXSAVEQ=1 -DCONFIG_AS_AVX=1 -DCONFIG_AS_AVX2=1 -pipe -Wno-sign-compare -fno-asynchronous-unwind-tables -mno-sse -mno-mmx -mno-sse2 -mno-3dnow -mno-avx -Wframe-larger-than=2048 -Wno-unused-but-set-variable -fomit-frame-pointer -Wdeclaration-after-statement -Wno-pointer-sign -fno-strict-overflow -fconserve-stack -DCC_HAVE_ASM_GOTO -DNV_MODULE_INSTANCE=0 -DNV_BUILD_MODULE_
  996. INSTANCES=0
  997. -UDEBUG -U_DEBUG -DNDEBUG -I/usr/src/sgfxi-downloads/NVIDIA-Linux-x86_64-331.20/kernel -Wall -MD -Wsign-compare -Wno-cast-qual -Wno-error -D__KERNEL__ -DMODULE -DNVRM -DNV_VERSION_STRING=\"331.20\" -Wno-unused-function -Wuninitialized -mno-red-zone -mcmodel=kernel -DNV_UVM_ENABLE -D__linux__ -DNV_DEV_NAME=\"nvidia\" -DMODULE -D"KBUILD_STR(s)=#s" -D"KBUILD_BASENAME=KBUILD_STR(nv_usermap)" -D"KBUILD_MODNAME=KBUILD_STR(nvidia)" -c -o /usr/src/sgfxi-downloads/NVIDIA-Linux-x86_64-331.20/kernel/.tmp_nv-usermap.o /usr/src/sgfxi-downloads/NVIDIA-Linux-x86_64-331.20/kernel/nv-usermap.c
  998. In file included from /usr/src/linux-headers-3.11-2.slh.2-aptosid-amd64/arch/x86/include/asm/bitops.h:514:0,
  999. from include/linux/bitops.h:22,
  1000. from include/linux/kernel.h:10,
  1001. from include/linux/sched.h:15,
  1002. from include/linux/utsname.h:5,
  1003. from /usr/src/sgfxi-downloads/NVIDIA-Linux-x86_64-331.20/kernel/nv-linux.h:44,
  1004. from /usr/src/sgfxi-downloads/NVIDIA-Linux-x86_64-331.20/kernel/nv-usermap.c:15:
  1005. include/linux/bitops.h: In function ‘hweight_long’:
  1006. include/asm-generic/bitops/const_hweight.h:27:70: warning: signed and unsigned type in conditional expression [-Wsign-compare]
  1007. #define hweight64(w) (__builtin_constant_p(w) ? __const_hweight64(w) : __arch_hweight64(w))
  1008. ^
  1009. include/linux/bitops.h:66:41: note: in expansion of macro ‘hweight64’
  1010. return sizeof(w) == 4 ? hweight32(w) : hweight64(w);
  1011. ^
  1012. In file included from /usr/src/linux-headers-3.11-2.slh.2-aptosid-amd64/arch/x86/include/asm/cpumask.h:4:0,
  1013. from /usr/src/linux-headers-3.11-2.slh.2-aptosid-amd64/arch/x86/include/asm/msr.h:10,
  1014. from /usr/src/linux-headers-3.11-2.slh.2-aptosid-amd64/arch/x86/include/asm/processor.h:20,
  1015. from /usr/src/linux-headers-3.11-2.slh.2-aptosid-amd64/arch/x86/include/asm/thread_info.h:22,
  1016. from include/linux/thread_info.h:54,
  1017. from include/linux/preempt.h:9,
  1018. from include/linux/spinlock.h:50,
  1019. from include/linux/seqlock.h:29,
  1020. from include/linux/time.h:5,
  1021. from include/uapi/linux/timex.h:56,
  1022. from include/linux/timex.h:56,
  1023. from include/linux/sched.h:17,
  1024. from include/linux/utsname.h:5,
  1025. from /usr/src/sgfxi-downloads/NVIDIA-Linux-x86_64-331.20/kernel/nv-linux.h:44,
  1026. from /usr/src/sgfxi-downloads/NVIDIA-Linux-x86_64-331.20/kernel/nv-usermap.c:15:
  1027. include/linux/cpumask.h: In function ‘cpumask_parse’:
  1028. include/linux/cpumask.h:603:26: warning: signed and unsigned type in conditional expression [-Wsign-compare]
  1029. int len = nl ? nl - buf : strlen(buf);
  1030. ^
  1031. In file included from include/uapi/linux/stddef.h:1:0,
  1032. from include/linux/stddef.h:4,
  1033. from /usr/src/linux-headers-3.11-2.slh.2-aptosid-amd64/include/uapi/linux/posix_types.h:4,
  1034. from include/uapi/linux/types.h:13,
  1035. from include/linux/types.h:5,
  1036. from include/uapi/linux/capability.h:16,
  1037. from include/linux/capability.h:15,
  1038. from include/linux/sched.h:13,
  1039. from include/linux/utsname.h:5,
  1040. from /usr/src/sgfxi-downloads/NVIDIA-Linux-x86_64-331.20/kernel/nv-linux.h:44,
  1041. from /usr/src/sgfxi-downloads/NVIDIA-Linux-x86_64-331.20/kernel/nv-usermap.c:15:
  1042. /usr/src/linux-headers-3.11-2.slh.2-aptosid-amd64/arch/x86/include/asm/uaccess_64.h: In function ‘copy_from_user’:
  1043. /usr/src/linux-headers-3.11-2.slh.2-aptosid-amd64/arch/x86/include/asm/uaccess_64.h:62:28: warning: comparison between signed and unsigned integer expressions [-Wsign-compare]
  1044. if (likely(sz == -1 || sz >= n))
  1045. ^
  1046. include/linux/compiler.h:152:40: note: in definition of macro ‘likely’
  1047. # define likely(x) __builtin_expect(!!(x), 1)
  1048. ^
  1049. /usr/bin/gcc-4.8 -Wp,-MD,/usr/src/sgfxi-downloads/NVIDIA-Linux-x86_64-331.20/kernel/.nv-vm.o.d -nostdinc -isystem /usr/lib/gcc/x86_64-linux-gnu/4.8/include -I/usr/src/linux-headers-3.11-2.slh.2-aptosid-amd64/arch/x86/include -Iarch/x86/include/generated -Iinclude -I/usr/src/linux-headers-3.11-2.slh.2-aptosid-amd64/arch/x86/include/uapi -Iarch/x86/include/generated/uapi -I/usr/src/linux-headers-3.11-2.slh.2-aptosid-amd64/include/uapi -Iinclude/generated/uapi -include /usr/src/linux-headers-3.11-2.slh.2-aptosid-amd64/include/linux/kconfig.h -D__KERNEL__ -Wall -Wundef -Wstrict-prototypes -Wno-trigraphs -fno-strict-aliasing -fno-common -Werror-implicit-function-declaration -Wno-format-security -fno-delete-null-pointer-checks -Os -Wno-maybe-uninitialized -m64 -mno-sse -mpreferred-stack-boundary=3 -mtune=generic -mno-red-zone -mcmodel=kernel -funit-at-a-time -maccumulate-outgoing-args -fstack-protector -DCONFIG_AS_CFI=1 -DCONFIG_AS_CFI_SIGNAL_FRAME=1 -DCONF
  1050. IG_AS_CFI_SECTIONS=1 -DCONFIG_AS_FXSAVEQ=1 -DCONFIG_AS_AVX=1 -DCONFIG_AS_AVX2=1 -pipe -Wno-sign-compare -fno-asynchronous-unwind-tables -mno-sse -mno-mmx -mno-sse2 -mno-3dnow -mno-avx -Wframe-larger-than=2048 -Wno-unused-but-set-variable -fomit-frame-pointer -Wdeclaration-after-statement -Wno-pointer-sign -fno-strict-overflow -fconserve-stack -DCC_HAVE_ASM_GOTO -DNV_MODULE_INSTANCE=0 -DNV_BUILD_MODULE_INSTANCES=0 -UDEBUG -U_DEBUG -DNDEBUG -I/usr/src/sgfxi-downloads/NVIDIA-Linux-x86_64-331.20/kernel -Wall -MD -Wsign-compare -Wno-cast-qual -Wno-error -D__KERNEL__ -DMODULE -DNVRM -DNV_VERSION_STRING=\"331.20\" -Wno-unused-function -Wuninitialized -mno-red-zone -mcmodel=kernel -DNV_UVM_ENABLE -D__linux__ -DNV_DEV_NAME=\"nvidia\" -DMODULE -D"KBUILD_STR(s)=#s" -D"KBUILD_BASENAME=KBUILD_STR(nv_vm)" -D"KBUILD_MODNAME=KBUILD_STR(nvidia)" -c -o /usr/src/sgfxi-downloads/NVIDIA-Linux-x86_64-331.20/kernel/.tmp_nv-vm.o /usr/src/sgfxi-downloads/NVIDIA-Linux-x86_64-331.20/kernel/nv-vm.c
  1051. In file included from /usr/src/linux-headers-3.11-2.slh.2-aptosid-amd64/arch/x86/include/asm/bitops.h:514:0,
  1052. from include/linux/bitops.h:22,
  1053. from include/linux/kernel.h:10,
  1054. from include/linux/sched.h:15,
  1055. from include/linux/utsname.h:5,
  1056. from /usr/src/sgfxi-downloads/NVIDIA-Linux-x86_64-331.20/kernel/nv-linux.h:44,
  1057. from /usr/src/sgfxi-downloads/NVIDIA-Linux-x86_64-331.20/kernel/nv-vm.c:14:
  1058. include/linux/bitops.h: In function ‘hweight_long’:
  1059. include/asm-generic/bitops/const_hweight.h:27:70: warning: signed and unsigned type in conditional expression [-Wsign-compare]
  1060. #define hweight64(w) (__builtin_constant_p(w) ? __const_hweight64(w) : __arch_hweight64(w))
  1061. ^
  1062. include/linux/bitops.h:66:41: note: in expansion of macro ‘hweight64’
  1063. return sizeof(w) == 4 ? hweight32(w) : hweight64(w);
  1064. ^
  1065. In file included from /usr/src/linux-headers-3.11-2.slh.2-aptosid-amd64/arch/x86/include/asm/cpumask.h:4:0,
  1066. from /usr/src/linux-headers-3.11-2.slh.2-aptosid-amd64/arch/x86/include/asm/msr.h:10,
  1067. from /usr/src/linux-headers-3.11-2.slh.2-aptosid-amd64/arch/x86/include/asm/processor.h:20,
  1068. from /usr/src/linux-headers-3.11-2.slh.2-aptosid-amd64/arch/x86/include/asm/thread_info.h:22,
  1069. from include/linux/thread_info.h:54,
  1070. from include/linux/preempt.h:9,
  1071. from include/linux/spinlock.h:50,
  1072. from include/linux/seqlock.h:29,
  1073. from include/linux/time.h:5,
  1074. from include/uapi/linux/timex.h:56,
  1075. from include/linux/timex.h:56,
  1076. from include/linux/sched.h:17,
  1077. from include/linux/utsname.h:5,
  1078. from /usr/src/sgfxi-downloads/NVIDIA-Linux-x86_64-331.20/kernel/nv-linux.h:44,
  1079. from /usr/src/sgfxi-downloads/NVIDIA-Linux-x86_64-331.20/kernel/nv-vm.c:14:
  1080. include/linux/cpumask.h: In function ‘cpumask_parse’:
  1081. include/linux/cpumask.h:603:26: warning: signed and unsigned type in conditional expression [-Wsign-compare]
  1082. int len = nl ? nl - buf : strlen(buf);
  1083. ^
  1084. In file included from include/uapi/linux/stddef.h:1:0,
  1085. from include/linux/stddef.h:4,
  1086. from /usr/src/linux-headers-3.11-2.slh.2-aptosid-amd64/include/uapi/linux/posix_types.h:4,
  1087. from include/uapi/linux/types.h:13,
  1088. from include/linux/types.h:5,
  1089. from include/uapi/linux/capability.h:16,
  1090. from include/linux/capability.h:15,
  1091. from include/linux/sched.h:13,
  1092. from include/linux/utsname.h:5,
  1093. from /usr/src/sgfxi-downloads/NVIDIA-Linux-x86_64-331.20/kernel/nv-linux.h:44,
  1094. from /usr/src/sgfxi-downloads/NVIDIA-Linux-x86_64-331.20/kernel/nv-vm.c:14:
  1095. /usr/src/linux-headers-3.11-2.slh.2-aptosid-amd64/arch/x86/include/asm/uaccess_64.h: In function ‘copy_from_user’:
  1096. /usr/src/linux-headers-3.11-2.slh.2-aptosid-amd64/arch/x86/include/asm/uaccess_64.h:62:28: warning: comparison between signed and unsigned integer expressions [-Wsign-compare]
  1097. if (likely(sz == -1 || sz >= n))
  1098. ^
  1099. include/linux/compiler.h:152:40: note: in definition of macro ‘likely’
  1100. # define likely(x) __builtin_expect(!!(x), 1)
  1101. ^
  1102. /usr/bin/gcc-4.8 -Wp,-MD,/usr/src/sgfxi-downloads/NVIDIA-Linux-x86_64-331.20/kernel/.nv-vtophys.o.d -nostdinc -isystem /usr/lib/gcc/x86_64-linux-gnu/4.8/include -I/usr/src/linux-headers-3.11-2.slh.2-aptosid-amd64/arch/x86/include -Iarch/x86/include/generated -Iinclude -I/usr/src/linux-headers-3.11-2.slh.2-aptosid-amd64/arch/x86/include/uapi -Iarch/x86/include/generated/uapi -I/usr/src/linux-headers-3.11-2.slh.2-aptosid-amd64/include/uapi -Iinclude/generated/uapi -include /usr/src/linux-headers-3.11-2.slh.2-aptosid-amd64/include/linux/kconfig.h -D__KERNEL__ -Wall -Wundef -
  1103. Wstrict-prototypes -Wno-trigraphs -fno-strict-aliasing -fno-common -Werror-implicit-function-declaration -Wno-format-security -fno-delete-null-pointer-checks -Os -Wno-maybe-uninitialized -m64 -mno-sse -mpreferred-stack-boundary=3 -mtune=generic -mno-red-zone -mcmodel=kernel -funit-at-a-time -maccumulate-outgoing-args -fstack-protector -DCONFIG_AS_CFI=1 -DCONFIG_AS_CFI_SIGNAL_FRAME=1 -DCONFIG_AS_CFI_SECTIONS=1 -DCONFIG_AS_FXSAVEQ=1 -DCONFIG_AS_AVX=1 -DCONFIG_AS_AVX2=1 -pipe -Wno-sign-compare -fno-asynchronous-unwind-tables -mno-sse -mno-mmx -mno-sse2 -mno-3dnow -mno-avx -Wframe-larger-than=2048 -Wno-unused-but-set-variable -fomit-frame-pointer -Wdeclaration-after-statement -Wno-pointer-sign -fno-strict-overflow -fconserve-stack -DCC_HAVE_ASM_GOTO -DNV_MODULE_INSTANCE=0 -DNV_BUILD_MODULE_INSTANCES=0 -UDEBUG -U_DEBUG -DNDEBUG -I/usr/src/sgfxi-downloads/NVIDIA-Linux-x86_64-331.20/kernel -Wall -MD -Wsign-compare -Wno-cast-qual -Wno-error -D__KERNEL__ -DMODULE -DNVRM -DNV_VERSION_STRING=\"331.20\" -Wno-unused-
  1104. funct
  1105. ion -Wuninitialized -mno-red-zone -mcmodel=kernel -DNV_UVM_ENABLE -D__linux__ -DNV_DEV_NAME=\"nvidia\" -DMODULE -D"KBUILD_STR(s)=#s" -D"KBUILD_BASENAME=KBUILD_STR(nv_vtophys)" -D"KBUILD_MODNAME=KBUILD_STR(nvidia)" -c -o /usr/src/sgfxi-downloads/NVIDIA-Linux-x86_64-331.20/kernel/.tmp_nv-vtophys.o /usr/src/sgfxi-downloads/NVIDIA-Linux-x86_64-331.20/kernel/nv-vtophys.c
  1106. In file included from /usr/src/linux-headers-3.11-2.slh.2-aptosid-amd64/arch/x86/include/asm/bitops.h:514:0,
  1107. from include/linux/bitops.h:22,
  1108. from include/linux/kernel.h:10,
  1109. from include/linux/sched.h:15,
  1110. from include/linux/utsname.h:5,
  1111. from /usr/src/sgfxi-downloads/NVIDIA-Linux-x86_64-331.20/kernel/nv-linux.h:44,
  1112. from /usr/src/sgfxi-downloads/NVIDIA-Linux-x86_64-331.20/kernel/nv-vtophys.c:15:
  1113. include/linux/bitops.h: In function ‘hweight_long’:
  1114. include/asm-generic/bitops/const_hweight.h:27:70: warning: signed and unsigned type in conditional expression [-Wsign-compare]
  1115. #define hweight64(w) (__builtin_constant_p(w) ? __const_hweight64(w) : __arch_hweight64(w))
  1116. ^
  1117. include/linux/bitops.h:66:41: note: in expansion of macro ‘hweight64’
  1118. return sizeof(w) == 4 ? hweight32(w) : hweight64(w);
  1119. ^
  1120. In file included from /usr/src/linux-headers-3.11-2.slh.2-aptosid-amd64/arch/x86/include/asm/cpumask.h:4:0,
  1121. from /usr/src/linux-headers-3.11-2.slh.2-aptosid-amd64/arch/x86/include/asm/msr.h:10,
  1122. from /usr/src/linux-headers-3.11-2.slh.2-aptosid-amd64/arch/x86/include/asm/processor.h:20,
  1123. from /usr/src/linux-headers-3.11-2.slh.2-aptosid-amd64/arch/x86/include/asm/thread_info.h:22,
  1124. from include/linux/thread_info.h:54,
  1125. from include/linux/preempt.h:9,
  1126. from include/linux/spinlock.h:50,
  1127. from include/linux/seqlock.h:29,
  1128. from include/linux/time.h:5,
  1129. from include/uapi/linux/timex.h:56,
  1130. from include/linux/timex.h:56,
  1131. from include/linux/sched.h:17,
  1132. from include/linux/utsname.h:5,
  1133. from /usr/src/sgfxi-downloads/NVIDIA-Linux-x86_64-331.20/kernel/nv-linux.h:44,
  1134. from /usr/src/sgfxi-downloads/NVIDIA-Linux-x86_64-331.20/kernel/nv-vtophys.c:15:
  1135. include/linux/cpumask.h: In function ‘cpumask_parse’:
  1136. include/linux/cpumask.h:603:26: warning: signed and unsigned type in conditional expression [-Wsign-compare]
  1137. int len = nl ? nl - buf : strlen(buf);
  1138. ^
  1139. In file included from include/uapi/linux/stddef.h:1:0,
  1140. from include/linux/stddef.h:4,
  1141. from /usr/src/linux-headers-3.11-2.slh.2-aptosid-amd64/include/uapi/linux/posix_types.h:4,
  1142. from include/uapi/linux/types.h:13,
  1143. from include/linux/types.h:5,
  1144. from include/uapi/linux/capability.h:16,
  1145. from include/linux/capability.h:15,
  1146. from include/linux/sched.h:13,
  1147. from include/linux/utsname.h:5,
  1148. from /usr/src/sgfxi-downloads/NVIDIA-Linux-x86_64-331.20/kernel/nv-linux.h:44,
  1149. from /usr/src/sgfxi-downloads/NVIDIA-Linux-x86_64-331.20/kernel/nv-vtophys.c:15:
  1150. /usr/src/linux-headers-3.11-2.slh.2-aptosid-amd64/arch/x86/include/asm/uaccess_64.h: In function ‘copy_from_user’:
  1151. /usr/src/linux-headers-3.11-2.slh.2-aptosid-amd64/arch/x86/include/asm/uaccess_64.h:62:28: warning: comparison between signed and unsigned integer expressions [-Wsign-compare]
  1152. if (likely(sz == -1 || sz >= n))
  1153. ^
  1154. include/linux/compiler.h:152:40: note: in definition of macro ‘likely’
  1155. # define likely(x) __builtin_expect(!!(x), 1)
  1156. ^
  1157. /usr/bin/gcc-4.8 -Wp,-MD,/usr/src/sgfxi-downloads/NVIDIA-Linux-x86_64-331.20/kernel/.os-interface.o.d -nostdinc -isystem /usr/lib/gcc/x86_64-linux-gnu/4.8/include -I/usr/src/linux-headers-3.11-2.slh.2-aptosid-amd64/arch/x86/include -Iarch/x86/include/generated -Iinclude -I/usr/src/linux-headers-3.11-2.slh.2-aptosid-amd64/arch/x86/include/uapi -Iarch/x86/include/generated/uapi -I/usr/src/linux-headers-3.11-2.slh.2-aptosid-amd64/include/uapi -Iinclude/generated/uapi -include /usr/src/linux-headers-3.11-2.slh.2-aptosid-amd64/include/linux/kconfig.h -D__KERNEL__ -Wall -Wundef -Wstrict-prototypes -Wno-trigraphs -fno-strict-aliasing -fno-common -Werror-implicit-function-declaration -Wno-format-security -fno-delete-null-pointer-checks -Os -Wno-maybe-uninitialized -m64 -mno-sse -mpreferred-stack-boundary=3 -mtune=generic -mno-red-zone -mcmodel=kernel -funit-at-a-time -maccumulate-outgoing-args -fstack-protector -DCONFIG_AS_CFI=1 -DCONFIG_AS_CFI_SIGNAL_FRAME=1 -DCONFIG_AS_CFI_SECTIONS=1 -DCONFIG_AS_FXSAVEQ=1 -
  1158. DCONFIG_AS_AVX=1 -DCONFIG_AS_AVX2=1 -pipe -Wno-sign-compare -fno-asynchronous-unwind-tables -mno-sse -mno-mmx -mno-sse2 -mno-3dnow -mno-avx -Wframe-larger-than=2048
  1159. -Wno-unused-but-set-variable -fomit-frame-pointer -Wdeclaration-after-statement -Wno-pointer-sign -fno-strict-overflow -fconserve-stack -DCC_HAVE_ASM_GOTO -DNV_MODULE_INSTANCE=0 -DNV_BUILD_MODULE_INSTANCES=0 -UDEBUG -U_DEBUG -DNDEBUG -I/usr/src/sgfxi-downloads/NVIDIA-Linux-x86_64-331.20/kernel -Wall -MD -Wsign-compare -Wno-cast-qual -Wno-error -D__KERNEL__ -DMODULE -DNVRM -DNV_VERSION_STRING=\"331.20\" -Wno-unused-function -Wuninitialized -mno-red-zone -mcmodel=kernel -DNV_UVM_ENABLE -D__linux__ -DNV_DEV_NAME=\"nvidia\" -DMODULE -D"KBUILD_STR(s)=#s" -D"KBUILD_BASENAME=KBUILD_STR(os_interface)" -D"KBUILD_MODNAME=KBUILD_STR(nvidia)" -c -o /usr/src/sgfxi-downloads/NVIDIA-Linux-x86_64-331.20/kernel/.tmp_os-interface.o /usr/src/sgfxi-downloads/NVIDIA-Linux-x86_64-331.20/kernel/os-interface.c
  1160. In file included from /usr/src/linux-headers-3.11-2.slh.2-aptosid-amd64/arch/x86/include/asm/bitops.h:514:0,
  1161. from include/linux/bitops.h:22,
  1162. from include/linux/kernel.h:10,
  1163. from include/linux/sched.h:15,
  1164. from include/linux/utsname.h:5,
  1165. from /usr/src/sgfxi-downloads/NVIDIA-Linux-x86_64-331.20/kernel/nv-linux.h:44,
  1166. from /usr/src/sgfxi-downloads/NVIDIA-Linux-x86_64-331.20/kernel/os-interface.c:15:
  1167. include/linux/bitops.h: In function ‘hweight_long’:
  1168. include/asm-generic/bitops/const_hweight.h:27:70: warning: signed and unsigned type in conditional expression [-Wsign-compare]
  1169. #define hweight64(w) (__builtin_constant_p(w) ? __const_hweight64(w) : __arch_hweight64(w))
  1170. ^
  1171. include/linux/bitops.h:66:41: note: in expansion of macro ‘hweight64’
  1172. return sizeof(w) == 4 ? hweight32(w) : hweight64(w);
  1173. ^
  1174. In file included from /usr/src/linux-headers-3.11-2.slh.2-aptosid-amd64/arch/x86/include/asm/cpumask.h:4:0,
  1175. from /usr/src/linux-headers-3.11-2.slh.2-aptosid-amd64/arch/x86/include/asm/msr.h:10,
  1176. from /usr/src/linux-headers-3.11-2.slh.2-aptosid-amd64/arch/x86/include/asm/processor.h:20,
  1177. from /usr/src/linux-headers-3.11-2.slh.2-aptosid-amd64/arch/x86/include/asm/thread_info.h:22,
  1178. from include/linux/thread_info.h:54,
  1179. from include/linux/preempt.h:9,
  1180. from include/linux/spinlock.h:50,
  1181. from include/linux/seqlock.h:29,
  1182. from include/linux/time.h:5,
  1183. from include/uapi/linux/timex.h:56,
  1184. from include/linux/timex.h:56,
  1185. from include/linux/sched.h:17,
  1186. from include/linux/utsname.h:5,
  1187. from /usr/src/sgfxi-downloads/NVIDIA-Linux-x86_64-331.20/kernel/nv-linux.h:44,
  1188. from /usr/src/sgfxi-downloads/NVIDIA-Linux-x86_64-331.20/kernel/os-interface.c:15:
  1189. include/linux/cpumask.h: In function ‘cpumask_parse’:
  1190. include/linux/cpumask.h:603:26: warning: signed and unsigned type in conditional expression [-Wsign-compare]
  1191. int len = nl ? nl - buf : strlen(buf);
  1192. ^
  1193. In file included from include/uapi/linux/stddef.h:1:0,
  1194. from include/linux/stddef.h:4,
  1195. from /usr/src/linux-headers-3.11-2.slh.2-aptosid-amd64/include/uapi/linux/posix_types.h:4,
  1196. from include/uapi/linux/types.h:13,
  1197. from include/linux/types.h:5,
  1198. from include/uapi/linux/capability.h:16,
  1199. from include/linux/capability.h:15,
  1200. from include/linux/sched.h:13,
  1201. from include/linux/utsname.h:5,
  1202. from /usr/src/sgfxi-downloads/NVIDIA-Linux-x86_64-331.20/kernel/nv-linux.h:44,
  1203. from /usr/src/sgfxi-downloads/NVIDIA-Linux-x86_64-331.20/kernel/os-interface.c:15:
  1204. /usr/src/linux-headers-3.11-2.slh.2-aptosid-amd64/arch/x86/include/asm/uaccess_64.h: In function ‘copy_from_user’:
  1205. /usr/src/linux-headers-3.11-2.slh.2-aptosid-amd64/arch/x86/include/asm/uaccess_64.h:62:28: warning: comparison between signed and unsigned integer expressions [-Wsign-compare]
  1206. if (likely(sz == -1 || sz >= n))
  1207. ^
  1208. include/linux/compiler.h:152:40: note: in definition of macro ‘likely’
  1209. # define likely(x) __builtin_expect(!!(x), 1)
  1210. ^
  1211. /usr/bin/gcc-4.8 -Wp,-MD,/usr/src/sgfxi-downloads/NVIDIA-Linux-x86_64-331.20/kernel/.os-pci.o.d -nostdinc -isystem /usr/lib/gcc/x86_64-linux-gnu/4.8/include -I/usr/src/linux-headers-3.11-2.slh.2-aptosid-amd64/arch/x86/include -Iarch/x86/include/generated -Iinclude -I/usr/src/linux-headers-3.11-2.slh.2-aptosid-amd64/arch/x86/include/uapi -Iarch/x86/include/generated/uapi -I/usr/src/linux-headers-3.11-2.slh.2-aptosid-amd64/include/uapi -Iinclude/generated/uapi -include /usr/src/linux-headers-3.11-2.slh.2-aptosid-amd64/include/linux/kconfig.h -D__KERNEL__ -Wall -Wundef -Wstrict-prototypes -Wno-trigraphs -fno-strict-aliasing -fno-common -Werror-implicit-function-declaration -Wno-format-security -fno-delete-null-pointer-checks -Os -Wno-may
  1212. be-uninitialized -m64 -mno-sse -mpreferred-stack-boundary=3 -mtune=generic -mno-red-zone -mcmodel=kernel -funit-at-a-time -maccumulate-outgoing-args -fstack-protector -DCONFIG_AS_CFI=1 -DCONFIG_AS_CFI_SIGNAL_FRAME=1 -DCONFIG_AS_CFI_SECTIONS=1 -DCONFIG_AS_FXSAVEQ=1 -DCONFIG_AS_AVX=1 -DCONFIG_AS_AVX2=1 -pipe -Wno-sign-compare -fno-asynchronous-unwind-tables -mno-sse -mno-mmx -mno-sse2 -mno-3dnow -mno-avx -Wframe-larger-than=2048 -Wno-unused-but-set-variable -fomit-frame-pointer -Wdeclaration-after-statement -Wno-pointer-sign -fno-strict-overflow -fconserve-stack -DCC_HAVE_ASM_GOTO -DNV_MODULE_INSTANCE=0 -DNV_BUILD_MODULE_INSTANCES=0 -UDEBUG -U_DEBUG -DNDEBUG -I/usr/src/sgfxi-downloads/NVIDIA-Linux-x86_64-331.20/kernel -Wall -MD -Wsign-compare -Wno-cast-qual -Wno-error -D__KERNEL__ -DMODULE -DNVRM -DNV_VERSION_STRING=\"331.20\" -Wno-unused-function -Wuninitialized -mno-red-zone -mcmodel=kernel -DNV_UVM_ENABLE -D__linux__ -DNV_DEV_NAME=\"nvidia\" -DMODULE -D"KBUILD_STR(s)=#s" -D"KBUILD_BASENAME=KBUILD_STR(
  1213. os_pc
  1214. i)" -D"KBUILD_MODNAME=KBUILD_STR(nvidia)" -c -o /usr/src/sgfxi-downloads/NVIDIA-Linux-x86_64-331.20/kernel/.tmp_os-pci.o /usr/src/sgfxi-downloads/NVIDIA-Linux-x86_64-331.20/kernel/os-pci.c
  1215. In file included from /usr/src/linux-headers-3.11-2.slh.2-aptosid-amd64/arch/x86/include/asm/bitops.h:514:0,
  1216. from include/linux/bitops.h:22,
  1217. from include/linux/kernel.h:10,
  1218. from include/linux/sched.h:15,
  1219. from include/linux/utsname.h:5,
  1220. from /usr/src/sgfxi-downloads/NVIDIA-Linux-x86_64-331.20/kernel/nv-linux.h:44,
  1221. from /usr/src/sgfxi-downloads/NVIDIA-Linux-x86_64-331.20/kernel/os-pci.c:15:
  1222. include/linux/bitops.h: In function ‘hweight_long’:
  1223. include/asm-generic/bitops/const_hweight.h:27:70: warning: signed and unsigned type in conditional expression [-Wsign-compare]
  1224. #define hweight64(w) (__builtin_constant_p(w) ? __const_hweight64(w) : __arch_hweight64(w))
  1225. ^
  1226. include/linux/bitops.h:66:41: note: in expansion of macro ‘hweight64’
  1227. return sizeof(w) == 4 ? hweight32(w) : hweight64(w);
  1228. ^
  1229. In file included from /usr/src/linux-headers-3.11-2.slh.2-aptosid-amd64/arch/x86/include/asm/cpumask.h:4:0,
  1230. from /usr/src/linux-headers-3.11-2.slh.2-aptosid-amd64/arch/x86/include/asm/msr.h:10,
  1231. from /usr/src/linux-headers-3.11-2.slh.2-aptosid-amd64/arch/x86/include/asm/processor.h:20,
  1232. from /usr/src/linux-headers-3.11-2.slh.2-aptosid-amd64/arch/x86/include/asm/thread_info.h:22,
  1233. from include/linux/thread_info.h:54,
  1234. from include/linux/preempt.h:9,
  1235. from include/linux/spinlock.h:50,
  1236. from include/linux/seqlock.h:29,
  1237. from include/linux/time.h:5,
  1238. from include/uapi/linux/timex.h:56,
  1239. from include/linux/timex.h:56,
  1240. from include/linux/sched.h:17,
  1241. from include/linux/utsname.h:5,
  1242. from /usr/src/sgfxi-downloads/NVIDIA-Linux-x86_64-331.20/kernel/nv-linux.h:44,
  1243. from /usr/src/sgfxi-downloads/NVIDIA-Linux-x86_64-331.20/kernel/os-pci.c:15:
  1244. include/linux/cpumask.h: In function ‘cpumask_parse’:
  1245. include/linux/cpumask.h:603:26: warning: signed and unsigned type in conditional expression [-Wsign-compare]
  1246. int len = nl ? nl - buf : strlen(buf);
  1247. ^
  1248. In file included from include/uapi/linux/stddef.h:1:0,
  1249. from include/linux/stddef.h:4,
  1250. from /usr/src/linux-headers-3.11-2.slh.2-aptosid-amd64/include/uapi/linux/posix_types.h:4,
  1251. from include/uapi/linux/types.h:13,
  1252. from include/linux/types.h:5,
  1253. from include/uapi/linux/capability.h:16,
  1254. from include/linux/capability.h:15,
  1255. from include/linux/sched.h:13,
  1256. from include/linux/utsname.h:5,
  1257. from /usr/src/sgfxi-downloads/NVIDIA-Linux-x86_64-331.20/kernel/nv-linux.h:44,
  1258. from /usr/src/sgfxi-downloads/NVIDIA-Linux-x86_64-331.20/kernel/os-pci.c:15:
  1259. /usr/src/linux-headers-3.11-2.slh.2-aptosid-amd64/arch/x86/include/asm/uaccess_64.h: In function ‘copy_from_user’:
  1260. /usr/src/linux-headers-3.11-2.slh.2-aptosid-amd64/arch/x86/include/asm/uaccess_64.h:62:28: warning: comparison between signed and unsigned integer expressions [-Wsign-compare]
  1261. if (likely(sz == -1 || sz >= n))
  1262. ^
  1263. include/linux/compiler.h:152:40: note: in definition of macro ‘likely’
  1264. # define likely(x) __builtin_expect(!!(x), 1)
  1265. ^
  1266. /usr/bin/gcc-4.8 -Wp,-MD,/usr/src/sgfxi-downloads/NVIDIA-Linux-x86_64-331.20/kernel/.os-registry.o.d -nostdinc -isystem /usr/lib/gcc/x86_64-linux-gnu/4.8/include -I/usr/src/linux-headers-3.11-2.slh.2-aptosid-amd64/arch/x86/include -Iarch/x86/include/generated -Iinclude -I/usr/src/linux-headers-3.11-2.slh.2-aptosid-amd64/arch/x86/include/uapi -Iarch
  1267. /x86/include/generated/uapi -I/usr/src/linux-headers-3.11-2.slh.2-aptosid-amd64/include/uapi -Iinclude/generated/uapi -include /usr/src/linux-headers-3.11-2.slh.2-aptosid-amd64/include/linux/kconfig.h -D__KERNEL__ -Wall -Wundef -Wstrict-prototypes -Wno-trigraphs -fno-strict-aliasing -fno-common -Werror-implicit-function-declaration -Wno-format-security -fno-delete-null-pointer-checks -Os -Wno-maybe-uninitialized -m64 -mno-sse -mpreferred-stack-boundary=3 -mtune=generic -mno-red-zone -mcmodel=kernel -funit-at-a-time -maccumulate-outgoing-args -fstack-protector -DCONFIG_AS_CFI=1 -DCONFIG_AS_CFI_SIGNAL_FRAME=1 -DCONFIG_AS_CFI_SECTIONS=1 -DCONFIG_AS_FXSAVEQ=1 -DCONFIG_AS_AVX=1 -DCONFIG_AS_AVX2=1 -pipe -Wno-sign-compare -fno-asynchronous-unwind-tables -mno-sse -mno-mmx -mno-sse2 -mno-3dnow -mno-avx -Wframe-larger-than=2048 -Wno-unused-but-set-variable -fomit-frame-pointer -Wdeclaration-after-statement -Wno-pointer-sign -fno-strict-overflow -fconserve-stack -DCC_HAVE_ASM_GOTO -DNV_MODULE_INSTANCE=0 -DNV_BUILD_
  1268. MODUL
  1269. E_INSTANCES=0 -UDEBUG -U_DEBUG -DNDEBUG -I/usr/src/sgfxi-downloads/NVIDIA-Linux-x86_64-331.20/kernel -Wall -MD -Wsign-compare -Wno-cast-qual -Wno-error -D__KERNEL__ -DMODULE -DNVRM -DNV_VERSION_STRING=\"331.20\" -Wno-unused-function -Wuninitialized -mno-red-zone -mcmodel=kernel -DNV_UVM_ENABLE -D__linux__ -DNV_DEV_NAME=\"nvidia\" -DMODULE -D"KBUILD_STR(s)=#s" -D"KBUILD_BASENAME=KBUILD_STR(os_registry)" -D"KBUILD_MODNAME=KBUILD_STR(nvidia)" -c -o /usr/src/sgfxi-downloads/NVIDIA-Linux-x86_64-331.20/kernel/.tmp_os-registry.o /usr/src/sgfxi-downloads/NVIDIA-Linux-x86_64-331.20/kernel/os-registry.c
  1270. In file included from /usr/src/linux-headers-3.11-2.slh.2-aptosid-amd64/arch/x86/include/asm/bitops.h:514:0,
  1271. from include/linux/bitops.h:22,
  1272. from include/linux/kernel.h:10,
  1273. from include/linux/sched.h:15,
  1274. from include/linux/utsname.h:5,
  1275. from /usr/src/sgfxi-downloads/NVIDIA-Linux-x86_64-331.20/kernel/nv-linux.h:44,
  1276. from /usr/src/sgfxi-downloads/NVIDIA-Linux-x86_64-331.20/kernel/os-registry.c:15:
  1277. include/linux/bitops.h: In function ‘hweight_long’:
  1278. include/asm-generic/bitops/const_hweight.h:27:70: warning: signed and unsigned type in conditional expression [-Wsign-compare]
  1279. #define hweight64(w) (__builtin_constant_p(w) ? __const_hweight64(w) : __arch_hweight64(w))
  1280. ^
  1281. include/linux/bitops.h:66:41: note: in expansion of macro ‘hweight64’
  1282. return sizeof(w) == 4 ? hweight32(w) : hweight64(w);
  1283. ^
  1284. In file included from /usr/src/linux-headers-3.11-2.slh.2-aptosid-amd64/arch/x86/include/asm/cpumask.h:4:0,
  1285. from /usr/src/linux-headers-3.11-2.slh.2-aptosid-amd64/arch/x86/include/asm/msr.h:10,
  1286. from /usr/src/linux-headers-3.11-2.slh.2-aptosid-amd64/arch/x86/include/asm/processor.h:20,
  1287. from /usr/src/linux-headers-3.11-2.slh.2-aptosid-amd64/arch/x86/include/asm/thread_info.h:22,
  1288. from include/linux/thread_info.h:54,
  1289. from include/linux/preempt.h:9,
  1290. from include/linux/spinlock.h:50,
  1291. from include/linux/seqlock.h:29,
  1292. from include/linux/time.h:5,
  1293. from include/uapi/linux/timex.h:56,
  1294. from include/linux/timex.h:56,
  1295. from include/linux/sched.h:17,
  1296. from include/linux/utsname.h:5,
  1297. from /usr/src/sgfxi-downloads/NVIDIA-Linux-x86_64-331.20/kernel/nv-linux.h:44,
  1298. from /usr/src/sgfxi-downloads/NVIDIA-Linux-x86_64-331.20/kernel/os-registry.c:15:
  1299. include/linux/cpumask.h: In function ‘cpumask_parse’:
  1300. include/linux/cpumask.h:603:26: warning: signed and unsigned type in conditional expression [-Wsign-compare]
  1301. int len = nl ? nl - buf : strlen(buf);
  1302. ^
  1303. In file included from include/uapi/linux/stddef.h:1:0,
  1304. from include/linux/stddef.h:4,
  1305. from /usr/src/linux-headers-3.11-2.slh.2-aptosid-amd64/include/uapi/linux/posix_types.h:4,
  1306. from include/uapi/linux/types.h:13,
  1307. from include/linux/types.h:5,
  1308. from include/uapi/linux/capability.h:16,
  1309. from include/linux/capability.h:15,
  1310. from include/linux/sched.h:13,
  1311. from include/linux/utsname.h:5,
  1312. from /usr/src/sgfxi-downloads/NVIDIA-Linux-x86_64-331.20/kernel/nv-linux.h:44,
  1313. from /usr/src/sgfxi-downloads/NVIDIA-Linux-x86_64-331.20/kernel/os-registry.c:15:
  1314. /usr/src/linux-headers-3.11-2.slh.2-aptosid-amd64/arch/x86/include/asm/uaccess_64.h: In function ‘copy_from_user’:
  1315. /usr/src/linux-headers-3.11-2.slh.2-aptosid-amd64/arch/x86/include/asm/uaccess_64.h:62:28: warning: comparison between signed and unsigned integer expressions [-Wsign-compare]
  1316. if (likely(sz == -1 || sz >= n))
  1317. ^
  1318. include/linux/compiler.h:152:40: note: in definition of macro ‘likely’
  1319. # define likely(x) __builtin_expect(!!(x), 1)
  1320. ^
  1321. /usr/bin/gcc-4.8 -Wp,-MD,/usr/src/sgfxi-downloads/NVIDIA-Linux-x86_64-331.20/kernel/.os-smp.o.d -nostdinc -isystem /usr/lib/gcc/x86_64-linux-gnu/4.8/include -I/usr/src/linux-headers-3.11-2.slh.2-aptosid-amd64/arch/x86/include -Iarch/x86/include/generated -Iinclude -I/usr/src/linux-headers-3.11-2.slh.2-aptosid-amd64/arch/x86/include/uapi -Iarch/x86/include/generated/uapi -I/usr/src/linux-headers-3.11-2.slh.2-aptosid-amd64/include/uapi -Iinclude/generated/uapi -include /usr/src/linux-headers-3.11-2.slh.2-aptosid-amd64/include/linux/kconfig.h -D__KERNEL__ -Wall -Wundef -Wstrict-prototypes -Wno-trigraphs -fno-strict-aliasing -fno-common -Werror-implicit-function-declaration -Wno-format-security -fno-delete-null-pointer-checks -Os -Wno-maybe-uninitialized -m64 -mno-sse -mpreferred-stack-boundary=3 -mtune=generic -mno-red-zone -mcmodel=kernel -funit-at-a-time -maccumulate-outgoing-args -fstack-protector -DCONFIG_AS_CFI=1 -DCONFIG_AS_CFI_
  1322. SIGNAL_FRAME=1 -DCONFIG_AS_CFI_SECTIONS=1 -DCONFIG_AS_FXSAVEQ=1 -DCONFIG_AS_AVX=1 -DCONFIG_AS_AVX2=1 -pipe -Wno-sign-compare -fno-asynchronous-unwind-tables -mno-sse -mno-mmx -mno-sse2 -mno-3dnow -mno-avx -Wframe-larger-than=2048 -Wno-unused-but-set-variable -fomit-frame-pointer -Wdeclaration-after-statement -Wno-pointer-sign -fno-strict-overflow -fconserve-stack -DCC_HAVE_ASM_GOTO -DNV_MODULE_INSTANCE=0 -DNV_BUILD_MODULE_INSTANCES=0 -UDEBUG -U_DEBUG -DNDEBUG -I/usr/src/sgfxi-downloads/NVIDIA-Linux-x86_64-331.20/kernel -Wall -MD -Wsign-compare -Wno-cast-qual -Wno-error -D__KERNEL__ -DMODULE -DNVRM -DNV_VERSION_STRING=\"331.20\" -Wno-unused-function -Wuninitialized -mno-red-zone -mcmodel=kernel -DNV_UVM_ENABLE -D__linux__ -DNV_DEV_NAME=\"nvidia\" -DMODULE -D"KBUILD_STR(s)=#s" -D"KBUILD_BASENAME=KBUILD_STR(os_smp)" -D"KBUILD_MODNAME=KBUILD_STR(nvidia)" -c -o /usr/src/sgfxi-downloads/NVIDIA-Linux-x86_64-331.20/kernel/.tmp_os-smp.o /usr/src/sgfxi-downloads/NVIDIA-Linux-x86_64-331.20/kernel/os-smp.c
  1323. In file included from /usr/src/linux-headers-3.11-2.slh.2-aptosid-amd64/arch/x86/include/asm/bitops.h:514:0,
  1324. from include/linux/bitops.h:22,
  1325. from include/linux/kernel.h:10,
  1326. from include/linux/sched.h:15,
  1327. from include/linux/utsname.h:5,
  1328. from /usr/src/sgfxi-downloads/NVIDIA-Linux-x86_64-331.20/kernel/nv-linux.h:44,
  1329. from /usr/src/sgfxi-downloads/NVIDIA-Linux-x86_64-331.20/kernel/os-smp.c:15:
  1330. include/linux/bitops.h: In function ‘hweight_long’:
  1331. include/asm-generic/bitops/const_hweight.h:27:70: warning: signed and unsigned type in conditional expression [-Wsign-compare]
  1332. #define hweight64(w) (__builtin_constant_p(w) ? __const_hweight64(w) : __arch_hweight64(w))
  1333. ^
  1334. include/linux/bitops.h:66:41: note: in expansion of macro ‘hweight64’
  1335. return sizeof(w) == 4 ? hweight32(w) : hweight64(w);
  1336. ^
  1337. In file included from /usr/src/linux-headers-3.11-2.slh.2-aptosid-amd64/arch/x86/include/asm/cpumask.h:4:0,
  1338. from /usr/src/linux-headers-3.11-2.slh.2-aptosid-amd64/arch/x86/include/asm/msr.h:10,
  1339. from /usr/src/linux-headers-3.11-2.slh.2-aptosid-amd64/arch/x86/include/asm/processor.h:20,
  1340. from /usr/src/linux-headers-3.11-2.slh.2-aptosid-amd64/arch/x86/include/asm/thread_info.h:22,
  1341. from include/linux/thread_info.h:54,
  1342. from include/linux/preempt.h:9,
  1343. from include/linux/spinlock.h:50,
  1344. from include/linux/seqlock.h:29,
  1345. from include/linux/time.h:5,
  1346. from include/uapi/linux/timex.h:56,
  1347. from include/linux/timex.h:56,
  1348. from include/linux/sched.h:17,
  1349. from include/linux/utsname.h:5,
  1350. from /usr/src/sgfxi-downloads/NVIDIA-Linux-x86_64-331.20/kernel/nv-linux.h:44,
  1351. from /usr/src/sgfxi-downloads/NVIDIA-Linux-x86_64-331.20/kernel/os-smp.c:15:
  1352. include/linux/cpumask.h: In function ‘cpumask_parse’:
  1353. include/linux/cpumask.h:603:26: warning: signed and unsigned type in conditional expression [-Wsign-compare]
  1354. int len = nl ? nl - buf : strlen(buf);
  1355. ^
  1356. In file included from include/uapi/linux/stddef.h:1:0,
  1357. from include/linux/stddef.h:4,
  1358. from /usr/src/linux-headers-3.11-2.slh.2-aptosid-amd64/include/uapi/linux/posix_types.h:4,
  1359. from include/uapi/linux/types.h:13,
  1360. from include/linux/types.h:5,
  1361. from include/uapi/linux/capability.h:16,
  1362. from include/linux/capability.h:15,
  1363. from include/linux/sched.h:13,
  1364. from include/linux/utsname.h:5,
  1365. from /usr/src/sgfxi-downloads/NVIDIA-Linux-x86_64-331.20/kernel/nv-linux.h:44,
  1366. from /usr/src/sgfxi-downloads/NVIDIA-Linux-x86_64-331.20/kernel/os-smp.c:15:
  1367. /usr/src/linux-headers-3.11-2.slh.2-aptosid-amd64/arch/x86/include/asm/uaccess_64.h: In function ‘copy_from_user’:
  1368. /usr/src/linux-headers-3.11-2.slh.2-aptosid-amd64/arch/x86/include/asm/uaccess_64.h:62:28: warning: comparison between signed and unsigned integer expressions [-Wsign-compare]
  1369. if (likely(sz == -1 || sz >= n))
  1370. ^
  1371. include/linux/compiler.h:152:40: note: in definition of macro ‘likely’
  1372. # define likely(x) __builtin_expect(!!(x), 1)
  1373. ^
  1374. /usr/bin/gcc-4.8 -Wp,-MD,/usr/src/sgfxi-downloads/NVIDIA-Linux-x86_64-331.20/kernel/.os-usermap.o.d -nostdinc -isystem /usr/lib/gcc/x86_64-linux-gnu/4.8/include -I/usr/src/linux-headers-3.11-2.slh.2-aptosid-amd64/arch/x86/include -Iarch/x86/include/generated -Iinclude -I/usr/src/linux-headers-3.11-2.slh.2-aptosid-amd64/arch/x86/include/uapi -Iarch/x86/include/generated/uapi -I/usr/src/linux-headers-3.11-2.slh.2-aptosid-amd64/include/uapi -Iinclude/generated/uapi -include /usr/src/linux-headers-3.11-2.slh.2-aptosid-amd64/include/linux/kconfig.h -
  1375. D__KERNEL__ -Wall -Wundef -Wstrict-prototypes -Wno-trigraphs -fno-strict-aliasing -fno-common -Werror-implicit-function-declaration -Wno-format-security -fno-delete-null-pointer-checks -Os -Wno-maybe-uninitialized -m64 -mno-sse -mpreferred-stack-boundary=3 -mtune=generic -mno-red-zone -mcmodel=kernel -funit-at-a-time -maccumulate-outgoing-args -fstack-protector -DCONFIG_AS_CFI=1 -DCONFIG_AS_CFI_SIGNAL_FRAME=1 -DCONFIG_AS_CFI_SECTIONS=1 -DCONFIG_AS_FXSAVEQ=1 -DCONFIG_AS_AVX=1 -DCONFIG_AS_AVX2=1 -pipe -Wno-sign-compare -fno-asynchronous-unwind-tables -mno-sse -mno-mmx -mno-sse2 -mno-3dnow -mno-avx -Wframe-larger-than=2048 -Wno-unused-but-set-variable -fomit-frame-pointer -Wdeclaration-after-statement -Wno-pointer-sign -fno-strict-overflow -fconserve-stack -DCC_HAVE_ASM_GOTO -DNV_MODULE_INSTANCE=0 -DNV_BUILD_MODULE_INSTANCES=0 -UDEBUG -U_DEBUG -DNDEBUG -I/usr/src/sgfxi-downloads/NVIDIA-Linux-x86_64-331.20/kernel -Wall -MD -Wsign-compare -Wno-cast-qual -Wno-error -D__KERNEL__ -DMODULE -DNVRM -DNV_VERSION_
  1376. STRING=\
  1377. "331.20\" -Wno-unused-function -Wuninitialized -mno-red-zone -mcmodel=kernel -DNV_UVM_ENABLE -D__linux__ -DNV_DEV_NAME=\"nvidia\" -DMODULE -D"KBUILD_STR(s)=#s" -D"KBUILD_BASENAME=KBUILD_STR(os_usermap)" -D"KBUILD_MODNAME=KBUILD_STR(nvidia)" -c -o /usr/src/sgfxi-downloads/NVIDIA-Linux-x86_64-331.20/kernel/.tmp_os-usermap.o /usr/src/sgfxi-downloads/NVIDIA-Linux-x86_64-331.20/kernel/os-usermap.c
  1378. In file included from /usr/src/linux-headers-3.11-2.slh.2-aptosid-amd64/arch/x86/include/asm/bitops.h:514:0,
  1379. from include/linux/bitops.h:22,
  1380. from include/linux/kernel.h:10,
  1381. from include/linux/sched.h:15,
  1382. from include/linux/utsname.h:5,
  1383. from /usr/src/sgfxi-downloads/NVIDIA-Linux-x86_64-331.20/kernel/nv-linux.h:44,
  1384. from /usr/src/sgfxi-downloads/NVIDIA-Linux-x86_64-331.20/kernel/os-usermap.c:15:
  1385. include/linux/bitops.h: In function ‘hweight_long’:
  1386. include/asm-generic/bitops/const_hweight.h:27:70: warning: signed and unsigned type in conditional expression [-Wsign-compare]
  1387. #define hweight64(w) (__builtin_constant_p(w) ? __const_hweight64(w) : __arch_hweight64(w))
  1388. ^
  1389. include/linux/bitops.h:66:41: note: in expansion of macro ‘hweight64’
  1390. return sizeof(w) == 4 ? hweight32(w) : hweight64(w);
  1391. ^
  1392. In file included from /usr/src/linux-headers-3.11-2.slh.2-aptosid-amd64/arch/x86/include/asm/cpumask.h:4:0,
  1393. from /usr/src/linux-headers-3.11-2.slh.2-aptosid-amd64/arch/x86/include/asm/msr.h:10,
  1394. from /usr/src/linux-headers-3.11-2.slh.2-aptosid-amd64/arch/x86/include/asm/processor.h:20,
  1395. from /usr/src/linux-headers-3.11-2.slh.2-aptosid-amd64/arch/x86/include/asm/thread_info.h:22,
  1396. from include/linux/thread_info.h:54,
  1397. from include/linux/preempt.h:9,
  1398. from include/linux/spinlock.h:50,
  1399. from include/linux/seqlock.h:29,
  1400. from include/linux/time.h:5,
  1401. from include/uapi/linux/timex.h:56,
  1402. from include/linux/timex.h:56,
  1403. from include/linux/sched.h:17,
  1404. from include/linux/utsname.h:5,
  1405. from /usr/src/sgfxi-downloads/NVIDIA-Linux-x86_64-331.20/kernel/nv-linux.h:44,
  1406. from /usr/src/sgfxi-downloads/NVIDIA-Linux-x86_64-331.20/kernel/os-usermap.c:15:
  1407. include/linux/cpumask.h: In function ‘cpumask_parse’:
  1408. include/linux/cpumask.h:603:26: warning: signed and unsigned type in conditional expression [-Wsign-compare]
  1409. int len = nl ? nl - buf : strlen(buf);
  1410. ^
  1411. In file included from include/uapi/linux/stddef.h:1:0,
  1412. from include/linux/stddef.h:4,
  1413. from /usr/src/linux-headers-3.11-2.slh.2-aptosid-amd64/include/uapi/linux/posix_types.h:4,
  1414. from include/uapi/linux/types.h:13,
  1415. from include/linux/types.h:5,
  1416. from include/uapi/linux/capability.h:16,
  1417. from include/linux/capability.h:15,
  1418. from include/linux/sched.h:13,
  1419. from include/linux/utsname.h:5,
  1420. from /usr/src/sgfxi-downloads/NVIDIA-Linux-x86_64-331.20/kernel/nv-linux.h:44,
  1421. from /usr/src/sgfxi-downloads/NVIDIA-Linux-x86_64-331.20/kernel/os-usermap.c:15:
  1422. /usr/src/linux-headers-3.11-2.slh.2-aptosid-amd64/arch/x86/include/asm/uaccess_64.h: In function ‘copy_from_user’:
  1423. /usr/src/linux-headers-3.11-2.slh.2-aptosid-amd64/arch/x86/include/asm/uaccess_64.h:62:28: warning: comparison between signed and unsigned integer expressions [-Wsign-compare]
  1424. if (likely(sz == -1 || sz >= n))
  1425. ^
  1426. include/linux/compiler.h:152:40: note: in definition of macro ‘likely’
  1427. # define likely(x) __builtin_expect(!!(x), 1)
  1428. ^
  1429. /usr/bin/gcc-4.8 -Wp,-MD,/usr/src/sgfxi-downloads/NVIDIA-Linux-x86_64-331.20/kernel/.nv_uvm_interface.o.d -nostdinc -isystem /usr/lib/gcc/x86_64-linux-gnu/4.8/include -I/usr/src/linux-headers-3.11-2.slh.2-aptosid-amd64/arch/x86/include -Iarch/x86/include/generated -Iinclude -I/usr/src/linux-headers-3.11-2.slh.2-aptosid-amd64/arch/x86/include/uapi -Iarch/x86/include/generated/uapi -I/usr/src/linux-headers-3.11-2.slh.2-aptosid-amd64/include/uapi -Iinclude/generated/uapi -include /usr/src/linux-headers-3.11-2.slh.2-aptosid-amd64/include/linux/kconfig.h -D__KERNEL__ -Wall -Wundef -Wstrict-prototypes -Wno-trigraphs -fno-strict-aliasing -fno-common -Werror-implicit-function-declaration -Wno-format-security -fno-delete-null-pointer-checks -Os -Wno-maybe-uninitialized -m64 -mno-sse -mpreferred-stack-boundary=3 -mtune=generic -mno-red-zone -mcmodel=kernel -funit-at-a-time -maccumulate-outgoing-args -fstack-protector -DCONFIG_AS_CFI=1 -DCONFIG_AS_CFI_SIGNAL_FRAME=1 -DCONFIG_AS_CFI_SECTIONS=1 -DCONFIG_AS_
  1430. FXSAVEQ=1 -DCONFIG_AS_AVX=1 -DCONFIG_AS_AVX2=1 -pipe -Wno-sign-compare -fno-asynchronous-unwind-tables -mno-sse -mno-mmx -mno-sse2 -mno-3dnow -m
  1431. no-avx -Wframe-larger-than=2048 -Wno-unused-but-set-variable -fomit-frame-pointer -Wdeclaration-after-statement -Wno-pointer-sign -fno-strict-overflow -fconserve-stack -DCC_HAVE_ASM_GOTO -DNV_MODULE_INSTANCE=0 -DNV_BUILD_MODULE_INSTANCES=0 -UDEBUG -U_DEBUG -DNDEBUG -I/usr/src/sgfxi-downloads/NVIDIA-Linux-x86_64-331.20/kernel -Wall -MD -Wsign-compare -Wno-cast-qual -Wno-error -D__KERNEL__ -DMODULE -DNVRM -DNV_VERSION_STRING=\"331.20\" -Wno-unused-function -Wuninitialized -mno-red-zone -mcmodel=kernel -DNV_UVM_ENABLE -D__linux__ -DNV_DEV_NAME=\"nvidia\" -DMODULE -D"KBUILD_STR(s)=#s" -D"KBUILD_BASENAME=KBUILD_STR(nv_uvm_interface)" -D"KBUILD_MODNAME=KBUILD_STR(nvidia)" -c -o /usr/src/sgfxi-downloads/NVIDIA-Linux-x86_64-331.20/kernel/.tmp_nv_uvm_interface.o /usr/src/sgfxi-downloads/NVIDIA-Linux-x86_64-331.20/kernel/nv_uvm_interface.c
  1432. In file included from /usr/src/linux-headers-3.11-2.slh.2-aptosid-amd64/arch/x86/include/asm/bitops.h:514:0,
  1433. from include/linux/bitops.h:22,
  1434. from include/linux/kernel.h:10,
  1435. from include/linux/sched.h:15,
  1436. from include/linux/utsname.h:5,
  1437. from /usr/src/sgfxi-downloads/NVIDIA-Linux-x86_64-331.20/kernel/nv-linux.h:44,
  1438. from /usr/src/sgfxi-downloads/NVIDIA-Linux-x86_64-331.20/kernel/nv_uvm_interface.c:21:
  1439. include/linux/bitops.h: In function ‘hweight_long’:
  1440. include/asm-generic/bitops/const_hweight.h:27:70: warning: signed and unsigned type in conditional expression [-Wsign-compare]
  1441. #define hweight64(w) (__builtin_constant_p(w) ? __const_hweight64(w) : __arch_hweight64(w))
  1442. ^
  1443. include/linux/bitops.h:66:41: note: in expansion of macro ‘hweight64’
  1444. return sizeof(w) == 4 ? hweight32(w) : hweight64(w);
  1445. ^
  1446. In file included from /usr/src/linux-headers-3.11-2.slh.2-aptosid-amd64/arch/x86/include/asm/cpumask.h:4:0,
  1447. from /usr/src/linux-headers-3.11-2.slh.2-aptosid-amd64/arch/x86/include/asm/msr.h:10,
  1448. from /usr/src/linux-headers-3.11-2.slh.2-aptosid-amd64/arch/x86/include/asm/processor.h:20,
  1449. from /usr/src/linux-headers-3.11-2.slh.2-aptosid-amd64/arch/x86/include/asm/thread_info.h:22,
  1450. from include/linux/thread_info.h:54,
  1451. from include/linux/preempt.h:9,
  1452. from include/linux/spinlock.h:50,
  1453. from include/linux/seqlock.h:29,
  1454. from include/linux/time.h:5,
  1455. from include/uapi/linux/timex.h:56,
  1456. from include/linux/timex.h:56,
  1457. from include/linux/sched.h:17,
  1458. from include/linux/utsname.h:5,
  1459. from /usr/src/sgfxi-downloads/NVIDIA-Linux-x86_64-331.20/kernel/nv-linux.h:44,
  1460. from /usr/src/sgfxi-downloads/NVIDIA-Linux-x86_64-331.20/kernel/nv_uvm_interface.c:21:
  1461. include/linux/cpumask.h: In function ‘cpumask_parse’:
  1462. include/linux/cpumask.h:603:26: warning: signed and unsigned type in conditional expression [-Wsign-compare]
  1463. int len = nl ? nl - buf : strlen(buf);
  1464. ^
  1465. In file included from include/uapi/linux/stddef.h:1:0,
  1466. from include/linux/stddef.h:4,
  1467. from /usr/src/linux-headers-3.11-2.slh.2-aptosid-amd64/include/uapi/linux/posix_types.h:4,
  1468. from include/uapi/linux/types.h:13,
  1469. from include/linux/types.h:5,
  1470. from include/uapi/linux/capability.h:16,
  1471. from include/linux/capability.h:15,
  1472. from include/linux/sched.h:13,
  1473. from include/linux/utsname.h:5,
  1474. from /usr/src/sgfxi-downloads/NVIDIA-Linux-x86_64-331.20/kernel/nv-linux.h:44,
  1475. from /usr/src/sgfxi-downloads/NVIDIA-Linux-x86_64-331.20/kernel/nv_uvm_interface.c:21:
  1476. /usr/src/linux-headers-3.11-2.slh.2-aptosid-amd64/arch/x86/include/asm/uaccess_64.h: In function ‘copy_from_user’:
  1477. /usr/src/linux-headers-3.11-2.slh.2-aptosid-amd64/arch/x86/include/asm/uaccess_64.h:62:28: warning: comparison between signed and unsigned integer expressions [-Wsign-compare]
  1478. if (likely(sz == -1 || sz >= n))
  1479. ^
  1480. include/linux/compiler.h:152:40: note: in definition of macro ‘likely’
  1481. # define likely(x) __builtin_expect(!!(x), 1)
  1482. ^
  1483. /usr/bin/gcc-4.8 -Wp,-MD,/usr/src/sgfxi-downloads/NVIDIA-Linux-x86_64-331.20/kernel/.nv-frontend.o.d -nostdinc -isystem /usr/lib/gcc/x86_64-linux-gnu/4.8/include -I/usr/src/linux-headers-3.11-2.slh.2-aptosid-amd64/arch/x86/include -Iarch/x86/include/generated -Iinclude -I/usr/src/linux-headers-3.11-2.slh.2-aptosid-amd64/arch/x86/include/uapi -Iarch/x86/include/generated/uapi -I/usr/src/linux-headers-3.11-2.slh.2-aptosid-amd64/include/uapi -Iinclude/generated/uapi -include /usr/src/linux-headers-3.11-2.slh.2-aptosid-amd64/include/linux/kconfig.h -D__KERNEL__ -Wall -Wundef -Wstrict-prototypes -Wno-trigraphs -fno-strict-aliasing -fno-common -Werror-implicit-function-declaration -Wno-
  1484. format-security -fno-delete-null-pointer-checks -Os -Wno-maybe-uninitialized -m64 -mno-sse -mpreferred-stack-boundary=3 -mtune=generic -mno-red-zone -mcmodel=kernel -funit-at-a-time -maccumulate-outgoing-args -fstack-protector -DCONFIG_AS_CFI=1 -DCONFIG_AS_CFI_SIGNAL_FRAME=1 -DCONFIG_AS_CFI_SECTIONS=1 -DCONFIG_AS_FXSAVEQ=1 -DCONFIG_AS_AVX=1 -DCONFIG_AS_AVX2=1 -pipe -Wno-sign-compare -fno-asynchronous-unwind-tables -mno-sse -mno-mmx -mno-sse2 -mno-3dnow -mno-avx -Wframe-larger-than=2048 -Wno-unused-but-set-variable -fomit-frame-pointer -Wdeclaration-after-statement -Wno-pointer-sign -fno-strict-overflow -fconserve-stack -DCC_HAVE_ASM_GOTO -DNV_MODULE_INSTANCE=0 -DNV_BUILD_MODULE_INSTANCES=0 -UDEBUG -U_DEBUG -DNDEBUG -I/usr/src/sgfxi-downloads/NVIDIA-Linux-x86_64-331.20/kernel -Wall -MD -Wsign-compare -Wno-cast-qual -Wno-error -D__KERNEL__ -DMODULE -DNVRM -DNV_VERSION_STRING=\"331.20\" -Wno-unused-function -Wuninitialized -mno-red-zone -mcmodel=kernel -DNV_UVM_ENABLE -D__linux__ -DNV_DEV_NAME=\"nvidia\" -
  1485. DMODU
  1486. LE -D"KBUILD_STR(s)=#s" -D"KBUILD_BASENAME=KBUILD_STR(nv_frontend)" -D"KBUILD_MODNAME=KBUILD_STR(nvidia)" -c -o /usr/src/sgfxi-downloads/NVIDIA-Linux-x86_64-331.20/kernel/.tmp_nv-frontend.o /usr/src/sgfxi-downloads/NVIDIA-Linux-x86_64-331.20/kernel/nv-frontend.c
  1487. In file included from /usr/src/linux-headers-3.11-2.slh.2-aptosid-amd64/arch/x86/include/asm/bitops.h:514:0,
  1488. from include/linux/bitops.h:22,
  1489. from include/linux/kernel.h:10,
  1490. from include/linux/sched.h:15,
  1491. from include/linux/utsname.h:5,
  1492. from /usr/src/sgfxi-downloads/NVIDIA-Linux-x86_64-331.20/kernel/nv-linux.h:44,
  1493. from /usr/src/sgfxi-downloads/NVIDIA-Linux-x86_64-331.20/kernel/nv-frontend.c:13:
  1494. include/linux/bitops.h: In function ‘hweight_long’:
  1495. include/asm-generic/bitops/const_hweight.h:27:70: warning: signed and unsigned type in conditional expression [-Wsign-compare]
  1496. #define hweight64(w) (__builtin_constant_p(w) ? __const_hweight64(w) : __arch_hweight64(w))
  1497. ^
  1498. include/linux/bitops.h:66:41: note: in expansion of macro ‘hweight64’
  1499. return sizeof(w) == 4 ? hweight32(w) : hweight64(w);
  1500. ^
  1501. In file included from /usr/src/linux-headers-3.11-2.slh.2-aptosid-amd64/arch/x86/include/asm/cpumask.h:4:0,
  1502. from /usr/src/linux-headers-3.11-2.slh.2-aptosid-amd64/arch/x86/include/asm/msr.h:10,
  1503. from /usr/src/linux-headers-3.11-2.slh.2-aptosid-amd64/arch/x86/include/asm/processor.h:20,
  1504. from /usr/src/linux-headers-3.11-2.slh.2-aptosid-amd64/arch/x86/include/asm/thread_info.h:22,
  1505. from include/linux/thread_info.h:54,
  1506. from include/linux/preempt.h:9,
  1507. from include/linux/spinlock.h:50,
  1508. from include/linux/seqlock.h:29,
  1509. from include/linux/time.h:5,
  1510. from include/uapi/linux/timex.h:56,
  1511. from include/linux/timex.h:56,
  1512. from include/linux/sched.h:17,
  1513. from include/linux/utsname.h:5,
  1514. from /usr/src/sgfxi-downloads/NVIDIA-Linux-x86_64-331.20/kernel/nv-linux.h:44,
  1515. from /usr/src/sgfxi-downloads/NVIDIA-Linux-x86_64-331.20/kernel/nv-frontend.c:13:
  1516. include/linux/cpumask.h: In function ‘cpumask_parse’:
  1517. include/linux/cpumask.h:603:26: warning: signed and unsigned type in conditional expression [-Wsign-compare]
  1518. int len = nl ? nl - buf : strlen(buf);
  1519. ^
  1520. In file included from include/uapi/linux/stddef.h:1:0,
  1521. from include/linux/stddef.h:4,
  1522. from /usr/src/linux-headers-3.11-2.slh.2-aptosid-amd64/include/uapi/linux/posix_types.h:4,
  1523. from include/uapi/linux/types.h:13,
  1524. from include/linux/types.h:5,
  1525. from include/uapi/linux/capability.h:16,
  1526. from include/linux/capability.h:15,
  1527. from include/linux/sched.h:13,
  1528. from include/linux/utsname.h:5,
  1529. from /usr/src/sgfxi-downloads/NVIDIA-Linux-x86_64-331.20/kernel/nv-linux.h:44,
  1530. from /usr/src/sgfxi-downloads/NVIDIA-Linux-x86_64-331.20/kernel/nv-frontend.c:13:
  1531. /usr/src/linux-headers-3.11-2.slh.2-aptosid-amd64/arch/x86/include/asm/uaccess_64.h: In function ‘copy_from_user’:
  1532. /usr/src/linux-headers-3.11-2.slh.2-aptosid-amd64/arch/x86/include/asm/uaccess_64.h:62:28: warning: comparison between signed and unsigned integer expressions [-Wsign-compare]
  1533. if (likely(sz == -1 || sz >= n))
  1534. ^
  1535. include/linux/compiler.h:152:40: note: in definition of macro ‘likely’
  1536. # define likely(x) __builtin_expect(!!(x), 1)
  1537. ^
  1538. ld -m elf_x86_64 -r -o /usr/src/sgfxi-downloads/NVIDIA-Linux-x86_64-331.20/kernel/nvidia.o /usr/src/sgfxi-downloads/NVIDIA-Linux-x86_64-331.20/kernel/nv-kernel.o /usr/src/sgfxi-downloads/NVIDIA-Linux-x86_64-331.20/kernel/nv.o /usr/src/sgfxi-downloads/NVIDIA-Li
  1539. nux-x86_64-331.20/kernel/nv-acpi.o /usr/src/sgfxi-downloads/NVIDIA-Linux-x86_64-331.20/kernel/nv-chrdev.o /usr/src/sgfxi-downloads/NVIDIA-Linux-x86_64-331.20/kernel/nv-cray.o /usr/src/sgfxi-downloads/NVIDIA-Linux-x86_64-331.20/kernel/nv-drm.o /usr/src/sgfxi-downloads/NVIDIA-Linux-x86_64-331.20/kernel/nv-gvi.o /usr/src/sgfxi-downloads/NVIDIA-Linux-x86_64-331.20/kernel/nv-i2c.o /usr/src/sgfxi-downloads/NVIDIA-Linux-x86_64-331.20/kernel/nv-mempool.o /usr/src/sgfxi-downloads/NVIDIA-Linux-x86_64-331.20/kernel/nv-mlock.o /usr/src/sgfxi-downloads/NVIDIA-Linux-x86_64-331.20/kernel/nv-mmap.o /usr/src/sgfxi-downloads/NVIDIA-Linux-x86_64-331.20/kernel/nv-p2p.o /usr/src/sgfxi-downloads/NVIDIA-Linux-x86_64-331.20/kernel/nv-pat.o /usr/src/sgfxi-downloads/NVIDIA-Linux-x86_64-331.20/kernel/nv-procfs.o /usr/src/sgfxi-downloads/NVIDIA-Linux-x86_64-331.20/kernel/nv-usermap.o /usr/src/sgfxi-downloads/NVIDIA-Linux-x86_64-331.20/kernel/nv-vm.o /usr/src/sgfxi-downloads/NVIDIA-Linux-x86_64-331.20/kernel/nv-vtophys.o /usr/src/
  1540. sgfxi-d
  1541. ownloads/NVIDIA-Linux-x86_64-331.20/kernel/os-interface.o /usr/src/sgfxi-downloads/NVIDIA-Linux-x86_64-331.20/kernel/os-pci.o /usr/src/sgfxi-downloads/NVIDIA-Linux-x86_64-331.20/kernel/os-registry.o /usr/src/sgfxi-downloads/NVIDIA-Linux-x86_64-331.20/kernel/os-smp.o /usr/src/sgfxi-downloads/NVIDIA-Linux-x86_64-331.20/kernel/os-usermap.o /usr/src/sgfxi-downloads/NVIDIA-Linux-x86_64-331.20/kernel/nv_uvm_interface.o /usr/src/sgfxi-downloads/NVIDIA-Linux-x86_64-331.20/kernel/nv-frontend.o
  1542. (cat /dev/null; echo kernel//usr/src/sgfxi-downloads/NVIDIA-Linux-x86_64-331.20/kernel/nvidia.ko;) > /usr/src/sgfxi-downloads/NVIDIA-Linux-x86_64-331.20/kernel/modules.order
  1543. make -f /usr/src/linux-headers-3.11-2.slh.2-aptosid-amd64/scripts/Makefile.modpost
  1544. find /usr/src/sgfxi-downloads/NVIDIA-Linux-x86_64-331.20/kernel/.tmp_versions -name '*.mod' | xargs -r grep -h '\.ko$' | sort -u | sed 's/\.ko$/.o/' | scripts/mod/modpost -m -a -i /usr/src/linux-headers-3.11-2.slh.2-aptosid-amd64/Module.symvers -I /usr/src/sgfxi-downloads
  1545. /NVIDIA-Linux-x86_64-331.20/kernel/Module.symvers -o /usr/src/sgfxi-downloads/NVIDIA-Linux-x86_64-331.20/kernel/Module.symvers -S -w -s -T -
  1546. WARNING: could not find /usr/src/sgfxi-downloads/NVIDIA-Linux-x86_64-331.20/kernel/.nv-kernel.o.cmd for /usr/src/sgfxi-downloads/NVIDIA-Linux-x86_64-331.20/kernel/nv-kernel.o
  1547. /usr/bin/gcc-4.8 -Wp,-MD,/usr/src/sgfxi-downloads/NVIDIA-Linux-x86_64-331.20/kernel/.nvidia.mod.o.d -nostdinc -isystem /usr/lib/gcc/x86_64-linux-gnu/4.8/include -I/usr/src/linux-headers-3.11-2.slh.2-aptosid-amd64/arch/x86/include -Iarch/x86/include/generated -Iinclude -I/usr/src/linux-headers-3.11-2.slh.2-aptosid-amd64/arch/x86/include/uapi -Iarch/x86/include/generated/uapi -I/usr/src/linux-headers-3.11-2.slh.2-aptosid-amd64/include/uapi -Iinclude/generated/uapi -include /usr/src/linux-headers-3.11-2.slh.2-aptosid-amd64/include/linux/kconfig.h -D__KERNEL__ -Wall -Wundef -Wstrict-prototypes -Wno-trigraphs -fno-strict-aliasing -fno-common -Werror-implicit-function-declaration -Wno-format-security
  1548. -fno-delete-null-pointer-checks -Os -Wno-maybe-uninitialized -m64 -mno-sse -mpreferred-stack-boundary=3 -mtune=generic -mno-red-zone -mcmodel=kernel -funit-at-a-time -maccumulate-outgoing-args -fstack-protector -DCONFIG_AS_CFI=1 -DCONFIG_AS_CFI_SIGNAL_FRAME=1 -DCONFIG_AS_CFI_SECTIONS=1 -DCONFIG_AS_FXSAVEQ=1 -DCONFIG_AS_AVX=1 -DCONFIG_AS_AVX2=1 -pipe -Wno-sign-compare -fno-asynchronous-unwind-tables -mno-sse -mno-mmx -mno-sse2 -mno-3dnow -mno-avx -Wframe-larger-than=2048 -Wno-unused-but-set-variable -fomit-frame-pointer -Wdeclaration-after-statement -Wno-pointer-sign -fno-strict-overflow -fconserve-stack -DCC_HAVE_ASM_GOTO -DNV_MODULE_INSTANCE=0 -DNV_BUILD_MODULE_INSTANCES=0 -UDEBUG -U_DEBUG -DNDEBUG -I/usr/src/sgfxi-downloads/NVIDIA-Linux-x86_64-331.20/kernel -Wall -MD -Wsign-compare -Wno-cast-qual -Wno-error -D__KERNEL__ -DMODULE -DNVRM -DNV_VERSION_STRING=\"331.20\" -Wno-unused-function -Wuninitialized -mno-red-zone -mcmodel=kernel -DNV_UVM_ENABLE -D__linux__ -DNV_DEV_NAME=\"nvidia\" -D"KBUILD_STR(s)=#
  1549. s"
  1550. -D"KBUILD_BASENAME=KBUILD_STR(nvidia.mod)" -D"KBUILD_MODNAME=KBUILD_STR(nvidia)" -DMODULE -c -o /usr/src/sgfxi-downloads/NVIDIA-Linux-x86_64-331.20/kernel/nvidia.mod.o /usr/src/sgfxi-downloads/NVIDIA-Linux-x86_64-331.20/kernel/nvidia.mod.c
  1551. In file included from /usr/src/linux-headers-3.11-2.slh.2-aptosid-amd64/arch/x86/include/asm/bitops.h:514:0,
  1552. from include/linux/bitops.h:22,
  1553. from include/linux/kernel.h:10,
  1554. from include/linux/cache.h:4,
  1555. from include/linux/time.h:4,
  1556. from include/linux/stat.h:18,
  1557. from include/linux/module.h:10,
  1558. from /usr/src/sgfxi-downloads/NVIDIA-Linux-x86_64-331.20/kernel/nvidia.mod.c:1:
  1559. include/linux/bitops.h: In function ‘hweight_long’:
  1560. include/asm-generic/bitops/const_hweight.h:27:70: warning: signed and unsigned type in conditional expression [-Wsign-compare]
  1561. #define hweight64(w) (__builtin_constant_p(w) ? __const_hweight64(w) : __arch_hweight64(w))
  1562. ^
  1563. include/linux/bitops.h:66:41: note: in expansion of macro ‘hweight64’
  1564. return sizeof(w) == 4 ? hweight32(w) : hweight64(w);
  1565. ^
  1566. In file included from /usr/src/linux-headers-3.11-2.slh.2-aptosid-amd64/arch/x86/include/asm/cpumask.h:4:0,
  1567. from /usr/src/linux-headers-3.11-2.slh.2-aptosid-amd64/arch/x86/include/asm/msr.h:10,
  1568. from /usr/src/linux-headers-3.11-2.slh.2-aptosid-amd64/arch/x86/include/asm/processor.h:20,
  1569. from /usr/src/linux-headers-3.11-2.slh.2-aptosid-amd64/arch/x86/include/asm/thread_info.h:22,
  1570. from include/linux/thread_info.h:54,
  1571. from include/linux/preempt.h:9,
  1572. from include/linux/spinlock.h:50,
  1573. from include/linux/seqlock.h:29,
  1574. from include/linux/time.h:5,
  1575. from include/linux/stat.h:18,
  1576. from include/linux/module.h:10,
  1577. from /usr/src/sgfxi-downloads/NVIDIA-Linux-x86_64-331.20/kernel/nvidia.mod.c:1:
  1578. include/linux/cpumask.h: In function ‘cpumask_parse’:
  1579. include/linux/cpumask.h:603:26: warning: signed and unsigned type in conditional expression [-Wsign-compare]
  1580. int len = nl ? nl - buf : strlen(buf);
  1581. ^
  1582. ld -r -m elf_x86_64 -T /usr/src/linux-headers-3.11-2.slh.2-aptosid-amd64/scripts/module-common.lds --build-id -o /usr/src/sgfxi-downloads/NVIDIA-Linux-x86_64-331.20/kernel/nvidia.ko /usr/src/sgfxi-downloads/NVIDIA-Linux-x86_64-331.20/kernel/nvidia.o /usr/src/sgfxi-downloads/NVIDIA-Linux-x86_64-331.20/kernel/nvidia.mod.o
  1583. make[1]: Leaving directory `/usr/src/linux-headers-3.11-2.slh.2-aptosid-amd64'
  1584. NVIDIA: left KBUILD.
  1585. -> done.
  1586. -> Building Unified Memory kernel module:
  1587. executing: 'cd ./kernel/uvm; make module SYSSRC=/lib/modules/3.11-2.slh.2-aptosid-amd64/build SYSOUT=/lib/modules/3.11-2.slh.2-aptosid-amd64/build NV_BUILD_MODULE_INSTANCES='...
  1588. cp /usr/src/sgfxi-downloads/NVIDIA-Linux-x86_64-331.20/kernel/Module.symvers Module.symvers
  1589. NVIDIA UVM: CC=/usr/bin/gcc-4.8, HOST_CC=/usr/bin/gcc-4.8 NV_TARGET_ARCH=x86_64
  1590. NVIDIA UVM: CONFTEST=/bin/sh ./conftest.sh /usr/bin/gcc-4.8 /usr/bin/gcc-4.8 x86_64 /lib/modules/3.11-2.slh.2-aptosid-amd64/build /lib/modules/3.11-2.slh.2-aptosid-amd64/build
  1591. KERNEL_SOURCES: /lib/modules/3.11-2.slh.2-aptosid-amd64/build
  1592. EXTRA_CFLAGS: -O2 -DNVIDIA_UVM_LITE_ENABLED -DLinux -D__linux__ -DNVIDIA_UVM_RM_ENABLED -I/usr/src/sgfxi-downloads/NVIDIA-Linux-x86_64-331.20/kernel/uvm -I/usr/src/sgfxi-downloads/NVIDIA-Linux-x86_64-331.20/kernel -I. -Wall -MD -Wsign-compare -Wno-cast-qual -Wno-error -D__KERNEL__ -DMODULE -DNVRM -DNV_VERSION_STRING="331.20" -Wno-unused-function -Wuninitialized -mno-red-zone -mcmodel=kernel -DNV_UVM_ENABLE -D__linux__ -DNV_DEV_NAME="nvidia-uvm"
  1593. NVIDIA: calling KBUILD...
  1594. make[1]: Entering directory `/usr/src/linux-headers-3.11-2.slh.2-aptosid-amd64'
  1595. test -e include/generated/autoconf.h -a -e include/config/auto.conf || ( \
  1596. echo >&2; \
  1597. echo >&2 " ERROR: Kernel configuration is invalid."; \
  1598. echo >&2 " include/generated/autoconf.h or include/config/auto.conf are missing.";\
  1599. echo >&2 " Run 'make oldconfig && make prepare' on kernel src to fix it."; \
  1600. echo >&2 ; \
  1601. /bin/false)
  1602. mkdir -p /usr/src/sgfxi-downloads/NVIDIA-Linux-x86_64-331.20/kernel/uvm/.tmp_versions ; rm -f /usr/src/sgfxi-downloads/NVIDIA-Linux-x86_64-331.20/kernel/uvm/.tmp_versions/*
  1603. make -f scripts/Makefile.build obj=/usr/src/sgfxi-downloads/NVIDIA-Linux-x86_64-331.20/kernel/uvm
  1604. /usr/bin/gcc-4.8 -Wp,-MD,/usr/src/sgfxi-downloads/NVIDIA-Linux-x86_64-331.20/kernel/uvm/.nvidia_uvm_linux.o.d -nostdinc -isystem /usr/lib/gcc/x86_64-linux-gnu/4.8/include -I/usr/src/linux-headers-3.11-2.slh.2-aptosid-amd64/arch/x86/include -Iarch/x86/include/generated -Iinclude -I/usr/src/linux-headers-3.11-2.slh.2-aptosid-amd64/arch/x86/include/uapi -Iarch/x86/include/generated/uapi -I/usr/src/linux-headers-3.11-2.slh.2-aptosid-amd64
  1605. /include/uapi -Iinclude/generated/uapi -include /usr/src/linux-headers-3.11-2.slh.2-aptosid-amd64/include/linux/kconfig.h -D__KERNEL__ -Wall -Wundef -Wstrict-prototypes -Wno-trigraphs -fno-strict-aliasing -fno-common -Werror-implicit-function-declaration -Wno-format-security -fno-delete-null-pointer-checks -Os -Wno-maybe-uninitialized -m64 -mno-sse -mpreferred-stack-boundary=3 -mtune=generic -mno-red-zone -mcmodel=kernel -funit-at-a-time -maccumulate-outgoing-args -fstack-protector -DCONFIG_AS_CFI=1 -DCONFIG_AS_CFI_SIGNAL_FRAME=1 -DCONFIG_AS_CFI_SECTIONS=1 -DCONFIG_AS_FXSAVEQ=1 -DCONFIG_AS_AVX=1 -DCONFIG_AS_AVX2=1 -pipe -Wno-sign-compare -fno-asynchronous-unwind-tables -mno-sse -mno-mmx -mno-sse2 -mno-3dnow -mno-avx -Wframe-larger-than=2048 -Wno-unused-but-set-variable -fomit-frame-pointer -Wdeclaration-after-statement -Wno-pointer-sign -fno-strict-overflow -fconserve-stack -DCC_HAVE_ASM_GOTO -O2 -DNVIDIA_UVM_LITE_ENABLED -DLinux -D__linux__ -DNVIDIA_UVM_RM_ENABLED -I/usr/src/sgfxi-downloads/NVIDIA-Linux-
  1606. x86_
  1607. 64-331.20/kernel/uvm -I/usr/src/sgfxi-downloads/NVIDIA-Linux-x86_64-331.20/kernel -O2 -DNVIDIA_UVM_LITE_ENABLED -DLinux -D__linux__ -DNVIDIA_UVM_RM_ENABLED -I/usr/src/sgfxi-downloads/NVIDIA-Linux-x86_64-331.20/kernel/uvm -I/usr/src/sgfxi-downloads/NVIDIA-Linux-x86_64-331.20/kernel -I/usr/src/sgfxi-downloads/NVIDIA-Linux-x86_64-331.20/kernel/uvm -Wall -MD -Wsign-compare -Wno-cast-qual -Wno-error -D__KERNEL__ -DMODULE -DNVRM -DNV_VERSION_STRING=\"331.20\" -Wno-unused-function -Wuninitialized -mno-red-zone -mcmodel=kernel -DNV_UVM_ENABLE -D__linux__ -DNV_DEV_NAME=\"nvidia-uvm\" -DMODULE -D"KBUILD_STR(s)=#s" -D"KBUILD_BASENAME=KBUILD_STR(nvidia_uvm_linux)" -D"KBUILD_MODNAME=KBUILD_STR(nvidia_uvm)" -c -o /usr/src/sgfxi-downloads/NVIDIA-Linux-x86_64-331.20/kernel/uvm/.tmp_nvidia_uvm_linux.o /usr/src/sgfxi-downloads/NVIDIA-Linux-x86_64-331.20/kernel/uvm/nvidia_uvm_linux.c
  1608. In file included from /usr/src/linux-headers-3.11-2.slh.2-aptosid-amd64/arch/x86/include/asm/bitops.h:514:0,
  1609. from include/linux/bitops.h:22,
  1610. from include/linux/kernel.h:10,
  1611. from include/linux/sched.h:15,
  1612. from include/linux/utsname.h:5,
  1613. from /usr/src/sgfxi-downloads/NVIDIA-Linux-x86_64-331.20/kernel/uvm/nvidia_uvm_linux.h:62,
  1614. from /usr/src/sgfxi-downloads/NVIDIA-Linux-x86_64-331.20/kernel/uvm/nvidia_uvm_lite.h:36,
  1615. from /usr/src/sgfxi-downloads/NVIDIA-Linux-x86_64-331.20/kernel/uvm/nvidia_uvm_linux.c:24:
  1616. include/linux/bitops.h: In function ‘hweight_long’:
  1617. include/asm-generic/bitops/const_hweight.h:27:70: warning: signed and unsigned type in conditional expression [-Wsign-compare]
  1618. #define hweight64(w) (__builtin_constant_p(w) ? __const_hweight64(w) : __arch_hweight64(w))
  1619. ^
  1620. include/linux/bitops.h:66:41: note: in expansion of macro ‘hweight64’
  1621. return sizeof(w) == 4 ? hweight32(w) : hweight64(w);
  1622. ^
  1623. In file included from /usr/src/linux-headers-3.11-2.slh.2-aptosid-amd64/arch/x86/include/asm/cpumask.h:4:0,
  1624. from /usr/src/linux-headers-3.11-2.slh.2-aptosid-amd64/arch/x86/include/asm/msr.h:10,
  1625. from /usr/src/linux-headers-3.11-2.slh.2-aptosid-amd64/arch/x86/include/asm/processor.h:20,
  1626. from /usr/src/linux-headers-3.11-2.slh.2-aptosid-amd64/arch/x86/include/asm/thread_info.h:22,
  1627. from include/linux/thread_info.h:54,
  1628. from include/linux/preempt.h:9,
  1629. from include/linux/spinlock.h:50,
  1630. from include/linux/seqlock.h:29,
  1631. from include/linux/time.h:5,
  1632. from include/uapi/linux/timex.h:56,
  1633. from include/linux/timex.h:56,
  1634. from include/linux/sched.h:17,
  1635. from include/linux/utsname.h:5,
  1636. from /usr/src/sgfxi-downloads/NVIDIA-Linux-x86_64-331.20/kernel/uvm/nvidia_uvm_linux.h:62,
  1637. from /usr/src/sgfxi-downloads/NVIDIA-Linux-x86_64-331.20/kernel/uvm/nvidia_uvm_lite.h:36,
  1638. from /usr/src/sgfxi-downloads/NVIDIA-Linux-x86_64-331.20/kernel/uvm/nvidia_uvm_linux.c:24:
  1639. include/linux/cpumask.h: In function ‘cpumask_parse’:
  1640. include/linux/cpumask.h:603:26: warning: signed and unsigned type in conditional expression [-Wsign-compare]
  1641. int len = nl ? nl - buf : strlen(buf);
  1642. ^
  1643. In file included from include/uapi/linux/stddef.h:1:0,
  1644. from include/linux/stddef.h:4,
  1645. from /usr/src/linux-headers-3.11-2.slh.2-aptosid-amd64/include/uapi/linux/posix_types.h:4,
  1646. from include/uapi/linux/types.h:13,
  1647. from include/linux/types.h:5,
  1648. from include/uapi/linux/capability.h:16,
  1649. from include/linux/capability.h:15,
  1650. from include/linux/sched.h:13,
  1651. from include/linux/utsname.h:5,
  1652. from /usr/src/sgfxi-downloads/NVIDIA-Linux-x86_64-331.20/kernel/uvm/nvidia_uvm_linux.h:62,
  1653. from /usr/src/sgfxi-downloads/NVIDIA-Linux-x86_64-331.20/kernel/uvm/nvidia_uvm_lite.h:36,
  1654. from /usr/src/sgfxi-downloads/NVIDIA-Linux-x86_64-331.20/kernel/uvm/nvidia_uvm_linux.c:24:
  1655. /usr/src/linux-headers-3.11-2.slh.2-aptosid-amd64/arch/x86/include/asm/uaccess_64.h: In function ‘copy_from_user’:
  1656. /usr/src/linux-headers-3.11-2.slh.2-aptosid-amd64/arch/x86/include/asm/uaccess_64.h:62:28: warning: comparison between signed and unsigned integer expressions [-Wsign-compare]
  1657. if (likely(sz == -1 || sz >= n))
  1658. ^
  1659. include/linux/compiler.h:152:40: note: in definition of macro ‘likely’
  1660. # define likely(x) __builtin_expect(!!(x), 1)
  1661. ^
  1662. /usr/bin/gcc-4.8 -Wp,-MD,/usr/src/sgfxi-downloads/NVIDIA-Linux-x86_64-331.20/kernel/uvm/.nvidia_uvm_common.o.d -nostdinc -isystem /usr/lib/gcc/x86_64-linux-gnu/4.8/include -I/usr/src/linux-headers-3.11-2.slh.2-aptosid-amd64/arch/x86/include -Iarch/x86/include/generated -Iinclude -I/u
  1663. sr/src/linux-headers-3.11-2.slh.2-aptosid-amd64/arch/x86/include/uapi -Iarch/x86/include/generated/uapi -I/usr/src/linux-headers-3.11-2.slh.2-aptosid-amd64/include/uapi -Iinclude/generated/uapi -include /usr/src/linux-headers-3.11-2.slh.2-aptosid-amd64/include/linux/kconfig.h -D__KERNEL__ -Wall -Wundef -Wstrict-prototypes -Wno-trigraphs -fno-strict-aliasing -fno-common -Werror-implicit-function-declaration -Wno-format-security -fno-delete-null-pointer-checks -Os -Wno-maybe-uninitialized -m64 -mno-sse -mpreferred-stack-boundary=3 -mtune=generic -mno-red-zone -mcmodel=kernel -funit-at-a-time -maccumulate-outgoing-args -fstack-protector -DCONFIG_AS_CFI=1 -DCONFIG_AS_CFI_SIGNAL_FRAME=1 -DCONFIG_AS_CFI_SECTIONS=1 -DCONFIG_AS_FXSAVEQ=1 -DCONFIG_AS_AVX=1 -DCONFIG_AS_AVX2=1 -pipe -Wno-sign-compare -fno-asynchronous-unwind-tables -mno-sse -mno-mmx -mno-sse2 -mno-3dnow -mno-avx -Wframe-larger-than=2048 -Wno-unused-but-set-variable -fomit-frame-pointer -Wdeclaration-after-statement -Wno-pointer-sign -fno-strict-
  1664. overflow
  1665. -fconserve-stack -DCC_HAVE_ASM_GOTO -O2 -DNVIDIA_UVM_LITE_ENABLED -DLinux -D__linux__ -DNVIDIA_UVM_RM_ENABLED -I/usr/src/sgfxi-downloads/NVIDIA-Linux-x86_64-331.20/kernel/uvm -I/usr/src/sgfxi-downloads/NVIDIA-Linux-x86_64-331.20/kernel -O2 -DNVIDIA_UVM_LITE_ENABLED -DLinux -D__linux__ -DNVIDIA_UVM_RM_ENABLED -I/usr/src/sgfxi-downloads/NVIDIA-Linux-x86_64-331.20/kernel/uvm -I/usr/src/sgfxi-downloads/NVIDIA-Linux-x86_64-331.20/kernel -I/usr/src/sgfxi-downloads/NVIDIA-Linux-x86_64-331.20/kernel/uvm -Wall -MD -Wsign-compare -Wno-cast-qual -Wno-error -D__KERNEL__ -DMODULE -DNVRM -DNV_VERSION_STRING=\"331.20\" -Wno-unused-function -Wuninitialized -mno-red-zone -mcmodel=kernel -DNV_UVM_ENABLE -D__linux__ -DNV_DEV_NAME=\"nvidia-uvm\" -DMODULE -D"KBUILD_STR(s)=#s" -D"KBUILD_BASENAME=KBUILD_STR(nvidia_uvm_common)" -D"KBUILD_MODNAME=KBUILD_STR(nvidia_uvm)" -c -o /usr/src/sgfxi-downloads/NVIDIA-Linux-x86_64-331.20/kernel/uvm/.tmp_nvidia_uvm_common.o /usr/src/sgfxi-downloads/NVIDIA-Linux-x86_64-331.20/kernel/uvm/
  1666. nvidi
  1667. a_uvm_common.c
  1668. In file included from /usr/src/linux-headers-3.11-2.slh.2-aptosid-amd64/arch/x86/include/asm/bitops.h:514:0,
  1669. from include/linux/bitops.h:22,
  1670. from include/linux/kernel.h:10,
  1671. from include/linux/sched.h:15,
  1672. from include/linux/utsname.h:5,
  1673. from /usr/src/sgfxi-downloads/NVIDIA-Linux-x86_64-331.20/kernel/uvm/nvidia_uvm_linux.h:62,
  1674. from /usr/src/sgfxi-downloads/NVIDIA-Linux-x86_64-331.20/kernel/nv_uvm_interface.h:31,
  1675. from /usr/src/sgfxi-downloads/NVIDIA-Linux-x86_64-331.20/kernel/uvm/uvm_gpu_provider.h:28,
  1676. from /usr/src/sgfxi-downloads/NVIDIA-Linux-x86_64-331.20/kernel/uvm/nvidia_uvm_common.c:41:
  1677. include/linux/bitops.h: In function ‘hweight_long’:
  1678. include/asm-generic/bitops/const_hweight.h:27:70: warning: signed and unsigned type in conditional expression [-Wsign-compare]
  1679. #define hweight64(w) (__builtin_constant_p(w) ? __const_hweight64(w) : __arch_hweight64(w))
  1680. ^
  1681. include/linux/bitops.h:66:41: note: in expansion of macro ‘hweight64’
  1682. return sizeof(w) == 4 ? hweight32(w) : hweight64(w);
  1683. ^
  1684. In file included from /usr/src/linux-headers-3.11-2.slh.2-aptosid-amd64/arch/x86/include/asm/cpumask.h:4:0,
  1685. from /usr/src/linux-headers-3.11-2.slh.2-aptosid-amd64/arch/x86/include/asm/msr.h:10,
  1686. from /usr/src/linux-headers-3.11-2.slh.2-aptosid-amd64/arch/x86/include/asm/processor.h:20,
  1687. from /usr/src/linux-headers-3.11-2.slh.2-aptosid-amd64/arch/x86/include/asm/thread_info.h:22,
  1688. from include/linux/thread_info.h:54,
  1689. from include/linux/preempt.h:9,
  1690. from include/linux/spinlock.h:50,
  1691. from include/linux/seqlock.h:29,
  1692. from include/linux/time.h:5,
  1693. from include/uapi/linux/timex.h:56,
  1694. from include/linux/timex.h:56,
  1695. from include/linux/sched.h:17,
  1696. from include/linux/utsname.h:5,
  1697. from /usr/src/sgfxi-downloads/NVIDIA-Linux-x86_64-331.20/kernel/uvm/nvidia_uvm_linux.h:62,
  1698. from /usr/src/sgfxi-downloads/NVIDIA-Linux-x86_64-331.20/kernel/nv_uvm_interface.h:31,
  1699. from /usr/src/sgfxi-downloads/NVIDIA-Linux-x86_64-331.20/kernel/uvm/uvm_gpu_provider.h:28,
  1700. from /usr/src/sgfxi-downloads/NVIDIA-Linux-x86_64-331.20/kernel/uvm/nvidia_uvm_common.c:41:
  1701. include/linux/cpumask.h: In function ‘cpumask_parse’:
  1702. include/linux/cpumask.h:603:26: warning: signed and unsigned type in conditional expression [-Wsign-compare]
  1703. int len = nl ? nl - buf : strlen(buf);
  1704. ^
  1705. In file included from include/uapi/linux/stddef.h:1:0,
  1706. from include/linux/stddef.h:4,
  1707. from /usr/src/linux-headers-3.11-2.slh.2-aptosid-amd64/include/uapi/linux/posix_types.h:4,
  1708. from include/uapi/linux/types.h:13,
  1709. from include/linux/types.h:5,
  1710. from include/uapi/linux/capability.h:16,
  1711. from include/linux/capability.h:15,
  1712. from include/linux/sched.h:13,
  1713. from include/linux/utsname.h:5,
  1714. from /usr/src/sgfxi-downloads/NVIDIA-Linux-x86_64-331.20/kernel/uvm/nvidia_uvm_linux.h:62,
  1715. from /usr/src/sgfxi-downloads/NVIDIA-Linux-x86_64-331.20/kernel/nv_uvm_interface.h:31,
  1716. from /usr/src/sgfxi-downloads/NVIDIA-Linux-x86_64-331.20/kernel/uvm/uvm_gpu_provider.h:28,
  1717. from /usr/src/sgfxi-downloads/NVIDIA-Linux-x86_64-331.20/kernel/uvm/nvidia_uvm_common.c:41:
  1718. /usr/src/linux-headers-3.11-2.slh.2-aptosid-amd64/arch/x86/include/asm/uaccess_64.h: In function ‘copy_from_user’:
  1719. /usr/src/linux-headers-3.11-2.slh.2-aptosid-amd64/arch/x86/include/asm/uaccess_64.h:62:28: warning: comparison between signed and unsigned integer expressions [-Wsign-compare]
  1720. if (likely(sz == -1 || sz >= n))
  1721. ^
  1722. include/linux/compiler.h:152:40: note: in definition of macro ‘likely’
  1723. # define likely(x) __builtin_expect(!!(x), 1)
  1724. ^
  1725. /usr/bin/gcc-4.8 -Wp,-MD,/usr/src/sgfxi-downloads/NVIDIA-Linux-x86_64-331.20/kernel/uvm/.nvidia_uvm_utils.o.d -nostdinc -isystem /usr/lib/gcc/x86_64-linux-gnu/4.8/include -I/usr/src/linux-headers-3.11-2.slh.2-aptosid-amd64/arch/x86/include -Iarch/x86/include/generated -Iinclude -I/usr/src/linux-headers-3.11-2.slh.2-aptosid-amd64/arch/x86/include/uapi -Iarch/x86/include/generated/uapi -I/usr/src/linux-headers-3.11-2.slh.2-aptosid-amd64/include/uapi -Iinclude/generated/uapi -include /usr/src/linux-headers-3.11-2.slh.2-aptosid-amd64/include/linux/kconfig.h -D__KERNEL__ -Wall -Wundef -Wstrict-prototypes -Wno-trigraphs -fno-strict-aliasing -fno-common -Werror-implicit-function-declaration -Wno-format-security -fno-delete-null-pointer-checks -Os -Wno-maybe-uninitialized -m64 -mno-sse -mpreferred-stack-boundary=3 -mtune=generic
  1726. -mno-red-zone -mcmodel=kernel -funit-at-a-time -maccumulate-outgoing-args -fstack-protector -DCONFIG_AS_CFI=1 -DCONFIG_AS_CFI_SIGNAL_FRAME=1 -DCONFIG_AS_CFI_SECTIONS=1 -DCONFIG_AS_FXSAVEQ=1 -DCONFIG_AS_AVX=1 -DCONFIG_AS_AVX2=1 -pipe -Wno-sign-compare -fno-asynchronous-unwind-tables -mno-sse -mno-mmx -mno-sse2 -mno-3dnow -mno-avx -Wframe-larger-than=2048 -Wno-unused-but-set-variable -fomit-frame-pointer -Wdeclaration-after-statement -Wno-pointer-sign -fno-strict-overflow -fconserve-stack -DCC_HAVE_ASM_GOTO -O2 -DNVIDIA_UVM_LITE_ENABLED -DLinux -D__linux__ -DNVIDIA_UVM_RM_ENABLED -I/usr/src/sgfxi-downloads/NVIDIA-Linux-x86_64-331.20/kernel/uvm -I/usr/src/sgfxi-downloads/NVIDIA-Linux-x86_64-331.20/kernel -O2 -DNVIDIA_UVM_LITE_ENABLED -DLinux -D__linux__ -DNVIDIA_UVM_RM_ENABLED -I/usr/src/sgfxi-downloads/NVIDIA-Linux-x86_64-331.20/kernel/uvm -I/usr/src/sgfxi-downloads/NVIDIA-Linux-x86_64-331.20/kernel -I/usr/src/sgfxi-downloads/NVIDIA-Linux-x86_64-331.20/kernel/uvm -Wall -MD -Wsign-compare -Wno-cast-qual -
  1727. Wno-er
  1728. ror -D__KERNEL__ -DMODULE -DNVRM -DNV_VERSION_STRING=\"331.20\" -Wno-unused-function -Wuninitialized -mno-red-zone -mcmodel=kernel -DNV_UVM_ENABLE -D__linux__ -DNV_DEV_NAME=\"nvidia-uvm\" -DMODULE -D"KBUILD_STR(s)=#s" -D"KBUILD_BASENAME=KBUILD_STR(nvidia_uvm_utils)" -D"KBUILD_MODNAME=KBUILD_STR(nvidia_uvm)" -c -o /usr/src/sgfxi-downloads/NVIDIA-Linux-x86_64-331.20/kernel/uvm/.tmp_nvidia_uvm_utils.o /usr/src/sgfxi-downloads/NVIDIA-Linux-x86_64-331.20/kernel/uvm/nvidia_uvm_utils.c
  1729. In file included from /usr/src/linux-headers-3.11-2.slh.2-aptosid-amd64/arch/x86/include/asm/bitops.h:514:0,
  1730. from include/linux/bitops.h:22,
  1731. from include/linux/kernel.h:10,
  1732. from include/linux/sched.h:15,
  1733. from include/linux/utsname.h:5,
  1734. from /usr/src/sgfxi-downloads/NVIDIA-Linux-x86_64-331.20/kernel/uvm/nvidia_uvm_linux.h:62,
  1735. from /usr/src/sgfxi-downloads/NVIDIA-Linux-x86_64-331.20/kernel/uvm/nvidia_uvm_utils.c:25:
  1736. include/linux/bitops.h: In function ‘hweight_long’:
  1737. include/asm-generic/bitops/const_hweight.h:27:70: warning: signed and unsigned type in conditional expression [-Wsign-compare]
  1738. #define hweight64(w) (__builtin_constant_p(w) ? __const_hweight64(w) : __arch_hweight64(w))
  1739. ^
  1740. include/linux/bitops.h:66:41: note: in expansion of macro ‘hweight64’
  1741. return sizeof(w) == 4 ? hweight32(w) : hweight64(w);
  1742. ^
  1743. In file included from /usr/src/linux-headers-3.11-2.slh.2-aptosid-amd64/arch/x86/include/asm/cpumask.h:4:0,
  1744. from /usr/src/linux-headers-3.11-2.slh.2-aptosid-amd64/arch/x86/include/asm/msr.h:10,
  1745. from /usr/src/linux-headers-3.11-2.slh.2-aptosid-amd64/arch/x86/include/asm/processor.h:20,
  1746. from /usr/src/linux-headers-3.11-2.slh.2-aptosid-amd64/arch/x86/include/asm/thread_info.h:22,
  1747. from include/linux/thread_info.h:54,
  1748. from include/linux/preempt.h:9,
  1749. from include/linux/spinlock.h:50,
  1750. from include/linux/seqlock.h:29,
  1751. from include/linux/time.h:5,
  1752. from include/uapi/linux/timex.h:56,
  1753. from include/linux/timex.h:56,
  1754. from include/linux/sched.h:17,
  1755. from include/linux/utsname.h:5,
  1756. from /usr/src/sgfxi-downloads/NVIDIA-Linux-x86_64-331.20/kernel/uvm/nvidia_uvm_linux.h:62,
  1757. from /usr/src/sgfxi-downloads/NVIDIA-Linux-x86_64-331.20/kernel/uvm/nvidia_uvm_utils.c:25:
  1758. include/linux/cpumask.h: In function ‘cpumask_parse’:
  1759. include/linux/cpumask.h:603:26: warning: signed and unsigned type in conditional expression [-Wsign-compare]
  1760. int len = nl ? nl - buf : strlen(buf);
  1761. ^
  1762. In file included from include/uapi/linux/stddef.h:1:0,
  1763. from include/linux/stddef.h:4,
  1764. from /usr/src/linux-headers-3.11-2.slh.2-aptosid-amd64/include/uapi/linux/posix_types.h:4,
  1765. from include/uapi/linux/types.h:13,
  1766. from include/linux/types.h:5,
  1767. from include/uapi/linux/capability.h:16,
  1768. from include/linux/capability.h:15,
  1769. from include/linux/sched.h:13,
  1770. from include/linux/utsname.h:5,
  1771. from /usr/src/sgfxi-downloads/NVIDIA-Linux-x86_64-331.20/kernel/uvm/nvidia_uvm_linux.h:62,
  1772. from /usr/src/sgfxi-downloads/NVIDIA-Linux-x86_64-331.20/kernel/uvm/nvidia_uvm_utils.c:25:
  1773. /usr/src/linux-headers-3.11-2.slh.2-aptosid-amd64/arch/x86/include/asm/uaccess_64.h: In function ‘copy_from_user’:
  1774. /usr/src/linux-headers-3.11-2.slh.2-aptosid-amd64/arch/x86/include/asm/uaccess_64.h:62:28: warning: comparison between signed and unsigned integer expressions [-Wsign-compare]
  1775. if (likely(sz == -1 || sz >= n))
  1776. ^
  1777. include/linux/compiler.h:152:40: note: in definition of macro ‘likely’
  1778. # define likely(x) __builtin_expect(!!(x), 1)
  1779. ^
  1780. /usr/bin/gcc-4.8 -Wp,-MD,/usr/src/sgfxi-downloads/NVIDIA-Linux-x86_64-331.20/kernel/uvm/.nvidia_uvm_lite.o.d -nostdinc -isystem /usr/lib/gcc/x86_64-linux-gnu/4.8/include -I/usr/src/linux-headers-3.11-2.slh.2-aptosid-amd64/arch/x86/include -Iarch/x86/include/generated -Iinclude -I/usr/src/linux-headers-3.11-2.slh.2-aptosid-amd64/arch/x86/include/uapi -Iarch/x86/include/generated/uapi -I/usr/src/linux-headers-3.11-2.slh.2-aptosid-amd64/include/uapi -Iinclude/generated/uapi -include /usr/src/linux-headers-3.11-2.slh.2-aptosid-amd64/include/linux/kconfig.h -D__KERNEL__ -Wall -Wundef -Wstrict-prototypes -Wno-trigraphs -fno-strict-aliasing -fno-common -Werror-implicit-function-declaration -Wno-format-security -fno-delete-null-pointer-checks -Os -Wno-maybe-uninitialized -m64 -mno-sse -mpreferred-stack-boundary=3 -mtune=generic -mno-red-zone -mcmodel=kernel -funit-at-a-time -maccumulate-outgoing-args -fstack-protector -DCONFIG_AS_CFI=1 -DCONFIG_AS_CFI_SIGNAL_FRAME=1 -DCONFIG_AS_CFI_SECTIONS=1
  1781. -DCONFIG_AS_FXSAVEQ=1 -DCONFIG_AS_AVX=1 -DCONFIG_AS_AVX2=1 -pipe -Wno-sign-compare -fno-asynchronous-unwind-tables -mno-sse -mno-mmx -mno-sse2 -mno-3dnow -mno-avx -Wframe-larger-than=2048 -Wno-unused-but-set-variable -fomit-frame-pointer -Wdeclaration-after-statement -Wno-pointer-sign -fno-strict-overflow -fconserve-stack -DCC_HAVE_ASM_GOTO -O2 -DNVIDIA_UVM_LITE_ENABLED -DLinux -D__linux__ -DNVIDIA_UVM_RM_ENABLED -I/usr/src/sgfxi-downloads/NVIDIA-Linux-x86_64-331.20/kernel/uvm -I/usr/src/sgfxi-downloads/NVIDIA-Linux-x86_64-331.20/kernel -O2 -DNVIDIA_UVM_LITE_ENABLED -DLinux -D__linux__ -DNVIDIA_UVM_RM_ENABLED -I/usr/src/sgfxi-downloads/NVIDIA-Linux-x86_64-331.20/kernel/uvm -I/usr/src/sgfxi-downloads/NVIDIA-Linux-x86_64-331.20/kernel -I/usr/src/sgfxi-downloads/NVIDIA-Linux-x86_64-331.20/kernel/uvm -Wall -MD -Wsign-compare -Wno-cast-qual -Wno-error -D__KERNEL__ -DMODULE -DNVRM -DNV_VERSION_STRING=\"331.20\" -Wno-unused-function -Wuninitialized -mno-red-zone -mcmodel=kernel -DNV_UVM_ENABLE -D__linux__ -DNV_
  1782. DEV_
  1783. NAME=\"nvidia-uvm\" -DMODULE -D"KBUILD_STR(s)=#s" -D"KBUILD_BASENAME=KBUILD_STR(nvidia_uvm_lite)" -D"KBUILD_MODNAME=KBUILD_STR(nvidia_uvm)" -c -o /usr/src/sgfxi-downloads/NVIDIA-Linux-x86_64-331.20/kernel/uvm/.tmp_nvidia_uvm_lite.o /usr/src/sgfxi-downloads/NVIDIA-Linux-x86_64-331.20/kernel/uvm/nvidia_uvm_lite.c
  1784. In file included from /usr/src/linux-headers-3.11-2.slh.2-aptosid-amd64/arch/x86/include/asm/bitops.h:514:0,
  1785. from include/linux/bitops.h:22,
  1786. from include/linux/kernel.h:10,
  1787. from include/linux/sched.h:15,
  1788. from include/linux/utsname.h:5,
  1789. from /usr/src/sgfxi-downloads/NVIDIA-Linux-x86_64-331.20/kernel/uvm/nvidia_uvm_linux.h:62,
  1790. from /usr/src/sgfxi-downloads/NVIDIA-Linux-x86_64-331.20/kernel/uvm/nvidia_uvm_common.h:49,
  1791. from /usr/src/sgfxi-downloads/NVIDIA-Linux-x86_64-331.20/kernel/uvm/nvidia_uvm_lite.c:26:
  1792. include/linux/bitops.h: In function ‘hweight_long’:
  1793. include/asm-generic/bitops/const_hweight.h:27:70: warning: signed and unsigned type in conditional expression [-Wsign-compare]
  1794. #define hweight64(w) (__builtin_constant_p(w) ? __const_hweight64(w) : __arch_hweight64(w))
  1795. ^
  1796. include/linux/bitops.h:66:41: note: in expansion of macro ‘hweight64’
  1797. return sizeof(w) == 4 ? hweight32(w) : hweight64(w);
  1798. ^
  1799. In file included from /usr/src/linux-headers-3.11-2.slh.2-aptosid-amd64/arch/x86/include/asm/cpumask.h:4:0,
  1800. from /usr/src/linux-headers-3.11-2.slh.2-aptosid-amd64/arch/x86/include/asm/msr.h:10,
  1801. from /usr/src/linux-headers-3.11-2.slh.2-aptosid-amd64/arch/x86/include/asm/processor.h:20,
  1802. from /usr/src/linux-headers-3.11-2.slh.2-aptosid-amd64/arch/x86/include/asm/thread_info.h:22,
  1803. from include/linux/thread_info.h:54,
  1804. from include/linux/preempt.h:9,
  1805. from include/linux/spinlock.h:50,
  1806. from include/linux/seqlock.h:29,
  1807. from include/linux/time.h:5,
  1808. from include/uapi/linux/timex.h:56,
  1809. from include/linux/timex.h:56,
  1810. from include/linux/sched.h:17,
  1811. from include/linux/utsname.h:5,
  1812. from /usr/src/sgfxi-downloads/NVIDIA-Linux-x86_64-331.20/kernel/uvm/nvidia_uvm_linux.h:62,
  1813. from /usr/src/sgfxi-downloads/NVIDIA-Linux-x86_64-331.20/kernel/uvm/nvidia_uvm_common.h:49,
  1814. from /usr/src/sgfxi-downloads/NVIDIA-Linux-x86_64-331.20/kernel/uvm/nvidia_uvm_lite.c:26:
  1815. include/linux/cpumask.h: In function ‘cpumask_parse’:
  1816. include/linux/cpumask.h:603:26: warning: signed and unsigned type in conditional expression [-Wsign-compare]
  1817. int len = nl ? nl - buf : strlen(buf);
  1818. ^
  1819. In file included from include/uapi/linux/stddef.h:1:0,
  1820. from include/linux/stddef.h:4,
  1821. from /usr/src/linux-headers-3.11-2.slh.2-aptosid-amd64/include/uapi/linux/posix_types.h:4,
  1822. from include/uapi/linux/types.h:13,
  1823. from include/linux/types.h:5,
  1824. from include/uapi/linux/capability.h:16,
  1825. from include/linux/capability.h:15,
  1826. from include/linux/sched.h:13,
  1827. from include/linux/utsname.h:5,
  1828. from /usr/src/sgfxi-downloads/NVIDIA-Linux-x86_64-331.20/kernel/uvm/nvidia_uvm_linux.h:62,
  1829. from /usr/src/sgfxi-downloads/NVIDIA-Linux-x86_64-331.20/kernel/uvm/nvidia_uvm_common.h:49,
  1830. from /usr/src/sgfxi-downloads/NVIDIA-Linux-x86_64-331.20/kernel/uvm/nvidia_uvm_lite.c:26:
  1831. /usr/src/linux-headers-3.11-2.slh.2-aptosid-amd64/arch/x86/include/asm/uaccess_64.h: In function ‘copy_from_user’:
  1832. /usr/src/linux-headers-3.11-2.slh.2-aptosid-amd64/arch/x86/include/asm/uaccess_64.h:62:28: warning: comparison between signed and unsigned integer expressions [-Wsign-compare]
  1833. if (likely(sz == -1 || sz >= n))
  1834. ^
  1835. include/linux/compiler.h:152:40: note: in definition of macro ‘likely’
  1836. # define likely(x) __builtin_expect(!!(x), 1)
  1837. ^
  1838. /usr/src/sgfxi-downloads/NVIDIA-Linux-x86_64-331.20/kernel/uvm/nvidia_uvm_lite.c: In function ‘uvmlite_open’:
  1839. /usr/src/sgfxi-downloads/NVIDIA-Linux-x86_64-331.20/kernel/uvm/nvidia_uvm_lite.c:1326:37: error: incompatible types when assigning to type ‘uid_t’ from type ‘kuid_t’
  1840. pUvmPrivate->processRecord.euid = NV_CURRENT_EUID();
  1841. ^
  1842. make[2]: *** [/usr/src/sgfxi-downloads/NVIDIA-Linux-x86_64-331.20/kernel/uvm/nvidia_uvm_lite.o] Error 1
  1843. make[1]: *** [_module_/usr/src/sgfxi-downloads/NVIDIA-Linux-x86_64-331.20/kernel/uvm] Error 2
  1844. make[1]: Leaving directory `/usr/src/linux-headers-3.11-2.slh.2-aptosid-amd64'
  1845. NVIDIA: left KBUILD.
  1846. nvidia-uvm.ko failed to build!
  1847. make: *** [nvidia-uvm.ko] Error 1
  1848. -> Error.
  1849. ERROR: Unable to build the Unified Memory kernel module.
  1850. -> done.
  1851. ERROR: The Unified Memory kernel module failed to build. To work around this issue, you may attempt to install this driver package again with the '--no-unified-memory' option.
  1852. ERROR: Installation has failed. Please see the file '/var/log/nvidia-installer.log' for details. You may find suggestions on fixing installation problems in the README available on the Linux driver download page at www.nvidia.com.
  1853. - - - - - - - - - - - - - - - - - - - - - - - - - - - - - - - - -
  1854. ERROR: (245) The nvidia installer exited with the error: 1
  1855. A copy of this driver installer error log is also here: /var/log/sgfxi/sgfxi.log
Advertisement
Add Comment
Please, Sign In to add comment
Advertisement