Advertisement
Guest User

Untitled

a guest
Feb 29th, 2020
109
Never
Not a member of Pastebin yet? Sign Up, it unlocks many cool features!
  1. Teds-iMac:~ gnucash$ jhbuild build
  2. Loading .env environment variables…
  3. *** Checking out zlib *** [1/71]
  4. *** Skipping zlib (package and dependencies not updated) *** [1/71]
  5. *** Checking out libpng *** [2/71]
  6. *** Skipping libpng (package and dependencies not updated) *** [2/71]
  7. *** Checking out libjpeg *** [3/71]
  8. *** Skipping libjpeg (package and dependencies not updated) *** [3/71]
  9. *** Checking out libtiff *** [4/71]
  10. *** Skipping libtiff (package and dependencies not updated) *** [4/71]
  11. *** Checking out gettext-runtime *** [5/71]
  12. *** Skipping gettext-runtime (package and dependencies not updated) *** [5/71]
  13. *** Checking out hicolor-icon-theme *** [6/71]
  14. *** Skipping hicolor-icon-theme (package and dependencies not updated) *** [6/71]
  15. *** Checking out readline *** [7/71]
  16. *** Skipping readline (package and dependencies not updated) *** [7/71]
  17. *** Checking out openssl *** [8/71]
  18. *** Skipping openssl (package and dependencies not updated) *** [8/71]
  19. *** Checking out python3 *** [9/71]
  20. *** Skipping python3 (package and dependencies not updated) *** [9/71]
  21. *** Checking out libxml2 *** [10/71]
  22. *** Skipping libxml2 (package and dependencies not updated) *** [10/71]
  23. *** Checking out libxslt *** [11/71]
  24. *** Skipping libxslt (package and dependencies not updated) *** [11/71]
  25. *** Checking out itstool *** [12/71]
  26. *** Configuring itstool *** [12/71]
  27. /Users/gnucash/gnucash-stable/src/itstool-2.0.6/configure --prefix /Users/gnucash/gnucash-stable
  28. checking for a BSD-compatible install... /usr/bin/install -c
  29. checking whether build environment is sane... yes
  30. checking for a thread-safe mkdir -p... /Users/gnucash/gnucash-stable/src/itstool-2.0.6/install-sh -c -d
  31. checking for gawk... no
  32. checking for mawk... no
  33. checking for nawk... no
  34. checking for awk... awk
  35. checking whether make sets $(MAKE)... yes
  36. checking whether make supports nested variables... yes
  37. checking for a Python interpreter with version >= 2.6... python3
  38. checking for python3... /Users/gnucash/gnucash-stable/bin/python3
  39. checking for python3 version... 3.6
  40. checking for python3 platform... darwin
  41. checking for python3 script directory... ${prefix}/lib/python3.6/site-packages
  42. checking for python3 extension module directory... ${exec_prefix}/lib/python3.6/site-packages
  43. checking for python module libxml2... not found
  44. configure: error: Python module libxml2 is needed to run this package
  45. *** Error during phase configure of itstool: ########## Error running /Users/gnucash/gnucash-stable/src/itstool-2.0.6/configure --prefix /Users/gnucash/gnucash-stable *** [12/71]
  46.  
  47. [1] Rerun phase configure
  48. [2] Ignore error and continue to build
  49. [3] Give up on module
  50. [4] Start shell
  51. [5] Reload configuration
  52. [6] Go to phase "wipe directory and start over"
  53. [7] Go to phase "clean"
  54. [8] Go to phase "distclean"
  55. choice: 3
  56. *** module gtk-doc not built due to non buildable itstool *** [13/71]
  57. *** module meta-gtk-osx-bootstrap not built due to non buildable gtk-doc *** [14/71]
  58. *** Checking out libffi *** [15/71]
  59. *** Skipping libffi (package and dependencies not updated) *** [15/71]
  60. *** Checking out glib *** [16/71]
  61. *** Skipping glib (package and dependencies not updated) *** [16/71]
  62. *** Checking out pixman *** [17/71]
  63. *** Skipping pixman (package and dependencies not updated) *** [17/71]
  64. *** Checking out freetype *** [18/71]
  65. *** Skipping freetype (package and dependencies not updated) *** [18/71]
  66. *** Checking out fontconfig *** [19/71]
  67. *** Skipping fontconfig (package and dependencies not updated) *** [19/71]
  68. *** Checking out ragel *** [20/71]
  69. *** Skipping ragel (package and dependencies not updated) *** [20/71]
  70. *** Checking out icu55 *** [21/71]
  71. *** Skipping icu55 (package and dependencies not updated) *** [21/71]
  72. *** Checking out harfbuzz *** [22/71]
  73. *** Skipping harfbuzz (package and dependencies not updated) *** [22/71]
  74. *** Checking out cairo *** [24/71]
  75. *** Skipping cairo (package and dependencies not updated) *** [24/71]
  76. *** Checking out fribidi *** [25/71]
  77. *** Skipping fribidi (package and dependencies not updated) *** [25/71]
  78. *** Checking out gobject-introspection *** [26/71]
  79. *** Skipping gobject-introspection (package and dependencies not updated) *** [26/71]
  80. *** Checking out pango *** [27/71]
  81. *** Skipping pango (package and dependencies not updated) *** [27/71]
  82. *** Checking out atk *** [28/71]
  83. *** Skipping atk (package and dependencies not updated) *** [28/71]
  84. *** Checking out gdk-pixbuf *** [29/71]
  85. *** Skipping gdk-pixbuf (package and dependencies not updated) *** [29/71]
  86. *** Checking out xorg-util-macros *** [30/71]
  87. *** Skipping xorg-util-macros (package and dependencies not updated) *** [30/71]
  88. *** Checking out libepoxy *** [31/71]
  89. *** Skipping libepoxy (package and dependencies not updated) *** [31/71]
  90. *** Checking out gtk+-3.0 *** [32/71]
  91. *** Configuring gtk+-3.0 *** [32/71]
  92. /Users/gnucash/gnucash-stable/src/gtk+-3.24.10/autogen.sh --prefix /Users/gnucash/gnucash-stable --enable-quartz-backend --enable-quartz-relocation
  93. *** No GTK-Doc found, please install it ***
  94. *** Error during phase configure of gtk+-3.0: ########## Error running /Users/gnucash/gnucash-stable/src/gtk+-3.24.10/autogen.sh --prefix /Users/gnucash/gnucash-stable --enable-quartz-backend --enable-quartz-relocation *** [32/71]
  95.  
  96. [1] Rerun phase configure
  97. [2] Ignore error and continue to build
  98. [3] Give up on module
  99. [4] Start shell
  100. [5] Reload configuration
  101. [6] Go to phase "wipe directory and start over"
  102. [7] Go to phase "clean"
  103. [8] Go to phase "distclean"
  104. choice: 3
  105. *** Checking out gtk-mac-integration *** [33/71]
  106. *** Configuring gtk-mac-integration *** [33/71]
  107. /Users/gnucash/gnucash-stable/src/gtk-mac-integration-2.1.3/configure --prefix /Users/gnucash/gnucash-stable --disable-python
  108. checking for a BSD-compatible install... /usr/bin/install -c
  109. checking whether build environment is sane... yes
  110. checking for a thread-safe mkdir -p... /Users/gnucash/gnucash-stable/src/gtk-mac-integration-2.1.3/install-sh -c -d
  111. checking for gawk... no
  112. checking for mawk... no
  113. checking for nawk... no
  114. checking for awk... awk
  115. checking whether make sets $(MAKE)... yes
  116. checking whether make supports nested variables... yes
  117. checking Bitness... checking for style of include used by make... GNU
  118. checking for gcc... /Library/Developer/CommandLineTools/usr/bin/gcc
  119. checking whether the C compiler works... yes
  120. checking for C compiler default output file name... a.out
  121. checking for suffix of executables...
  122. checking whether we are cross compiling... no
  123. checking for suffix of object files... o
  124. checking whether we are using the GNU C compiler... yes
  125. checking whether /Library/Developer/CommandLineTools/usr/bin/gcc accepts -g... yes
  126. checking for /Library/Developer/CommandLineTools/usr/bin/gcc option to accept ISO C89... none needed
  127. checking whether /Library/Developer/CommandLineTools/usr/bin/gcc understands -c and -o together... yes
  128. checking dependency style of /Library/Developer/CommandLineTools/usr/bin/gcc... gcc3
  129. checking how to run the C preprocessor... /Library/Developer/CommandLineTools/usr/bin/gcc -E
  130. 64-BIT
  131. checking for library containing strerror... none required
  132. checking for gcc... (cached) /Library/Developer/CommandLineTools/usr/bin/gcc
  133. checking whether we are using the GNU C compiler... (cached) yes
  134. checking whether /Library/Developer/CommandLineTools/usr/bin/gcc accepts -g... (cached) yes
  135. checking for /Library/Developer/CommandLineTools/usr/bin/gcc option to accept ISO C89... (cached) none needed
  136. checking whether /Library/Developer/CommandLineTools/usr/bin/gcc understands -c and -o together... (cached) yes
  137. checking dependency style of /Library/Developer/CommandLineTools/usr/bin/gcc... (cached) gcc3
  138. checking for grep that handles long lines and -e... /usr/bin/grep
  139. checking for egrep... /usr/bin/grep -E
  140. checking for ANSI C header files... yes
  141. checking whether we are using the GNU Objective C compiler... yes
  142. checking whether /Library/Developer/CommandLineTools/usr/bin/gcc accepts -g... yes
  143. checking dependency style of /Library/Developer/CommandLineTools/usr/bin/gcc... gcc3
  144. checking for ar... ar
  145. checking the archiver (ar) interface... ar
  146. checking build system type... x86_64-apple-darwin18.2.0
  147. checking host system type... x86_64-apple-darwin18.2.0
  148. checking how to print strings... printf
  149. checking for a sed that does not truncate output... /usr/bin/sed
  150. checking for fgrep... /usr/bin/grep -F
  151. checking for ld used by /Library/Developer/CommandLineTools/usr/bin/gcc... /Library/Developer/CommandLineTools/usr/bin/ld
  152. checking if the linker (/Library/Developer/CommandLineTools/usr/bin/ld) is GNU ld... no
  153. checking for BSD- or MS-compatible name lister (nm)... /usr/bin/nm -B
  154. checking the name lister (/usr/bin/nm -B) interface... BSD nm
  155. checking whether ln -s works... yes
  156. checking the maximum length of command line arguments... 196608
  157. checking how to convert x86_64-apple-darwin18.2.0 file names to x86_64-apple-darwin18.2.0 format... func_convert_file_noop
  158. checking how to convert x86_64-apple-darwin18.2.0 file names to toolchain format... func_convert_file_noop
  159. checking for /Library/Developer/CommandLineTools/usr/bin/ld option to reload object files... -r
  160. checking for objdump... objdump
  161. checking how to recognize dependent libraries... pass_all
  162. checking for dlltool... no
  163. checking how to associate runtime and link libraries... printf %s\n
  164. checking for archiver @FILE support... no
  165. checking for strip... strip
  166. checking for ranlib... ranlib
  167. checking command to parse /usr/bin/nm -B output from /Library/Developer/CommandLineTools/usr/bin/gcc object... ok
  168. checking for sysroot... no
  169. checking for a working dd... /bin/dd
  170. checking how to truncate binary pipes... /bin/dd bs=4096 count=1
  171. checking for mt... no
  172. checking if : is a manifest tool... no
  173. checking for dsymutil... dsymutil
  174. checking for nmedit... nmedit
  175. checking for lipo... lipo
  176. checking for otool... otool
  177. checking for otool64... no
  178. checking for -single_module linker flag... yes
  179. checking for -exported_symbols_list linker flag... yes
  180. checking for -force_load linker flag... yes
  181. checking for sys/types.h... yes
  182. checking for sys/stat.h... yes
  183. checking for stdlib.h... yes
  184. checking for string.h... yes
  185. checking for memory.h... yes
  186. checking for strings.h... yes
  187. checking for inttypes.h... yes
  188. checking for stdint.h... yes
  189. checking for unistd.h... yes
  190. checking for dlfcn.h... yes
  191. checking for objdir... .libs
  192. checking if /Library/Developer/CommandLineTools/usr/bin/gcc supports -fno-rtti -fno-exceptions... yes
  193. checking for /Library/Developer/CommandLineTools/usr/bin/gcc option to produce PIC... -fno-common -DPIC
  194. checking if /Library/Developer/CommandLineTools/usr/bin/gcc PIC flag -fno-common -DPIC works... yes
  195. checking if /Library/Developer/CommandLineTools/usr/bin/gcc static flag -static works... no
  196. checking if /Library/Developer/CommandLineTools/usr/bin/gcc supports -c -o file.o... yes
  197. checking if /Library/Developer/CommandLineTools/usr/bin/gcc supports -c -o file.o... (cached) yes
  198. checking whether the /Library/Developer/CommandLineTools/usr/bin/gcc linker (/Library/Developer/CommandLineTools/usr/bin/ld) supports shared libraries... yes
  199. checking dynamic linker characteristics... darwin18.2.0 dyld
  200. checking how to hardcode library paths into programs... immediate
  201. checking whether stripping libraries is possible... yes
  202. checking if libtool supports shared libraries... yes
  203. checking whether to build shared libraries... yes
  204. checking whether to build static libraries... no
  205. checking whether NLS is requested... yes
  206. checking for msgfmt... /Users/gnucash/gnucash-stable/bin/msgfmt
  207. checking for gmsgfmt... /Users/gnucash/gnucash-stable/bin/msgfmt
  208. checking for xgettext... /Users/gnucash/gnucash-stable/bin/xgettext
  209. checking for msgmerge... /Users/gnucash/gnucash-stable/bin/msgmerge
  210. checking for ld used by /Library/Developer/CommandLineTools/usr/bin/gcc... /Library/Developer/CommandLineTools/usr/bin/ld
  211. checking if the linker (/Library/Developer/CommandLineTools/usr/bin/ld) is GNU ld... no
  212. checking for shared library run path origin... done
  213. checking for CFPreferencesCopyAppValue... yes
  214. checking for CFLocaleCopyCurrent... yes
  215. checking for GNU gettext in libc... no
  216. checking for iconv... yes
  217. checking for working iconv... yes
  218. checking how to link with libiconv... -liconv
  219. checking for GNU gettext in libintl... yes
  220. checking whether to use NLS... yes
  221. checking where the gettext function comes from... external libintl
  222. checking how to link with libintl... -lintl -Wl,-framework -Wl,CoreFoundation
  223. checking for pkg-config... /Users/gnucash/gnucash-stable/bin/pkg-config
  224. checking pkg-config is at least version 0.16... yes
  225. checking for GLIB - version >= 2.14.0... yes (version 2.62.4)
  226. checking GLib Version... checking for gtk-doc... no
  227. configure: WARNING:
  228. You will not be able to create source packages with 'make dist'
  229. because gtk-doc >= 1.11 is not found.
  230. checking for gtkdoc-check... no
  231. checking for gtkdoc-check... no
  232. checking for gtkdoc-rebase... no
  233. checking for gtkdoc-mkpdf... no
  234. checking whether to build gtk-doc documentation... no
  235. checking for glib-2.0 >= 2.10.0 gobject-2.0 >= 2.10.0... yes
  236. checking for gtk+-3.0... no
  237. configure: WARNING: GTK+-3.0 not found
  238. checking for gtk+-2.0... no
  239. configure: WARNING: GTK+-2.0 not found
  240. configure: error: Neither GTK+-2.0 nor GTK+-3.0 was found
  241. *** Error during phase configure of gtk-mac-integration: ########## Error running /Users/gnucash/gnucash-stable/src/gtk-mac-integration-2.1.3/configure --prefix /Users/gnucash/gnucash-stable --disable-python *** [33/71]
  242.  
  243. [1] Rerun phase configure
  244. [2] Ignore error and continue to build
  245. [3] Give up on module
  246. [4] Start shell
  247. [5] Reload configuration
  248. [6] Go to phase "wipe directory and start over"
  249. [7] Go to phase "clean"
  250. [8] Go to phase "distclean"
  251. choice: 3
  252. *** module meta-gtk-osx-gtk3 not built due to non buildable gtk+-3.0 *** [34/71]
  253. *** module meta-gtk-osx-gtk3 not built due to non buildable gtk-mac-integration *** [34/71]
  254. *** Checking out pycairo *** [35/71]
  255. *** Skipping pycairo (package and dependencies not updated) *** [35/71]
  256. *** Checking out pygobject3 *** [36/71]
  257. *** Skipping pygobject3 (package and dependencies not updated) *** [36/71]
  258. *** Checking out gtk-mac-integration-python *** [37/71]
  259. *** Configuring gtk-mac-integration-python *** [37/71]
  260. /Users/gnucash/gnucash-stable/src/gtk-mac-integration-2.1.3/configure --prefix /Users/gnucash/gnucash-stable --enable-python
  261. checking for a BSD-compatible install... /usr/bin/install -c
  262. checking whether build environment is sane... yes
  263. checking for a thread-safe mkdir -p... /Users/gnucash/gnucash-stable/src/gtk-mac-integration-2.1.3/install-sh -c -d
  264. checking for gawk... no
  265. checking for mawk... no
  266. checking for nawk... no
  267. checking for awk... awk
  268. checking whether make sets $(MAKE)... yes
  269. checking whether make supports nested variables... yes
  270. checking Bitness... checking for style of include used by make... GNU
  271. checking for gcc... /Library/Developer/CommandLineTools/usr/bin/gcc
  272. checking whether the C compiler works... yes
  273. checking for C compiler default output file name... a.out
  274. checking for suffix of executables...
  275. checking whether we are cross compiling... no
  276. checking for suffix of object files... o
  277. checking whether we are using the GNU C compiler... yes
  278. checking whether /Library/Developer/CommandLineTools/usr/bin/gcc accepts -g... yes
  279. checking for /Library/Developer/CommandLineTools/usr/bin/gcc option to accept ISO C89... none needed
  280. checking whether /Library/Developer/CommandLineTools/usr/bin/gcc understands -c and -o together... yes
  281. checking dependency style of /Library/Developer/CommandLineTools/usr/bin/gcc... gcc3
  282. checking how to run the C preprocessor... /Library/Developer/CommandLineTools/usr/bin/gcc -E
  283. 64-BIT
  284. checking for library containing strerror... none required
  285. checking for gcc... (cached) /Library/Developer/CommandLineTools/usr/bin/gcc
  286. checking whether we are using the GNU C compiler... (cached) yes
  287. checking whether /Library/Developer/CommandLineTools/usr/bin/gcc accepts -g... (cached) yes
  288. checking for /Library/Developer/CommandLineTools/usr/bin/gcc option to accept ISO C89... (cached) none needed
  289. checking whether /Library/Developer/CommandLineTools/usr/bin/gcc understands -c and -o together... (cached) yes
  290. checking dependency style of /Library/Developer/CommandLineTools/usr/bin/gcc... (cached) gcc3
  291. checking for grep that handles long lines and -e... /usr/bin/grep
  292. checking for egrep... /usr/bin/grep -E
  293. checking for ANSI C header files... yes
  294. checking whether we are using the GNU Objective C compiler... yes
  295. checking whether /Library/Developer/CommandLineTools/usr/bin/gcc accepts -g... yes
  296. checking dependency style of /Library/Developer/CommandLineTools/usr/bin/gcc... gcc3
  297. checking for ar... ar
  298. checking the archiver (ar) interface... ar
  299. checking build system type... x86_64-apple-darwin18.2.0
  300. checking host system type... x86_64-apple-darwin18.2.0
  301. checking how to print strings... printf
  302. checking for a sed that does not truncate output... /usr/bin/sed
  303. checking for fgrep... /usr/bin/grep -F
  304. checking for ld used by /Library/Developer/CommandLineTools/usr/bin/gcc... /Library/Developer/CommandLineTools/usr/bin/ld
  305. checking if the linker (/Library/Developer/CommandLineTools/usr/bin/ld) is GNU ld... no
  306. checking for BSD- or MS-compatible name lister (nm)... /usr/bin/nm -B
  307. checking the name lister (/usr/bin/nm -B) interface... BSD nm
  308. checking whether ln -s works... yes
  309. checking the maximum length of command line arguments... 196608
  310. checking how to convert x86_64-apple-darwin18.2.0 file names to x86_64-apple-darwin18.2.0 format... func_convert_file_noop
  311. checking how to convert x86_64-apple-darwin18.2.0 file names to toolchain format... func_convert_file_noop
  312. checking for /Library/Developer/CommandLineTools/usr/bin/ld option to reload object files... -r
  313. checking for objdump... objdump
  314. checking how to recognize dependent libraries... pass_all
  315. checking for dlltool... no
  316. checking how to associate runtime and link libraries... printf %s\n
  317. checking for archiver @FILE support... no
  318. checking for strip... strip
  319. checking for ranlib... ranlib
  320. checking command to parse /usr/bin/nm -B output from /Library/Developer/CommandLineTools/usr/bin/gcc object... ok
  321. checking for sysroot... no
  322. checking for a working dd... /bin/dd
  323. checking how to truncate binary pipes... /bin/dd bs=4096 count=1
  324. checking for mt... no
  325. checking if : is a manifest tool... no
  326. checking for dsymutil... dsymutil
  327. checking for nmedit... nmedit
  328. checking for lipo... lipo
  329. checking for otool... otool
  330. checking for otool64... no
  331. checking for -single_module linker flag... yes
  332. checking for -exported_symbols_list linker flag... yes
  333. checking for -force_load linker flag... yes
  334. checking for sys/types.h... yes
  335. checking for sys/stat.h... yes
  336. checking for stdlib.h... yes
  337. checking for string.h... yes
  338. checking for memory.h... yes
  339. checking for strings.h... yes
  340. checking for inttypes.h... yes
  341. checking for stdint.h... yes
  342. checking for unistd.h... yes
  343. checking for dlfcn.h... yes
  344. checking for objdir... .libs
  345. checking if /Library/Developer/CommandLineTools/usr/bin/gcc supports -fno-rtti -fno-exceptions... yes
  346. checking for /Library/Developer/CommandLineTools/usr/bin/gcc option to produce PIC... -fno-common -DPIC
  347. checking if /Library/Developer/CommandLineTools/usr/bin/gcc PIC flag -fno-common -DPIC works... yes
  348. checking if /Library/Developer/CommandLineTools/usr/bin/gcc static flag -static works... no
  349. checking if /Library/Developer/CommandLineTools/usr/bin/gcc supports -c -o file.o... yes
  350. checking if /Library/Developer/CommandLineTools/usr/bin/gcc supports -c -o file.o... (cached) yes
  351. checking whether the /Library/Developer/CommandLineTools/usr/bin/gcc linker (/Library/Developer/CommandLineTools/usr/bin/ld) supports shared libraries... yes
  352. checking dynamic linker characteristics... darwin18.2.0 dyld
  353. checking how to hardcode library paths into programs... immediate
  354. checking whether stripping libraries is possible... yes
  355. checking if libtool supports shared libraries... yes
  356. checking whether to build shared libraries... yes
  357. checking whether to build static libraries... no
  358. checking whether NLS is requested... yes
  359. checking for msgfmt... /Users/gnucash/gnucash-stable/bin/msgfmt
  360. checking for gmsgfmt... /Users/gnucash/gnucash-stable/bin/msgfmt
  361. checking for xgettext... /Users/gnucash/gnucash-stable/bin/xgettext
  362. checking for msgmerge... /Users/gnucash/gnucash-stable/bin/msgmerge
  363. checking for ld used by /Library/Developer/CommandLineTools/usr/bin/gcc... /Library/Developer/CommandLineTools/usr/bin/ld
  364. checking if the linker (/Library/Developer/CommandLineTools/usr/bin/ld) is GNU ld... no
  365. checking for shared library run path origin... done
  366. checking for CFPreferencesCopyAppValue... yes
  367. checking for CFLocaleCopyCurrent... yes
  368. checking for GNU gettext in libc... no
  369. checking for iconv... yes
  370. checking for working iconv... yes
  371. checking how to link with libiconv... -liconv
  372. checking for GNU gettext in libintl... yes
  373. checking whether to use NLS... yes
  374. checking where the gettext function comes from... external libintl
  375. checking how to link with libintl... -lintl -Wl,-framework -Wl,CoreFoundation
  376. checking for pkg-config... /Users/gnucash/gnucash-stable/bin/pkg-config
  377. checking pkg-config is at least version 0.16... yes
  378. checking for GLIB - version >= 2.14.0... yes (version 2.62.4)
  379. checking GLib Version... checking for gtk-doc... no
  380. configure: WARNING:
  381. You will not be able to create source packages with 'make dist'
  382. because gtk-doc >= 1.11 is not found.
  383. checking for gtkdoc-check... no
  384. checking for gtkdoc-check... no
  385. checking for gtkdoc-rebase... no
  386. checking for gtkdoc-mkpdf... no
  387. checking whether to build gtk-doc documentation... no
  388. checking for glib-2.0 >= 2.10.0 gobject-2.0 >= 2.10.0... yes
  389. checking for gtk+-3.0... no
  390. configure: WARNING: GTK+-3.0 not found
  391. checking for gtk+-2.0... no
  392. configure: WARNING: GTK+-2.0 not found
  393. configure: error: Neither GTK+-2.0 nor GTK+-3.0 was found
  394. *** Error during phase configure of gtk-mac-integration-python: ########## Error running /Users/gnucash/gnucash-stable/src/gtk-mac-integration-2.1.3/configure --prefix /Users/gnucash/gnucash-stable --enable-python *** [37/71]
  395.  
  396. [1] Rerun phase configure
  397. [2] Ignore error and continue to build
  398. [3] Give up on module
  399. [4] Start shell
  400. [5] Reload configuration
  401. [6] Go to phase "wipe directory and start over"
  402. [7] Go to phase "clean"
  403. [8] Go to phase "distclean"
  404. choice: 3
  405. *** module meta-gtk-osx-python-gtk3 not built due to non buildable gtk-mac-integration-python *** [38/71]
  406. *** Checking out OpenSP *** [39/71]
  407. *** Skipping OpenSP (package and dependencies not updated) *** [39/71]
  408. *** Checking out libofx *** [40/71]
  409. *** Skipping libofx (package and dependencies not updated) *** [40/71]
  410. *** Checking out libgpg-error *** [41/71]
  411. *** Configuring libgpg-error *** [41/71]
  412. /Users/gnucash/gnucash-stable/src/libgpg-error-1.27/autogen.sh && /Users/gnucash/gnucash-stable/src/libgpg-error-1.27/configure --prefix /Users/gnucash/gnucash-stable --disable-doc
  413. sed: configure.ac: No such file or directory
  414. sed: configure.ac: No such file or directory
  415. sed: configure.ac: No such file or directory
  416. **Error**: version information not found in `configure.ac'.
  417. *** Error during phase configure of libgpg-error: ########## Error running /Users/gnucash/gnucash-stable/src/libgpg-error-1.27/autogen.sh && /Users/gnucash/gnucash-stable/src/libgpg-error-1.27/configure --prefix /Users/gnucash/gnucash-stable --disable-doc *** [41/71]
  418.  
  419. [1] Rerun phase configure
  420. [2] Ignore error and continue to build
  421. [3] Give up on module
  422. [4] Start shell
  423. [5] Reload configuration
  424. [6] Go to phase "wipe directory and start over"
  425. [7] Go to phase "clean"
  426. [8] Go to phase "distclean"
  427. choice: 3
  428. *** module libgcrypt not built due to non buildable libgpg-error *** [42/71]
  429. *** Checking out libunistring *** [43/71]
  430. *** Skipping libunistring (package and dependencies not updated) *** [43/71]
  431. *** Checking out gmp *** [44/71]
  432. *** Skipping gmp (package and dependencies not updated) *** [44/71]
  433. *** Checking out libnettle *** [45/71]
  434. *** Skipping libnettle (package and dependencies not updated) *** [45/71]
  435. *** Checking out libtasn1 *** [46/71]
  436. *** Skipping libtasn1 (package and dependencies not updated) *** [46/71]
  437. *** Checking out gnutls *** [47/71]
  438. *** Skipping gnutls (package and dependencies not updated) *** [47/71]
  439. *** module gwenhywfar not built due to non buildable libgcrypt *** [48/71]
  440. *** Checking out xmlsec *** [49/71]
  441. git remote set-url origin git://github.com/lsh123/xmlsec
  442. git remote update origin
  443. Fetching origin
  444. *** Error during phase checkout of xmlsec: Refusing to switch a dirty tree. *** [49/71]
  445.  
  446. [1] Rerun phase checkout
  447. [2] Ignore error and continue to configure
  448. [3] Give up on module
  449. [4] Start shell
  450. [5] Reload configuration
  451. [6] Go to phase "wipe directory and start over"
  452. choice: 3
  453. *** module libchipcard not built due to non buildable libgcrypt *** [50/71]
  454. *** module aqbanking not built due to non buildable gwenhywfar *** [51/71]
  455. *** module aqbanking not built due to non buildable xmlsec *** [51/71]
  456. *** module aqbanking not built due to non buildable libchipcard *** [51/71]
  457. *** Checking out libdbi *** [52/71]
  458. *** Skipping libdbi (package and dependencies not updated) *** [52/71]
  459. *** Checking out sqlite *** [53/71]
  460. *** Skipping sqlite (package and dependencies not updated) *** [53/71]
  461. *** Checking out libdbi-drivers *** [54/71]
  462. *** Configuring libdbi-drivers *** [54/71]
  463. /Users/gnucash/gnucash-stable/src/libdbi-drivers-0.9.0/configure --prefix /Users/gnucash/gnucash-stable --with-mysql --with-mysql-libdir=$PREFIX/lib --with-pgsql --with-sqlite3 --disable-docs --disable-dependency-tracking --with-dbi-incdir=/Users/gnucash/gnucash-stable/include --with-dbi-libdir=/Users/gnucash/gnucash-stable/lib
  464. checking whether to enable maintainer-specific portions of Makefiles... no
  465. checking for a BSD-compatible install... /usr/bin/install -c
  466. checking whether build environment is sane... yes
  467. checking for a thread-safe mkdir -p... /Users/gnucash/gnucash-stable/src/libdbi-drivers-0.9.0/install-sh -c -d
  468. checking for gawk... no
  469. checking for mawk... no
  470. checking for nawk... no
  471. checking for awk... awk
  472. checking whether make sets $(MAKE)... yes
  473. checking build system type... i686-apple-darwin18.2.0
  474. checking host system type... i686-apple-darwin18.2.0
  475. checking for gcc... /Library/Developer/CommandLineTools/usr/bin/gcc
  476. checking whether the C compiler works... yes
  477. checking for C compiler default output file name... a.out
  478. checking for suffix of executables...
  479. checking whether we are cross compiling... no
  480. checking for suffix of object files... o
  481. checking whether we are using the GNU C compiler... yes
  482. checking whether /Library/Developer/CommandLineTools/usr/bin/gcc accepts -g... yes
  483. checking for /Library/Developer/CommandLineTools/usr/bin/gcc option to accept ISO C89... none needed
  484. checking for style of include used by make... GNU
  485. checking dependency style of /Library/Developer/CommandLineTools/usr/bin/gcc... none
  486. checking for a sed that does not truncate output... /usr/bin/sed
  487. checking for grep that handles long lines and -e... /usr/bin/grep
  488. checking for egrep... /usr/bin/grep -E
  489. checking for fgrep... /usr/bin/grep -F
  490. checking how to print strings... printf
  491. checking for ld used by /Library/Developer/CommandLineTools/usr/bin/gcc... /Library/Developer/CommandLineTools/usr/bin/ld
  492. checking if the linker (/Library/Developer/CommandLineTools/usr/bin/ld) is GNU ld... no
  493. checking for BSD- or MS-compatible name lister (nm)... /usr/bin/nm -B
  494. checking the name lister (/usr/bin/nm -B) interface... BSD nm
  495. checking whether ln -s works... yes
  496. checking the maximum length of command line arguments... 196608
  497. checking whether the shell understands some XSI constructs... yes
  498. checking whether the shell understands "+="... yes
  499. checking how to convert i686-apple-darwin18.2.0 file names to i686-apple-darwin18.2.0 format... func_convert_file_noop
  500. checking how to convert i686-apple-darwin18.2.0 file names to toolchain format... func_convert_file_noop
  501. checking for /Library/Developer/CommandLineTools/usr/bin/ld option to reload object files... -r
  502. checking for objdump... objdump
  503. checking how to recognize dependent libraries... pass_all
  504. checking for dlltool... dlltool
  505. checking how to associate runtime and link libraries... printf %s\n
  506. checking for ar... ar
  507. checking for archiver @FILE support... no
  508. checking for strip... strip
  509. checking for ranlib... ranlib
  510. checking command to parse /usr/bin/nm -B output from /Library/Developer/CommandLineTools/usr/bin/gcc object... ok
  511. checking for sysroot... no
  512. checking for mt... no
  513. checking if : is a manifest tool... no
  514. checking for dsymutil... dsymutil
  515. checking for nmedit... nmedit
  516. checking for lipo... lipo
  517. checking for otool... otool
  518. checking for otool64... no
  519. checking for -single_module linker flag... yes
  520. checking for -exported_symbols_list linker flag... yes
  521. checking for -force_load linker flag... yes
  522. checking how to run the C preprocessor... /Library/Developer/CommandLineTools/usr/bin/gcc -E
  523. checking for ANSI C header files... yes
  524. checking for sys/types.h... yes
  525. checking for sys/stat.h... yes
  526. checking for stdlib.h... yes
  527. checking for string.h... yes
  528. checking for memory.h... yes
  529. checking for strings.h... yes
  530. checking for inttypes.h... yes
  531. checking for stdint.h... yes
  532. checking for unistd.h... yes
  533. checking for dlfcn.h... yes
  534. checking for objdir... .libs
  535. checking if /Library/Developer/CommandLineTools/usr/bin/gcc supports -fno-rtti -fno-exceptions... yes
  536. checking for /Library/Developer/CommandLineTools/usr/bin/gcc option to produce PIC... -fno-common -DPIC
  537. checking if /Library/Developer/CommandLineTools/usr/bin/gcc PIC flag -fno-common -DPIC works... yes
  538. checking if /Library/Developer/CommandLineTools/usr/bin/gcc static flag -static works... no
  539. checking if /Library/Developer/CommandLineTools/usr/bin/gcc supports -c -o file.o... yes
  540. checking if /Library/Developer/CommandLineTools/usr/bin/gcc supports -c -o file.o... (cached) yes
  541. checking whether the /Library/Developer/CommandLineTools/usr/bin/gcc linker (/Library/Developer/CommandLineTools/usr/bin/ld) supports shared libraries... yes
  542. checking dynamic linker characteristics... darwin18.2.0 dyld
  543. checking how to hardcode library paths into programs... immediate
  544. checking whether stripping libraries is possible... yes
  545. checking if libtool supports shared libraries... yes
  546. checking whether to build shared libraries... yes
  547. checking whether to build static libraries... yes
  548. checking how to run the C preprocessor... /Library/Developer/CommandLineTools/usr/bin/gcc -E
  549. checking for libdbi framework... checking for MySQL support... yes
  550. checking for mysql_config... yes
  551. checking for MySQL includes... -I/usr/local/Cellar/mysql/8.0.18_1/include/mysql
  552. checking for MySQL libraries...
  553. checking for PostgreSQL support... yes
  554. checking for pg_config... yes
  555. checking for PostgreSQL includes... -I/usr/local/include
  556. checking for PostgreSQL libraries... /usr/local/lib
  557. checking for SQLite support... no
  558. checking for SQLite3 support... yes
  559. checking sqlite3.h usability... yes
  560. checking sqlite3.h presence... yes
  561. checking for sqlite3.h... yes
  562. checking for library containing sqlite3_exec... -lsqlite3
  563. checking for Msql support... no
  564. checking for Oracle support... no
  565. checking for Firebird/Interbase support... no
  566. checking for Freetds support... no
  567. checking for Ingres support... no
  568. checking for IBM DB2 support... no
  569. checking for strtoll... yes
  570. checking for atoll... yes
  571. checking for vasprintf... yes
  572. checking for asprintf... yes
  573. checking for libdbi library... yes: libs in /Users/gnucash/gnucash-stable/lib
  574. checking for string.h... (cached) yes
  575. checking for strings.h... (cached) yes
  576. checking that generated files are newer than configure... done
  577. configure: creating ./config.status
  578. config.status: creating libdbi-drivers.spec
  579. config.status: creating Makefile
  580. config.status: creating doc/Makefile
  581. config.status: creating doc/include/Makefile
  582. config.status: creating drivers/Makefile
  583. config.status: creating drivers/mysql/Makefile
  584. config.status: creating drivers/pgsql/Makefile
  585. config.status: creating drivers/sqlite/Makefile
  586. config.status: creating drivers/sqlite3/Makefile
  587. config.status: creating drivers/msql/Makefile
  588. config.status: creating drivers/oracle/Makefile
  589. config.status: creating drivers/firebird/Makefile
  590. config.status: creating drivers/freetds/Makefile
  591. config.status: creating drivers/ingres/Makefile
  592. config.status: creating drivers/db2/Makefile
  593. config.status: creating tests/Makefile
  594. config.status: creating tests/cgreen/Makefile
  595. config.status: creating tests/test_dbi.cfg
  596. config.status: creating tests/plugin_settings.sh
  597. config.status: creating config.h
  598. config.status: config.h is unchanged
  599. config.status: executing depfiles commands
  600. config.status: executing libtool commands
  601. *** Building libdbi-drivers *** [54/71]
  602. make -j 5
  603. /Library/Developer/CommandLineTools/usr/bin/make all-recursive
  604. Making all in drivers
  605. Making all in mysql
  606. /bin/sh ../../libtool --tag=CC --mode=link /Library/Developer/CommandLineTools/usr/bin/gcc -std=gnu99 -arch x86_64 -I/Library/Developer/CommandLineTools/SDKs/MacOSX10.14.sdk/usr/include -isysroot /Library/Developer/CommandLineTools/SDKs/MacOSX10.14.sdk -mmacosx-version-min=10.14 -module -avoid-version -L/Users/gnucash/gnucash-stable/lib -lmysqlclient -no-undefined -ldbi -L/Users/gnucash/gnucash-stable/lib -L/Users/gnucash/gnucash-stable/lib -L/Users/gnucash/gnucash-stable/lib -arch x86_64 -L/Library/Developer/CommandLineTools/SDKs/MacOSX10.14.sdk/usr/lib -isysroot /Library/Developer/CommandLineTools/SDKs/MacOSX10.14.sdk -mmacosx-version-min=10.14 -Wl,-headerpad_max_install_names -o libdbdmysql.la -rpath /Users/gnucash/gnucash-stable/lib/dbd dbd_mysql.lo
  607. libtool: link: /Library/Developer/CommandLineTools/usr/bin/gcc -o .libs/libdbdmysql.so -bundle .libs/dbd_mysql.o -L/Users/gnucash/gnucash-stable/lib -lmysqlclient -ldbi -L/Library/Developer/CommandLineTools/SDKs/MacOSX10.14.sdk/usr/lib -arch x86_64 -isysroot /Library/Developer/CommandLineTools/SDKs/MacOSX10.14.sdk -mmacosx-version-min=10.14 -arch x86_64 -isysroot /Library/Developer/CommandLineTools/SDKs/MacOSX10.14.sdk -mmacosx-version-min=10.14 -Wl,-headerpad_max_install_names
  608. ld: library not found for -lmysqlclient
  609. clang: error: linker command failed with exit code 1 (use -v to see invocation)
  610. make[3]: *** [libdbdmysql.la] Error 1
  611. make[2]: *** [all-recursive] Error 1
  612. make[1]: *** [all-recursive] Error 1
  613. make: *** [all] Error 2
  614. *** Error during phase build of libdbi-drivers: ########## Error running make -j 5 *** [54/71]
  615.  
  616. [1] Rerun phase build
  617. [2] Ignore error and continue to install
  618. [3] Give up on module
  619. [4] Start shell
  620. [5] Reload configuration
  621. [6] Go to phase "wipe directory and start over"
  622. [7] Go to phase "configure"
  623. [8] Go to phase "clean"
  624. [9] Go to phase "distclean"
  625. choice: 3
  626. *** Checking out shared-mime-info *** [55/71]
  627. *** Skipping shared-mime-info (package and dependencies not updated) *** [55/71]
  628. *** Checking out iso-codes *** [56/71]
  629. *** Skipping iso-codes (package and dependencies not updated) *** [56/71]
  630. *** Checking out libatomic-ops *** [57/71]
  631. git remote set-url origin git://github.com/ivmai/libatomic_ops
  632. git remote update origin
  633. Fetching origin
  634. git checkout libatomic_ops-7_4_4
  635. HEAD is now at 3a497aa [7.4.4]
  636. *** Skipping libatomic-ops (package and dependencies not updated) *** [57/71]
  637. *** Checking out bdw-gc *** [58/71]
  638. git remote set-url origin git://github.com/ivmai/bdwgc
  639. git remote update origin
  640. Fetching origin
  641. git checkout gc7_6_0
  642. HEAD is now at 8ac1d84a [7.6.0]
  643. *** Skipping bdw-gc (package and dependencies not updated) *** [58/71]
  644. *** Checking out guile22 *** [59/71]
  645. *** Skipping guile22 (package and dependencies not updated) *** [59/71]
  646. *** Checking out pcre *** [60/71]
  647. *** Skipping pcre (package and dependencies not updated) *** [60/71]
  648. *** Checking out swig *** [61/71]
  649. *** Skipping swig (package and dependencies not updated) *** [61/71]
  650. *** Checking out boost *** [62/71]
  651. bunzip2 -dc "/Users/gnucash/gnucash-stable/src/pkgs/boost_1_68_0.tar.bz2" | tar xf -
  652. bunzip2: /Users/gnucash/gnucash-stable/src/pkgs/boost_1_68_0.tar.bz2 is not a bzip2 file.
  653. *** Error during phase checkout of boost: could not unpack tarball (expected boost_1_68_0 dir) *** [62/71]
  654.  
  655. [1] Rerun phase checkout
  656. [2] Ignore error and continue to configure
  657. [3] Give up on module
  658. [4] Start shell
  659. [5] Reload configuration
  660. [6] Go to phase "wipe directory and start over"
  661. choice: 3
  662. *** Checking out googletest *** [63/71]
  663. git remote set-url origin git://github.com/google/googletest
  664. git remote update origin
  665. Fetching origin
  666. git checkout release-1.8.0
  667. HEAD is now at ec44c6c1 Merge pull request #821 from mazong1123/master
  668. *** Configuring googletest *** [63/71]
  669. cmake -DCMAKE_INSTALL_PREFIX=/Users/gnucash/gnucash-stable -DCMAKE_INSTALL_LIBDIR=lib -G Ninja -DBUILD_GMOCK=OFF /Users/gnucash/gnucash-stable/src/googletest
  670. -- The C compiler identification is AppleClang 10.0.0.10001044
  671. -- The CXX compiler identification is AppleClang 10.0.0.10001044
  672. -- Check for working C compiler: /Library/Developer/CommandLineTools/usr/bin/gcc
  673. -- Check for working C compiler: /Library/Developer/CommandLineTools/usr/bin/gcc -- works
  674. -- Detecting C compiler ABI info
  675. -- Detecting C compiler ABI info - done
  676. -- Detecting C compile features
  677. -- Detecting C compile features - done
  678. -- Check for working CXX compiler: /Library/Developer/CommandLineTools/usr/bin/g++
  679. -- Check for working CXX compiler: /Library/Developer/CommandLineTools/usr/bin/g++ -- works
  680. -- Detecting CXX compiler ABI info
  681. -- Detecting CXX compiler ABI info - done
  682. -- Detecting CXX compile features
  683. -- Detecting CXX compile features - done
  684. -- Configuring done
  685. -- Generating done
  686. CMake Warning:
  687. Manually-specified variables were not used by the project:
  688.  
  689. CMAKE_INSTALL_LIBDIR
  690.  
  691.  
  692. -- Build files have been written to: /Users/gnucash/gnucash-stable/build/googletest
  693. *** Building googletest *** [63/71]
  694. ninja
  695. ninja: no work to do.
  696. *** Checking out libwebp *** [64/71]
  697. *** Skipping libwebp (package and dependencies not updated) *** [64/71]
  698. *** Checking out enchant *** [65/71]
  699. *** Skipping enchant (package and dependencies not updated) *** [65/71]
  700. *** Checking out libpsl *** [66/71]
  701. *** Skipping libpsl (package and dependencies not updated) *** [66/71]
  702. *** Checking out glib-networking *** [67/71]
  703. *** Skipping glib-networking (package and dependencies not updated) *** [67/71]
  704. *** Checking out vala *** [68/71]
  705. *** Skipping vala (package and dependencies not updated) *** [68/71]
  706. *** Checking out libsoup *** [69/71]
  707. *** Skipping libsoup (package and dependencies not updated) *** [69/71]
  708. *** Checking out webkit1gtk3 *** [70/71]
  709. *** Configuring webkit1gtk3 *** [70/71]
  710. autoreconf -fi
  711. libtoolize: putting auxiliary files in AC_CONFIG_AUX_DIR, 'Source/autotools'.
  712. libtoolize: copying file 'Source/autotools/ltmain.sh'
  713. libtoolize: putting macros in AC_CONFIG_MACRO_DIRS, 'Source/autotools'.
  714. libtoolize: copying file 'Source/autotools/libtool.m4'
  715. libtoolize: copying file 'Source/autotools/ltoptions.m4'
  716. libtoolize: copying file 'Source/autotools/ltsugar.m4'
  717. libtoolize: copying file 'Source/autotools/ltversion.m4'
  718. libtoolize: copying file 'Source/autotools/lt~obsolete.m4'
  719. libtoolize: Remember to add 'LT_INIT' to configure.ac.
  720. libtoolize: Consider adding '-I Source/autotools' to ACLOCAL_AMFLAGS in Makefile.am.
  721. Source/autotools/CheckSystemAndBasicDependencies.m4:81: installing 'Source/autotools/compile'
  722. configure.ac:35: installing 'Source/autotools/missing'
  723. GNUmakefile.am: installing 'Source/autotools/depcomp'
  724. /Users/gnucash/gnucash-stable/src/webkitgtk-2.4.11/configure --prefix /Users/gnucash/gnucash-stable --enable-quartz-target --with-gtk=3.0 --disable-webkit2 --disable-credential-storage --disable-geolocation --disable-video --disable-web-audio CXXFLAGS='-stdlib=libc++'
  725. checking build system type... x86_64-apple-darwin18.2.0
  726. checking host system type... x86_64-apple-darwin18.2.0
  727. checking for perl... /usr/bin/perl
  728. checking for python... /Users/gnucash/gnucash-stable/bin/python
  729. checking for ruby... /usr/bin/ruby
  730. checking for bison... /Users/gnucash/gnucash-stable/bin/bison
  731. checking for mv... /bin/mv
  732. checking for grep... /usr/bin/grep
  733. checking for gperf... /usr/bin/gperf
  734. checking for flex... /usr/bin/flex
  735. checking for gawk... no
  736. checking for mawk... no
  737. checking for nawk... no
  738. checking for awk... awk
  739. checking for gcc... /Library/Developer/CommandLineTools/usr/bin/gcc
  740. checking whether the C compiler works... yes
  741. checking for C compiler default output file name... a.out
  742. checking for suffix of executables...
  743. checking whether we are cross compiling... no
  744. checking for suffix of object files... o
  745. checking whether we are using the GNU C compiler... yes
  746. checking whether /Library/Developer/CommandLineTools/usr/bin/gcc accepts -g... yes
  747. checking for /Library/Developer/CommandLineTools/usr/bin/gcc option to accept ISO C89... none needed
  748. checking whether /Library/Developer/CommandLineTools/usr/bin/gcc understands -c and -o together... yes
  749. checking whether we are using the GNU C++ compiler... yes
  750. checking whether /Library/Developer/CommandLineTools/usr/bin/g++ accepts -g... yes
  751. checking for a BSD-compatible install... /usr/bin/install -c
  752. checking for special C compiler options needed for large files... no
  753. checking for _FILE_OFFSET_BITS value needed for large files... no
  754. checking how to run the C preprocessor... /Library/Developer/CommandLineTools/usr/bin/gcc -E
  755. checking for grep that handles long lines and -e... (cached) /usr/bin/grep
  756. checking for egrep... /usr/bin/grep -E
  757. checking for ANSI C header files... yes
  758. checking for sys/types.h... yes
  759. checking for sys/stat.h... yes
  760. checking for stdlib.h... yes
  761. checking for string.h... yes
  762. checking for memory.h... yes
  763. checking for strings.h... yes
  764. checking for inttypes.h... yes
  765. checking for stdint.h... yes
  766. checking for unistd.h... yes
  767. checking for stdbool.h that conforms to C99... yes
  768. checking for _Bool... yes
  769. usage: ar -d [-TLsv] archive file ...
  770. ar -m [-TLsv] archive file ...
  771. ar -m [-abiTLsv] position archive file ...
  772. ar -p [-TLsv] archive [file ...]
  773. ar -q [-cTLsv] archive file ...
  774. ar -r [-cuTLsv] archive file ...
  775. ar -r [-abciuTLsv] position archive file ...
  776. ar -t [-TLsv] archive [file ...]
  777. ar -x [-ouTLsv] archive [file ...]
  778. checking for bash... /Users/gnucash/.new_local/bin/bash
  779. checking if dolt supports this host... no, falling back to libtool
  780. checking how to print strings... printf
  781. checking for a sed that does not truncate output... /usr/bin/sed
  782. checking for fgrep... /usr/bin/grep -F
  783. checking for ld used by /Library/Developer/CommandLineTools/usr/bin/gcc... /Library/Developer/CommandLineTools/usr/bin/ld
  784. checking if the linker (/Library/Developer/CommandLineTools/usr/bin/ld) is GNU ld... no
  785. checking for BSD- or MS-compatible name lister (nm)... /usr/bin/nm -B
  786. checking the name lister (/usr/bin/nm -B) interface... BSD nm
  787. checking whether ln -s works... yes
  788. checking the maximum length of command line arguments... 196608
  789. checking how to convert x86_64-apple-darwin18.2.0 file names to x86_64-apple-darwin18.2.0 format... func_convert_file_noop
  790. checking how to convert x86_64-apple-darwin18.2.0 file names to toolchain format... func_convert_file_noop
  791. checking for /Library/Developer/CommandLineTools/usr/bin/ld option to reload object files... -r
  792. checking for objdump... objdump
  793. checking how to recognize dependent libraries... pass_all
  794. checking for dlltool... dlltool
  795. checking how to associate runtime and link libraries... printf %s\n
  796. checking for ar... ar
  797. checking for archiver @FILE support... no
  798. checking for strip... strip
  799. checking for ranlib... ranlib
  800. checking command to parse /usr/bin/nm -B output from /Library/Developer/CommandLineTools/usr/bin/gcc object... ok
  801. checking for sysroot... no
  802. checking for a working dd... /bin/dd
  803. checking how to truncate binary pipes... /bin/dd bs=4096 count=1
  804. checking for mt... no
  805. checking if : is a manifest tool... no
  806. checking for dsymutil... dsymutil
  807. checking for nmedit... nmedit
  808. checking for lipo... lipo
  809. checking for otool... otool
  810. checking for otool64... no
  811. checking for -single_module linker flag... yes
  812. checking for -exported_symbols_list linker flag... yes
  813. checking for -force_load linker flag... yes
  814. checking for dlfcn.h... yes
  815. checking for objdir... .libs
  816. checking if /Library/Developer/CommandLineTools/usr/bin/gcc supports -fno-rtti -fno-exceptions... yes
  817. checking for /Library/Developer/CommandLineTools/usr/bin/gcc option to produce PIC... -fno-common -DPIC
  818. checking if /Library/Developer/CommandLineTools/usr/bin/gcc PIC flag -fno-common -DPIC works... yes
  819. checking if /Library/Developer/CommandLineTools/usr/bin/gcc static flag -static works... no
  820. checking if /Library/Developer/CommandLineTools/usr/bin/gcc supports -c -o file.o... yes
  821. checking if /Library/Developer/CommandLineTools/usr/bin/gcc supports -c -o file.o... (cached) yes
  822. checking whether the /Library/Developer/CommandLineTools/usr/bin/gcc linker (/Library/Developer/CommandLineTools/usr/bin/ld) supports shared libraries... yes
  823. checking dynamic linker characteristics... darwin18.2.0 dyld
  824. checking how to hardcode library paths into programs... immediate
  825. checking whether stripping libraries is possible... yes
  826. checking if libtool supports shared libraries... yes
  827. checking whether to build shared libraries... yes
  828. checking whether to build static libraries... no
  829. checking how to run the C++ preprocessor... /Library/Developer/CommandLineTools/usr/bin/g++ -E
  830. checking for ld used by /Library/Developer/CommandLineTools/usr/bin/g++... /Library/Developer/CommandLineTools/usr/bin/ld
  831. checking if the linker (/Library/Developer/CommandLineTools/usr/bin/ld) is GNU ld... no
  832. checking whether the /Library/Developer/CommandLineTools/usr/bin/g++ linker (/Library/Developer/CommandLineTools/usr/bin/ld) supports shared libraries... yes
  833. checking for /Library/Developer/CommandLineTools/usr/bin/g++ option to produce PIC... -fno-common -DPIC
  834. checking if /Library/Developer/CommandLineTools/usr/bin/g++ PIC flag -fno-common -DPIC works... yes
  835. checking if /Library/Developer/CommandLineTools/usr/bin/g++ static flag -static works... no
  836. checking if /Library/Developer/CommandLineTools/usr/bin/g++ supports -c -o file.o... yes
  837. checking if /Library/Developer/CommandLineTools/usr/bin/g++ supports -c -o file.o... (cached) yes
  838. checking whether the /Library/Developer/CommandLineTools/usr/bin/g++ linker (/Library/Developer/CommandLineTools/usr/bin/ld) supports shared libraries... yes
  839. checking dynamic linker characteristics... darwin18.2.0 dyld
  840. checking how to hardcode library paths into programs... immediate
  841. checking whether to build WebKit1... yes
  842. checking whether to build WebKit2... no
  843. checking whether to do a debug build... no
  844. checking whether to enable developer mode... no
  845. checking whether to enable optimized builds... yes
  846. checking the GTK+ version to use... 3.0
  847. checking whether to enable the x11 target... no
  848. checking whether to enable the wayland target... no
  849. checking whether to enable the win32 target... no
  850. checking whether to enable the quartz target... yes
  851. checking whether to enable the directfb target... no
  852. checking whether to build for the Win32 target... no
  853. checking whether to enable spellcheck support... yes
  854. checking whether to enable credential storage... no
  855. checking whether to enable Gamepad support... no
  856. checking whether to enable HTML5 video support... no
  857. checking whether to enable geolocation support... no
  858. checking whether to enable SVG support... yes
  859. checking whether to enable support for SVG fonts... yes
  860. checking whether to enable Web Audio support... no
  861. checking whether to enable Battery Status API support... no
  862. checking whether to enable code coverage support... no
  863. checking whether to enable optimized memory allocator... yes
  864. checking whether to enable debug symbols... no
  865. checking whether to enable WebGL support... auto
  866. checking whether to enable accelerated compositing support... auto
  867. checking whether to enable JIT compilation... auto
  868. checking whether to enable FTL JIT... no
  869. checking whether to enable opcode stats... no
  870. checking whether to enable GObject introspection support... no
  871. checking for pkg-config... /Users/gnucash/gnucash-stable/bin/pkg-config
  872. checking pkg-config is at least version 0.9.0... yes
  873. checking for jpeg_destroy_decompress in -ljpeg... yes
  874. checking for jpeglib... yes
  875. checking for libpng... yes
  876. checking webp/decode.h usability... yes
  877. checking webp/decode.h presence... yes
  878. checking for webp/decode.h... yes
  879. checking for pkg-config... (cached) /Users/gnucash/gnucash-stable/bin/pkg-config
  880. checking pkg-config is at least version 0.16... yes
  881. checking for glib-2.0 >= 2.36.0 gmodule-2.0 gobject-2.0 gthread-2.0 gio-2.0... yes
  882. checking for GLIB - version >= 2.36.0... yes (version 2.62.4)
  883. checking for pkg-config... (cached) /Users/gnucash/gnucash-stable/bin/pkg-config
  884. checking pkg-config is at least version 0.16... yes
  885. checking for icu-config... /Users/gnucash/gnucash-stable/bin/icu-config
  886. checking for zlib... yes
  887. checking for libxml-2.0 >= 2.6... yes
  888. checking for pango >= 1.30.0 pangoft2... yes
  889. checking for enchant >= 0.22... yes
  890. checking for cairo >= 1.10... yes
  891. checking for gtk+-3.0 >= 3.6.0... no
  892. configure: error: Package requirements (gtk+-3.0 >= 3.6.0) were not met:
  893.  
  894. No package 'gtk+-3.0' found
  895.  
  896. Consider adjusting the PKG_CONFIG_PATH environment variable if you
  897. installed software in a non-standard prefix.
  898.  
  899. Alternatively, you may set the environment variables GTK_CFLAGS
  900. and GTK_LIBS to avoid the need to call pkg-config.
  901. See the pkg-config man page for more details.
  902. *** Error during phase configure of webkit1gtk3: ########## Error running /Users/gnucash/gnucash-stable/src/webkitgtk-2.4.11/configure --prefix /Users/gnucash/gnucash-stable --enable-quartz-target --with-gtk=3.0 --disable-webkit2 --disable-credential-storage --disable-geolocation --disable-video --disable-web-audio CXXFLAGS='-stdlib=libc++' *** [70/71]
  903.  
  904. [1] Rerun phase configure
  905. [2] Ignore error and continue to build
  906. [3] Give up on module
  907. [4] Start shell
  908. [5] Reload configuration
  909. [6] Go to phase "wipe directory and start over"
  910. [7] Go to phase "clean"
  911. [8] Go to phase "distclean"
  912. choice: 3
  913. *** module gnucash-git not built due to non buildable meta-gtk-osx-gtk3 *** [71/71]
  914. *** module gnucash-git not built due to non buildable meta-gtk-osx-python-gtk3 *** [71/71]
  915. *** module gnucash-git not built due to non buildable aqbanking *** [71/71]
  916. *** module gnucash-git not built due to non buildable libdbi-drivers *** [71/71]
  917. *** module gnucash-git not built due to non buildable boost *** [71/71]
  918. *** module gnucash-git not built due to non buildable webkit1gtk3 *** [71/71]
  919. *** the following modules were not built *** [71/71]
  920. itstool gtk-doc meta-gtk-osx-bootstrap gtk+-3.0 gtk-mac-integration meta-gtk-osx-gtk3 gtk-mac-integration-python meta-gtk-osx-python-gtk3 libgpg-error libgcrypt gwenhywfar xmlsec libchipcard aqbanking libdbi-drivers boost webkit1gtk3 gnucash-git
  921. Teds-iMac:~ gnucash$
Advertisement
Advertisement
Advertisement
RAW Paste Data Copied
Advertisement