michaldybczak

alienfx-lite-1.1-1

Aug 28th, 2016
187
Never
Not a member of Pastebin yet? Sign Up, it unlocks many cool features!
  1. Scanning dependencies of target Images_to_jar
  2. [ 60%] Built target Images_to_jar
  3. Scanning dependencies of target Lib_to_jar
  4. /tmp/yaourt-tmp-michaldybczak/aur-alienfx-lite/src/AlienFxLite-1.1/build/lib/libAlien64.so : no such file or directory
  5. make[2]: *** [CMakeFiles/Lib_to_jar.dir/build.make:61: Lib_to_jar] Error 1
  6. make[1]: *** [CMakeFiles/Makefile2:106: CMakeFiles/Lib_to_jar.dir/all] Error 2
  7. make: *** [Makefile:128: all] Error 2
  8. ==> ERROR: There is a error in build().
  9.     Aborting...
  10. ==> ERROR:Makepkg couldn't build alienfx-lite.
RAW Paste Data