OtakuAltair

Untitled

May 2nd, 2023
180
0
Never
Not a member of Pastebin yet? Sign Up, it unlocks many cool features!
Bash 5.37 KB | None | 0 0
  1. curl: no URL specified!
  2. curl: try 'curl --help' or 'curl --manual' for more information
  3. You are missing aria2, downloading using the slower fallback wget method.
  4. WARNING: timestamping does nothing in combination with -O. See the manual
  5. for details.
  6.  
  7. --2023-05-02 11:31:53--  https://api.github.com/repos/pineappleEA/pineapple-src/tarball/EA-3540
  8. Resolving api.github.com (api.github.com)... 20.205.243.168
  9. Connecting to api.github.com (api.github.com)|20.205.243.168|:443... connected.
  10. HTTP request sent, awaiting response... 302 Found
  11. Location: https://codeload.github.com/pineappleEA/pineapple-src/legacy.tar.gz/refs/tags/EA-3540 [following]
  12. --2023-05-02 11:31:54--  https://codeload.github.com/pineappleEA/pineapple-src/legacy.tar.gz/refs/tags/EA-3540
  13. Resolving codeload.github.com (codeload.github.com)... 20.205.243.165
  14. Connecting to codeload.github.com (codeload.github.com)|20.205.243.165|:443... connected.
  15. HTTP request sent, awaiting response... 200 OK
  16. Length: unspecified [application/x-gzip]
  17. Saving to: ‘pineapple-src-EA-3540.tar.gz’
  18.  
  19. pineapple-src-EA-3540.t     [            <=>                ] 242.78M  2.34MB/s    in 1m 56s  
  20.  
  21. 2023-05-02 11:33:51 (2.10 MB/s) - ‘pineapple-src-EA-3540.tar.gz’ saved [254574249]
  22.  
  23. patching file CMakeModules/GenerateSCMRev.cmake
  24. Hunk #1 FAILED at 11.
  25. Hunk #2 FAILED at 113.
  26. 2 out of 2 hunks FAILED -- saving rejects to file CMakeModules/GenerateSCMRev.cmake.rej
  27. patching file src/common/CMakeLists.txt
  28. Hunk #1 FAILED at 28.
  29. 1 out of 1 hunk FAILED -- saving rejects to file src/common/CMakeLists.txt.rej
  30. -- The C compiler identification is GNU 12.2.1
  31. -- The CXX compiler identification is GNU 12.2.1
  32. -- Detecting C compiler ABI info
  33. -- Detecting C compiler ABI info - done
  34. -- Check for working C compiler: /usr/bin/cc - skipped
  35. -- Detecting C compile features
  36. -- Detecting C compile features - done
  37. -- Detecting CXX compiler ABI info
  38. -- Detecting CXX compiler ABI info - done
  39. -- Check for working CXX compiler: /usr/bin/c++ - skipped
  40. -- Detecting CXX compile features
  41. -- Detecting CXX compile features - done
  42. -- Using Precompiled Headers.
  43. -- Defaulting to a Release build
  44. -- Downloading compatibility list for yuzu...
  45. -- [download 0% complete]
  46. -- [download 1% complete]
  47. -- [download 2% complete]
  48. -- [download 3% complete]
  49. -- [download 4% complete]
  50. -- [download 5% complete]
  51. -- [download 6% complete]
  52. -- [download 7% complete]
  53. -- [download 8% complete]
  54. -- [download 9% complete]
  55. -- [download 10% complete]
  56. -- [download 11% complete]
  57. -- [download 12% complete]
  58. -- [download 13% complete]
  59. -- [download 14% complete]
  60. -- [download 15% complete]
  61. -- [download 16% complete]
  62. -- [download 17% complete]
  63. -- [download 18% complete]
  64. -- [download 19% complete]
  65. -- [download 20% complete]
  66. -- [download 21% complete]
  67. -- [download 22% complete]
  68. -- [download 23% complete]
  69. -- [download 24% complete]
  70. -- [download 25% complete]
  71. -- [download 26% complete]
  72. -- [download 27% complete]
  73. -- [download 28% complete]
  74. -- [download 29% complete]
  75. -- [download 30% complete]
  76. -- [download 31% complete]
  77. -- [download 32% complete]
  78. -- [download 33% complete]
  79. -- [download 34% complete]
  80. -- [download 35% complete]
  81. -- [download 36% complete]
  82. -- [download 37% complete]
  83. -- [download 38% complete]
  84. -- [download 39% complete]
  85. -- [download 40% complete]
  86. -- [download 41% complete]
  87. -- [download 42% complete]
  88. -- [download 43% complete]
  89. -- [download 44% complete]
  90. -- [download 45% complete]
  91. -- [download 46% complete]
  92. -- [download 47% complete]
  93. -- [download 48% complete]
  94. -- [download 49% complete]
  95. -- [download 50% complete]
  96. -- [download 51% complete]
  97. -- [download 52% complete]
  98. -- [download 53% complete]
  99. -- [download 54% complete]
  100. -- [download 55% complete]
  101. -- [download 56% complete]
  102. -- [download 57% complete]
  103. -- [download 58% complete]
  104. -- [download 59% complete]
  105. -- [download 65% complete]
  106. -- [download 66% complete]
  107. -- [download 67% complete]
  108. -- [download 68% complete]
  109. -- [download 69% complete]
  110. -- [download 70% complete]
  111. -- [download 71% complete]
  112. -- [download 72% complete]
  113. -- [download 78% complete]
  114. -- [download 81% complete]
  115. -- [download 82% complete]
  116. -- [download 83% complete]
  117. -- [download 84% complete]
  118. -- [download 85% complete]
  119. -- [download 86% complete]
  120. -- [download 87% complete]
  121. -- [download 88% complete]
  122. -- [download 89% complete]
  123. -- [download 90% complete]
  124. -- [download 91% complete]
  125. -- [download 92% complete]
  126. -- [download 93% complete]
  127. -- [download 94% complete]
  128. -- [download 95% complete]
  129. -- [download 96% complete]
  130. -- [download 97% complete]
  131. -- [download 98% complete]
  132. -- [download 99% complete]
  133. -- [download 100% complete]
  134. -- Target architecture: x86_64
  135. CMake Error at /usr/share/cmake/Modules/FindPackageHandleStandardArgs.cmake:230 (message):
  136.   Could NOT find Boost: Found unsuitable version "1.78.0", but required is at
  137.   least "1.79.0" (found /usr/include, found components: context)
  138. Call Stack (most recent call first):
  139.   /usr/share/cmake/Modules/FindPackageHandleStandardArgs.cmake:598 (_FPHSA_FAILURE_MESSAGE)
  140.   /usr/share/cmake/Modules/FindBoost.cmake:2377 (find_package_handle_standard_args)
  141.   CMakeLists.txt:213 (find_package)
  142.  
  143.  
  144. -- Configuring incomplete, errors occurred!
  145.  
  146. ------------------------------------------------------------------------------
  147. Compilation failed!
  148. You might want to try an older version of yuzu
  149. If that doesn't help, feel free to contact us on discord in the #linux channel
Advertisement
Add Comment
Please, Sign In to add comment