Guest User

pysvn

a guest
Jun 27th, 2020
117
Never
Not a member of Pastebin yet? Sign Up, it unlocks many cool features!
  1. ==> Загрузка PKGBUILD python-pysvn из AUR...
  2. x .SRCINFO
  3. x .gitignore
  4. x PKGBUILD
  5. vchimishuk commented on <a href="#comment-493416" class="date">2015-04-17 12:06</a>
  6. yan12125, I believe with new name package will be considered as completely new. Isn't it? Actually I don't use this package any more. Do you want to maintain new package? If so, you can upload new one (and then I'll try to remove this one).
  7.  
  8. yan12125 commented on <a href="#comment-493430" class="date">2015-04-17 14:01</a>
  9. Thanks. I've uploaded python-pysvn and filed a merge request.
  10.  
  11. vchimishuk commented on <a href="#comment-493435" class="date">2015-04-17 14:12</a>
  12. yan12125, Thank you.
  13.  
  14. yan12125 commented on <a href="#comment-578957" class="date">2017-01-18 14:41</a>
  15. pysvn 1.9.4 is released. However, tests fail with the latest subversion, so use with caution. Also, I don't use pysvn anymore, either. I'll disowned it.
  16.  
  17. ShionRyuu commented on <a href="#comment-687332" class="date">2019-03-24 06:48</a>
  18.  
  19. python-pysvn 1.9.12-1 (2020-06-01 15:56)
  20. ( Неподдерживаемый пакет: Потенциально опасен ! )
  21. ==> Отредактировать PKGBUILD ? Да/нет [Y/n] ("A" для отмены)
  22. ==> --------------------------------------------------------
  23. ==>
  24. ==> зависимости python-pysvn:
  25. - python>=3.1.3 (уже установлен)
  26. - subversion (уже установлен)
  27. - apr (уже установлен)
  28.  
  29.  
  30. ==> Продолжить сборку python-pysvn ? Да/нет [Y/n]
  31. ==> ---------------------------------------------
  32. ==>
  33. ==> Сборка и установка пакета
  34. ==> Сборка пакета python-pysvn 1.9.12-1 (Сб 27 июн 2020 21:42:37)
  35. ==> Проверка зависимостей для запуска...
  36. ==> Проверка зависимостей для сборки...
  37. ==> Получение исходных файлов...
  38. -> Загрузка pysvn-1.9.12.tar.gz...
  39. % Total % Received % Xferd Average Speed Time Time Time Current
  40. Dload Upload Total Spent Left Speed
  41. 100 359 100 359 0 0 146 0 0:00:02 0:00:02 --:--:-- 146
  42. 100 648k 100 648k 0 0 110k 0 0:00:05 0:00:05 --:--:-- 205k
  43. ==> Проверка файлов source с использованием md5sums...
  44. pysvn-1.9.12.tar.gz ... Готово
  45. ==> Распаковка исходных файлов...
  46. -> Распаковка 'pysvn-1.9.12.tar.gz' с помощью bsdtar
  47. ==> Запускается build()...
  48. Info: Configure for python 3.8.3 in exec_prefix /usr
  49. Info: Checking for PyCXX include in ../Import/pycxx-7.1.4/CXX/Version.hxx
  50. Info: Found PyCXX include in /tmp/yaourt-tmp-km2/aur-python-pysvn/src/pysvn-1.9.12/Import/pycxx-7.1.4
  51. Info: Checking for PyCXX Source in /tmp/yaourt-tmp-km2/aur-python-pysvn/src/pysvn-1.9.12/Import/pycxx-7.1.4/Src/cxxsupport.cxx
  52. Info: Found PyCXX Source in /tmp/yaourt-tmp-km2/aur-python-pysvn/src/pysvn-1.9.12/Import/pycxx-7.1.4/Src
  53. Info: Checking for SVN include in /usr/include/subversion-1/svn_client.h
  54. Info: Found SVN include in /usr/include/subversion-1
  55. Info: Checking for SVN library in /usr/lib64/libsvn_client-1.so
  56. Info: Found SVN library in /usr/lib64
  57. Info: Checking for SVN bin in /usr/bin/svnadmin
  58. Info: Found SVN bin in /usr/bin
  59. Info: Checking for APR include in /usr/include/apr-1/apr.h
  60. Info: Found APR include in /usr/include/apr-1
  61. Info: Checking for APR include in /usr/include/apr-1/apu.h
  62. Info: Found APR include in /usr/include/apr-1
  63. Info: Checking for APR library in /usr/lib64/libapr-1.so
  64. Info: Found APR library in /usr/lib64
  65. Info: Building against SVN 1.14.0
  66. Info: Checking for PyCXX include in ../Import/pycxx-7.1.4/CXX/Version.hxx
  67. Info: Found PyCXX include in /tmp/yaourt-tmp-km2/aur-python-pysvn/src/pysvn-1.9.12/Import/pycxx-7.1.4
  68. Info: Checking for PyCXX Source in /tmp/yaourt-tmp-km2/aur-python-pysvn/src/pysvn-1.9.12/Import/pycxx-7.1.4/Src/cxxsupport.cxx
  69. Info: Found PyCXX Source in /tmp/yaourt-tmp-km2/aur-python-pysvn/src/pysvn-1.9.12/Import/pycxx-7.1.4/Src
  70. Info: Checking for SVN include in /usr/include/subversion-1/svn_client.h
  71. Info: Found SVN include in /usr/include/subversion-1
  72. Info: Checking for SVN library in /usr/lib64/libsvn_client-1.so
  73. Info: Found SVN library in /usr/lib64
  74. Info: Checking for SVN bin in /usr/bin/svnadmin
  75. Info: Found SVN bin in /usr/bin
  76. Info: Checking for APR include in /usr/include/apr-1/apr.h
  77. Info: Found APR include in /usr/include/apr-1
  78. Info: Checking for APR include in /usr/include/apr-1/apu.h
  79. Info: Found APR include in /usr/include/apr-1
  80. Info: Checking for APR library in /usr/lib64/libapr-1.so
  81. Info: Found APR library in /usr/lib64
  82. Info: Building against SVN 1.14.0
  83. Info: Using tool chain LinuxCompilerGCC
  84. Info: Creating Makefile for Sources
  85. Info: Creating Makefile for Tests
  86. Info: Make generate_svn_error_codes.hpp
  87. /usr/bin/python3 -u generate_svn_error_codes/create_svn_error_codes_hpp.py /usr/include/subversion-1
  88. Info: Make pysvn_docs.cpp
  89. /usr/bin/python3 -u ../Docs/generate_cpp_docs_from_html_docs.py /usr/include/subversion-1 ../Docs/pysvn_prog_ref.html pysvn_docs.hpp pysvn_docs.cpp
  90. Info: Make pysvn_version.hpp
  91. /usr/bin/python3 -u ../Builder/brand_version.py ../Builder/version.info pysvn_version.hpp.template
  92. Compile: /tmp/yaourt-tmp-km2/aur-python-pysvn/src/pysvn-1.9.12/Import/pycxx-7.1.4/Src/cxxsupport.cxx into cxxsupport.o
  93. Compile: /tmp/yaourt-tmp-km2/aur-python-pysvn/src/pysvn-1.9.12/Import/pycxx-7.1.4/Src/cxx_extensions.cxx into cxx_extensions.o
  94. Info: svn_include /usr/include/subversion-1
  95. Info: html_doc ../Docs/pysvn_prog_ref.html
  96. Info: cpp_header_filename pysvn_docs.hpp
  97. Info: cpp_module_filename pysvn_docs.cpp
  98. Compile: /tmp/yaourt-tmp-km2/aur-python-pysvn/src/pysvn-1.9.12/Import/pycxx-7.1.4/Src/cxxextensions.c into cxxextensions.o
  99. Info: Running svnversion -c ".." 2>&1
  100. Info: Building against SVN 1.14.0 code 1014000
  101. Info: revision Unversioned directory
  102. Compile: /tmp/yaourt-tmp-km2/aur-python-pysvn/src/pysvn-1.9.12/Import/pycxx-7.1.4/Src/IndirectPythonInterface.cxx into IndirectPythonInterface.o
  103. Compile: /tmp/yaourt-tmp-km2/aur-python-pysvn/src/pysvn-1.9.12/Import/pycxx-7.1.4/Src/cxx_exceptions.cxx into cxx_exceptions.o
  104. Compile: generate_svn_error_codes/generate_svn_error_codes.cpp into generate_svn_error_codes.o
  105. Info: Make pysvn_docs.hpp
  106. touch pysvn_docs.hpp
  107. Link generate_svn_error_codes/generate_svn_error_codes
  108. Compile: pysvn.cpp into pysvn.o
  109. Compile: pysvn_callbacks.cpp into pysvn_callbacks.o
  110. Compile: pysvn_client.cpp into pysvn_client.o
  111. Compile: pysvn_static_strings.cpp into pysvn_static_strings.o
  112. Compile: pysvn_enum_string.cpp into pysvn_enum_string.o
  113. Compile: pysvn_client_cmd_add.cpp into pysvn_client_cmd_add.o
  114. Compile: pysvn_client_cmd_changelist.cpp into pysvn_client_cmd_changelist.o
  115. Compile: pysvn_client_cmd_checkin.cpp into pysvn_client_cmd_checkin.o
  116. pysvn_client_cmd_add.cpp: В функции-члене «Py::Object pysvn_client::cmd_revert(const Py::Tuple&, const Py::Dict&)»:
  117. pysvn_client_cmd_add.cpp:566:17: предупреждение: «svn_error_t* svn_client_revert3(const apr_array_header_t*, svn_depth_t, const apr_array_header_t*, svn_boolean_t, svn_boolean_t, svn_client_ctx_t*, apr_pool_t*)» устарело [-Wdeprecated-declarations]
  118. 566 | );
  119. | ^
  120. In file included from pysvn_svnenv.hpp:20,
  121. from pysvn.hpp:17,
  122. from pysvn_client_cmd_add.cpp:19:
  123. /usr/include/subversion-1/svn_client.h:4517:1: замечание: объявлено здесь
  124. 4517 | svn_client_revert3(const apr_array_header_t *paths,
  125. | ^~~~~~~~~~~~~~~~~~
  126. Compile: pysvn_client_cmd_copy.cpp into pysvn_client_cmd_copy.o
  127. Compile: pysvn_client_cmd_diff.cpp into pysvn_client_cmd_diff.o
  128. Compile: pysvn_client_cmd_export.cpp into pysvn_client_cmd_export.o
  129. pysvn_client_cmd_copy.cpp: В функции-члене «Py::Object pysvn_client::cmd_copy2(const Py::Tuple&, const Py::Dict&)»:
  130. pysvn_client_cmd_copy.cpp:61:41: предупреждение: comparison of integer expressions of different signedness: «unsigned int» and «Py::SeqBase<Py::Object>::size_type» {aka «int»} [-Wsign-compare]
  131. 61 | for( unsigned int index=0; index<list_all_sources.length(); index++ )
  132. | ~~~~~^~~~~~~~~~~~~~~~~~~~~~~~~~
  133. pysvn_client_cmd_copy.cpp: В функции-члене «Py::Object pysvn_client::cmd_copy(const Py::Tuple&, const Py::Dict&)»:
  134. pysvn_client_cmd_copy.cpp:358:17: предупреждение: «svn_error_t* svn_client_copy3(svn_commit_info_t**, const char*, const svn_opt_revision_t*, const char*, svn_client_ctx_t*, apr_pool_t*)» устарело [-Wdeprecated-declarations]
  135. 358 | );
  136. | ^
  137. In file included from pysvn_svnenv.hpp:20,
  138. from pysvn.hpp:17,
  139. from pysvn_client_cmd_copy.cpp:19:
  140. /usr/include/subversion-1/svn_client.h:5689:1: замечание: объявлено здесь
  141. 5689 | svn_client_copy3(svn_commit_info_t **commit_info_p,
  142. | ^~~~~~~~~~~~~~~~
  143. pysvn_client_cmd_copy.cpp: В функции-члене «Py::Object pysvn_client::cmd_move2(const Py::Tuple&, const Py::Dict&)»:
  144. pysvn_client_cmd_copy.cpp:436:41: предупреждение: comparison of integer expressions of different signedness: «unsigned int» and «Py::SeqBase<Py::Object>::size_type» {aka «int»} [-Wsign-compare]
  145. 436 | for( unsigned int index=0; index<list_all_sources.length(); index++ )
  146. | ~~~~~^~~~~~~~~~~~~~~~~~~~~~~~~~
  147. pysvn_client_cmd_copy.cpp: В функции-члене «Py::Object pysvn_client::cmd_move(const Py::Tuple&, const Py::Dict&)»:
  148. pysvn_client_cmd_copy.cpp:610:17: предупреждение: «svn_error_t* svn_client_move4(svn_commit_info_t**, const char*, const char*, svn_boolean_t, svn_client_ctx_t*, apr_pool_t*)» устарело [-Wdeprecated-declarations]
  149. 610 | );
  150. | ^
  151. In file included from pysvn_svnenv.hpp:20,
  152. from pysvn.hpp:17,
  153. from pysvn_client_cmd_copy.cpp:19:
  154. /usr/include/subversion-1/svn_client.h:5894:1: замечание: объявлено здесь
  155. 5894 | svn_client_move4(svn_commit_info_t **commit_info_p,
  156. | ^~~~~~~~~~~~~~~~
  157. Compile: pysvn_client_cmd_info.cpp into pysvn_client_cmd_info.o
  158. pysvn_client_cmd_diff.cpp: В функции-члене «Py::Object pysvn_client::cmd_diff(const Py::Tuple&, const Py::Dict&)»:
  159. pysvn_client_cmd_diff.cpp:334:13: предупреждение: «svn_error_t* svn_client_diff6(const apr_array_header_t*, const char*, const svn_opt_revision_t*, const char*, const svn_opt_revision_t*, const char*, svn_depth_t, svn_boolean_t, svn_boolean_t, svn_boolean_t, svn_boolean_t, svn_boolean_t, svn_boolean_t, svn_boolean_t, svn_boolean_t, const char*, svn_stream_t*, svn_stream_t*, const apr_array_header_t*, svn_client_ctx_t*, apr_pool_t*)» устарело [-Wdeprecated-declarations]
  160. 334 | );
  161. | ^
  162. In file included from pysvn_svnenv.hpp:20,
  163. from pysvn.hpp:17,
  164. from pysvn_client_cmd_diff.cpp:19:
  165. /usr/include/subversion-1/svn_client.h:3233:1: замечание: объявлено здесь
  166. 3233 | svn_client_diff6(const apr_array_header_t *diff_options,
  167. | ^~~~~~~~~~~~~~~~
  168. pysvn_client_cmd_diff.cpp: В функции-члене «Py::Object pysvn_client::cmd_diff_peg(const Py::Tuple&, const Py::Dict&)»:
  169. pysvn_client_cmd_diff.cpp:600:13: предупреждение: «svn_error_t* svn_client_diff_peg6(const apr_array_header_t*, const char*, const svn_opt_revision_t*, const svn_opt_revision_t*, const svn_opt_revision_t*, const char*, svn_depth_t, svn_boolean_t, svn_boolean_t, svn_boolean_t, svn_boolean_t, svn_boolean_t, svn_boolean_t, svn_boolean_t, svn_boolean_t, const char*, svn_stream_t*, svn_stream_t*, const apr_array_header_t*, svn_client_ctx_t*, apr_pool_t*)» устарело [-Wdeprecated-declarations]
  170. 600 | );
  171. | ^
  172. In file included from pysvn_svnenv.hpp:20,
  173. from pysvn.hpp:17,
  174. from pysvn_client_cmd_diff.cpp:19:
  175. /usr/include/subversion-1/svn_client.h:3428:1: замечание: объявлено здесь
  176. 3428 | svn_client_diff_peg6(const apr_array_header_t *diff_options,
  177. | ^~~~~~~~~~~~~~~~~~~~
  178. Compile: pysvn_client_cmd_list.cpp into pysvn_client_cmd_list.o
  179. Compile: pysvn_client_cmd_lock.cpp into pysvn_client_cmd_lock.o
  180. Compile: pysvn_client_cmd_merge.cpp into pysvn_client_cmd_merge.o
  181. pysvn_client_cmd_info.cpp: В функции-члене «Py::Object pysvn_client::cmd_annotate2(const Py::Tuple&, const Py::Dict&)»:
  182. pysvn_client_cmd_info.cpp:487:13: предупреждение: «svn_error_t* svn_client_blame5(const char*, const svn_opt_revision_t*, const svn_opt_revision_t*, const svn_opt_revision_t*, const svn_diff_file_options_t*, svn_boolean_t, svn_boolean_t, svn_client_blame_receiver3_t, void*, svn_client_ctx_t*, apr_pool_t*)» устарело [-Wdeprecated-declarations]
  183. 487 | );
  184. | ^
  185. In file included from pysvn_svnenv.hpp:20,
  186. from pysvn.hpp:17,
  187. from pysvn_client_cmd_info.cpp:19:
  188. /usr/include/subversion-1/svn_client.h:3003:1: замечание: объявлено здесь
  189. 3003 | svn_client_blame5(const char *path_or_url,
  190. | ^~~~~~~~~~~~~~~~~
  191. pysvn_client_cmd_info.cpp: В функции-члене «Py::Object pysvn_client::cmd_annotate(const Py::Tuple&, const Py::Dict&)»:
  192. pysvn_client_cmd_info.cpp:598:13: предупреждение: «svn_error_t* svn_client_blame4(const char*, const svn_opt_revision_t*, const svn_opt_revision_t*, const svn_opt_revision_t*, const svn_diff_file_options_t*, svn_boolean_t, svn_boolean_t, svn_client_blame_receiver2_t, void*, svn_client_ctx_t*, apr_pool_t*)» устарело [-Wdeprecated-declarations]
  193. 598 | );
  194. | ^
  195. In file included from pysvn_svnenv.hpp:20,
  196. from pysvn.hpp:17,
  197. from pysvn_client_cmd_info.cpp:19:
  198. /usr/include/subversion-1/svn_client.h:3025:1: замечание: объявлено здесь
  199. 3025 | svn_client_blame4(const char *path_or_url,
  200. | ^~~~~~~~~~~~~~~~~
  201. pysvn_client_cmd_info.cpp: В функции-члене «Py::Object pysvn_client::cmd_info(const Py::Tuple&, const Py::Dict&)»:
  202. pysvn_client_cmd_info.cpp:709:21: предупреждение: «svn_error_t* svn_wc_adm_probe_open3(svn_wc_adm_access_t**, svn_wc_adm_access_t*, const char*, svn_boolean_t, int, svn_cancel_func_t, void*, apr_pool_t*)» устарело [-Wdeprecated-declarations]
  203. 709 | );
  204. | ^
  205. In file included from /usr/include/subversion-1/svn_client.h:44,
  206. from pysvn_svnenv.hpp:20,
  207. from pysvn.hpp:17,
  208. from pysvn_client_cmd_info.cpp:19:
  209. /usr/include/subversion-1/svn_wc.h:343:1: замечание: объявлено здесь
  210. 343 | svn_wc_adm_probe_open3(svn_wc_adm_access_t **adm_access,
  211. | ^~~~~~~~~~~~~~~~~~~~~~
  212. pysvn_client_cmd_info.cpp:727:21: предупреждение: «svn_error_t* svn_wc_entry(const svn_wc_entry_t**, const char*, svn_wc_adm_access_t*, svn_boolean_t, apr_pool_t*)» устарело [-Wdeprecated-declarations]
  213. 727 | );
  214. | ^
  215. In file included from /usr/include/subversion-1/svn_client.h:44,
  216. from pysvn_svnenv.hpp:20,
  217. from pysvn.hpp:17,
  218. from pysvn_client_cmd_info.cpp:19:
  219. /usr/include/subversion-1/svn_wc.h:3172:1: замечание: объявлено здесь
  220. 3172 | svn_wc_entry(const svn_wc_entry_t **entry,
  221. | ^~~~~~~~~~~~
  222. pysvn_client_cmd_info.cpp: В функции-члене «Py::Object pysvn_client::cmd_log(const Py::Tuple&, const Py::Dict&)»:
  223. pysvn_client_cmd_info.cpp:1262:23: предупреждение: comparison of integer expressions of different signedness: «size_t» {aka «long unsigned int»} and «Py::SeqBase<Py::Object>::size_type» {aka «int»} [-Wsign-compare]
  224. 1262 | for( size_t i=0; i<url_or_path_list.size(); i++ )
  225. | ~^~~~~~~~~~~~~~~~~~~~~~~~
  226. pysvn_client_cmd_info.cpp: В функции «svn_error_t* status4EntriesFunc(void*, const char*, svn_wc_status2_t*, apr_pool_t*)»:
  227. pysvn_client_cmd_info.cpp:1914:70: предупреждение: «svn_wc_status2_t* svn_wc_dup_status2(const svn_wc_status2_t*, apr_pool_t*)» устарело [-Wdeprecated-declarations]
  228. 1914 | svn_wc_status2_t *stat = svn_wc_dup_status2( status, seb->m_pool ); // ignore deprecation needed for Client().status()
  229. | ^
  230. In file included from /usr/include/subversion-1/svn_client.h:44,
  231. from pysvn_svnenv.hpp:20,
  232. from pysvn.hpp:17,
  233. from pysvn_client_cmd_info.cpp:19:
  234. /usr/include/subversion-1/svn_wc.h:4056:1: замечание: объявлено здесь
  235. 4056 | svn_wc_dup_status2(const svn_wc_status2_t *orig_stat,
  236. | ^~~~~~~~~~~~~~~~~~
  237. pysvn_client_cmd_info.cpp: В функции-члене «Py::Object pysvn_client::cmd_status(const Py::Tuple&, const Py::Dict&)»:
  238. pysvn_client_cmd_info.cpp:2022:13: предупреждение: «svn_error_t* svn_client_status4(svn_revnum_t*, const char*, const svn_opt_revision_t*, svn_wc_status_func3_t, void*, svn_depth_t, svn_boolean_t, svn_boolean_t, svn_boolean_t, svn_boolean_t, const apr_array_header_t*, svn_client_ctx_t*, apr_pool_t*)» устарело [-Wdeprecated-declarations]
  239. 2022 | );
  240. | ^
  241. In file included from pysvn_svnenv.hpp:20,
  242. from pysvn.hpp:17,
  243. from pysvn_client_cmd_info.cpp:19:
  244. /usr/include/subversion-1/svn_client.h:2676:1: замечание: объявлено здесь
  245. 2676 | svn_client_status4(svn_revnum_t *result_rev,
  246. | ^~~~~~~~~~~~~~~~~~
  247. pysvn_client_cmd_list.cpp: В функции-члене «Py::Object pysvn_client::cmd_ls(const Py::Tuple&, const Py::Dict&)»:
  248. pysvn_client_cmd_list.cpp:74:13: предупреждение: «svn_error_t* svn_client_ls3(apr_hash_t**, apr_hash_t**, const char*, const svn_opt_revision_t*, const svn_opt_revision_t*, svn_boolean_t, svn_client_ctx_t*, apr_pool_t*)» устарело [-Wdeprecated-declarations]
  249. 74 | );
  250. | ^
  251. In file included from pysvn_svnenv.hpp:20,
  252. from pysvn.hpp:17,
  253. from pysvn_client_cmd_list.cpp:19:
  254. /usr/include/subversion-1/svn_client.h:6880:1: замечание: объявлено здесь
  255. 6880 | svn_client_ls3(apr_hash_t **dirents,
  256. | ^~~~~~~~~~~~~~
  257. Compile: pysvn_client_cmd_patch.cpp into pysvn_client_cmd_patch.o
  258. pysvn_client_cmd_merge.cpp: В функции-члене «Py::Object pysvn_client::cmd_merge(const Py::Tuple&, const Py::Dict&)»:
  259. pysvn_client_cmd_merge.cpp:87:27: предупреждение: comparison of integer expressions of different signedness: «size_t» {aka «long unsigned int»} and «Py::SeqBase<Py::Object>::size_type» {aka «int»} [-Wsign-compare]
  260. 87 | for( size_t i=0; i<merge_options_list.length(); i++ )
  261. | ~^~~~~~~~~~~~~~~~~~~~~~~~~~~~
  262. pysvn_client_cmd_merge.cpp:101:27: предупреждение: comparison of integer expressions of different signedness: «size_t» {aka «long unsigned int»} and «Py::SeqBase<Py::Object>::size_type» {aka «int»} [-Wsign-compare]
  263. 101 | for( size_t i=0; i<merge_options_list.length(); i++ )
  264. | ~^~~~~~~~~~~~~~~~~~~~~~~~~~~~
  265. pysvn_client_cmd_merge.cpp: В функции-члене «Py::Object pysvn_client::cmd_merge_peg2(const Py::Tuple&, const Py::Dict&)»:
  266. pysvn_client_cmd_merge.cpp:267:27: предупреждение: comparison of integer expressions of different signedness: «size_t» {aka «long unsigned int»} and «Py::SeqBase<Py::Object>::size_type» {aka «int»} [-Wsign-compare]
  267. 267 | for( size_t i=0; i<merge_options_list.length(); i++ )
  268. | ~^~~~~~~~~~~~~~~~~~~~~~~~~~~~
  269. pysvn_client_cmd_merge.cpp:282:27: предупреждение: comparison of integer expressions of different signedness: «size_t» {aka «long unsigned int»} and «Py::SeqBase<Py::Object>::size_type» {aka «int»} [-Wsign-compare]
  270. 282 | for( size_t i=0; i<merge_options_list.length(); i++ )
  271. | ~^~~~~~~~~~~~~~~~~~~~~~~~~~~~
  272. pysvn_client_cmd_merge.cpp:296:37: предупреждение: comparison of integer expressions of different signedness: «unsigned int» and «Py::SeqBase<Py::Object>::size_type» {aka «int»} [-Wsign-compare]
  273. 296 | for( unsigned int index=0; index<list_all_ranges.length(); index++ )
  274. | ~~~~~^~~~~~~~~~~~~~~~~~~~~~~~~
  275. pysvn_client_cmd_merge.cpp: В функции-члене «Py::Object pysvn_client::cmd_merge_peg(const Py::Tuple&, const Py::Dict&)»:
  276. pysvn_client_cmd_merge.cpp:458:27: предупреждение: comparison of integer expressions of different signedness: «size_t» {aka «long unsigned int»} and «Py::SeqBase<Py::Object>::size_type» {aka «int»} [-Wsign-compare]
  277. 458 | for( size_t i=0; i<merge_options_list.length(); i++ )
  278. | ~^~~~~~~~~~~~~~~~~~~~~~~~~~~~
  279. pysvn_client_cmd_merge.cpp:477:27: предупреждение: comparison of integer expressions of different signedness: «size_t» {aka «long unsigned int»} and «Py::SeqBase<Py::Object>::size_type» {aka «int»} [-Wsign-compare]
  280. 477 | for( size_t i=0; i<merge_options_list.length(); i++ )
  281. | ~^~~~~~~~~~~~~~~~~~~~~~~~~~~~
  282. pysvn_client_cmd_merge.cpp:511:13: предупреждение: «svn_error_t* svn_client_merge_peg2(const char*, const svn_opt_revision_t*, const svn_opt_revision_t*, const svn_opt_revision_t*, const char*, svn_boolean_t, svn_boolean_t, svn_boolean_t, svn_boolean_t, const apr_array_header_t*, svn_client_ctx_t*, apr_pool_t*)» устарело [-Wdeprecated-declarations]
  283. 511 | );
  284. | ^
  285. In file included from pysvn_svnenv.hpp:20,
  286. from pysvn.hpp:17,
  287. from pysvn_client_cmd_merge.cpp:19:
  288. /usr/include/subversion-1/svn_client.h:4046:1: замечание: объявлено здесь
  289. 4046 | svn_client_merge_peg2(const char *source,
  290. | ^~~~~~~~~~~~~~~~~~~~~
  291. pysvn_client_cmd_merge.cpp: В функции-члене «Py::Object pysvn_client::cmd_merge_reintegrate(const Py::Tuple&, const Py::Dict&)»:
  292. pysvn_client_cmd_merge.cpp:570:27: предупреждение: comparison of integer expressions of different signedness: «size_t» {aka «long unsigned int»} and «Py::SeqBase<Py::Object>::size_type» {aka «int»} [-Wsign-compare]
  293. 570 | for( size_t i=0; i<merge_options_list.length(); i++ )
  294. | ~^~~~~~~~~~~~~~~~~~~~~~~~~~~~
  295. pysvn_client_cmd_merge.cpp:582:27: предупреждение: comparison of integer expressions of different signedness: «size_t» {aka «long unsigned int»} and «Py::SeqBase<Py::Object>::size_type» {aka «int»} [-Wsign-compare]
  296. 582 | for( size_t i=0; i<merge_options_list.length(); i++ )
  297. | ~^~~~~~~~~~~~~~~~~~~~~~~~~~~~
  298. pysvn_client_cmd_merge.cpp:609:13: предупреждение: «svn_error_t* svn_client_merge_reintegrate(const char*, const svn_opt_revision_t*, const char*, svn_boolean_t, const apr_array_header_t*, svn_client_ctx_t*, apr_pool_t*)» устарело [-Wdeprecated-declarations]
  299. 609 | );
  300. | ^
  301. In file included from pysvn_svnenv.hpp:20,
  302. from pysvn.hpp:17,
  303. from pysvn_client_cmd_merge.cpp:19:
  304. /usr/include/subversion-1/svn_client.h:3932:1: замечание: объявлено здесь
  305. 3932 | svn_client_merge_reintegrate(const char *source_path_or_url,
  306. | ^~~~~~~~~~~~~~~~~~~~~~~~~~~~
  307. Compile: pysvn_client_cmd_prop.cpp into pysvn_client_cmd_prop.o
  308. Compile: pysvn_client_cmd_revprop.cpp into pysvn_client_cmd_revprop.o
  309. Compile: pysvn_client_cmd_switch.cpp into pysvn_client_cmd_switch.o
  310. Compile: pysvn_transaction.cpp into pysvn_transaction.o
  311. Compile: pysvn_revision.cpp into pysvn_revision.o
  312. Compile: pysvn_docs.cpp into pysvn_docs.o
  313. Compile: pysvn_path.cpp into pysvn_path.o
  314. Compile: pysvn_arg_processing.cpp into pysvn_arg_processing.o
  315. Compile: pysvn_converters.cpp into pysvn_converters.o
  316. pysvn_transaction.cpp: В функции-члене «Py::Object pysvn_transaction::cmd_revpropget(const Py::Tuple&, const Py::Dict&)»:
  317. pysvn_transaction.cpp:665:17: предупреждение: «svn_error_t* svn_fs_revision_prop(svn_string_t**, svn_fs_t*, svn_revnum_t, const char*, apr_pool_t*)» устарело [-Wdeprecated-declarations]
  318. 665 | );
  319. | ^
  320. In file included from pysvn_svnenv.hpp:24,
  321. from pysvn.hpp:17,
  322. from pysvn_transaction.cpp:20:
  323. /usr/include/subversion-1/svn_fs.h:2816:1: замечание: объявлено здесь
  324. 2816 | svn_fs_revision_prop(svn_string_t **value_p,
  325. | ^~~~~~~~~~~~~~~~~~~~
  326. pysvn_transaction.cpp: В функции-члене «Py::Object pysvn_transaction::cmd_revproplist(const Py::Tuple&, const Py::Dict&)»:
  327. pysvn_transaction.cpp:719:17: предупреждение: «svn_error_t* svn_fs_revision_proplist(apr_hash_t**, svn_fs_t*, svn_revnum_t, apr_pool_t*)» устарело [-Wdeprecated-declarations]
  328. 719 | );
  329. | ^
  330. In file included from pysvn_svnenv.hpp:24,
  331. from pysvn.hpp:17,
  332. from pysvn_transaction.cpp:20:
  333. /usr/include/subversion-1/svn_fs.h:2856:1: замечание: объявлено здесь
  334. 2856 | svn_fs_revision_proplist(apr_hash_t **table_p,
  335. | ^~~~~~~~~~~~~~~~~~~~~~~~
  336. Compile: pysvn_svnenv.cpp into pysvn_svnenv.o
  337. Compile: pysvn_profile.cpp into pysvn_profile.o
  338. Info: Make pysvn/__init__.py
  339. /usr/bin/python3 -u create__init__.py pysvn/__init__.py.template pysvn/__init__.py generate_svn_error_codes/generate_svn_error_codes _pysvn_3_8.so
  340. Info: Creating __init__.py for module _pysvn_3_8
  341. Info: Running 'generate_svn_error_codes/generate_svn_error_codes >>pysvn/__init__.py'
  342. pysvn_converters.cpp: В функции «Py::Object toObject(const svn_client_info2_t&, SvnPool&, const DictWrapper&, const DictWrapper&, const DictWrapper&)»:
  343. pysvn_converters.cpp:717:41: предупреждение: comparison of integer expressions of different signedness: «const svn_filesize_t» {aka «const long int»} and «apr_size_t» {aka «long unsigned int»} [-Wsign-compare]
  344. 717 | if( info.wc_info->recorded_size == SVN_INFO_SIZE_UNKNOWN )
  345. Link pysvn/_pysvn_3_8.so
  346. ==> Запускается check()...
  347. rm -rf testroot-01
  348. rm -rf testroot-04
  349. LD_LIBRARY_PATH="/usr/lib64:/usr/lib64" PATH="/usr/bin:/home/km2/.cargo/bin:/usr/local/sbin:/usr/local/bin:/usr/bin:/usr/bin/site_perl:/usr/bin/vendor_perl:/usr/bin/core_perl" PYTHON="/usr/bin/python3" ./test-01.sh >test-01.unix.new.log 2>&1
  350. LD_LIBRARY_PATH="/usr/lib64:/usr/lib64" PATH="/usr/bin:/home/km2/.cargo/bin:/usr/local/sbin:/usr/local/bin:/usr/bin:/usr/bin/site_perl:/usr/bin/vendor_perl:/usr/bin/core_perl" PYTHON="/usr/bin/python3" ./test-04.sh >test-04.unix.new.log 2>&1
  351. rm -rf testroot-05
  352. rm -rf testroot-06
  353. /bin/sh: warning: setlocale: LC_ALL: cannot change locale (en_US.UTF-8)
  354. /bin/sh: warning: setlocale: LC_ALL: cannot change locale (en_US.UTF-8)
  355. LD_LIBRARY_PATH="/usr/lib64:/usr/lib64" PATH="/usr/bin:/home/km2/.cargo/bin:/usr/local/sbin:/usr/local/bin:/usr/bin:/usr/bin/site_perl:/usr/bin/vendor_perl:/usr/bin/core_perl" PYTHON="/usr/bin/python3" ./test-05.sh >test-05.unix.new.log 2>&1
  356. LD_LIBRARY_PATH="/usr/lib64:/usr/lib64" PATH="/usr/bin:/home/km2/.cargo/bin:/usr/local/sbin:/usr/local/bin:/usr/bin:/usr/bin/site_perl:/usr/bin/vendor_perl:/usr/bin/core_perl" PYTHON="/usr/bin/python3" ./test-06.sh >test-06.unix.new.log 2>&1
  357. rm -rf testroot-07
  358. /bin/sh: warning: setlocale: LC_ALL: cannot change locale (en_US.UTF-8)
  359. /bin/sh: warning: setlocale: LC_ALL: cannot change locale (en_US.UTF-8)
  360. LD_LIBRARY_PATH="/usr/lib64:/usr/lib64" PATH="/usr/bin:/home/km2/.cargo/bin:/usr/local/sbin:/usr/local/bin:/usr/bin:/usr/bin/site_perl:/usr/bin/vendor_perl:/usr/bin/core_perl" PYTHON="/usr/bin/python3" ./test-07.sh >test-07.unix.new.log 2>&1
  361. /bin/sh: warning: setlocale: LC_ALL: cannot change locale (en_US.UTF-8)
  362. rm -rf testroot-08
  363. LD_LIBRARY_PATH="/usr/lib64:/usr/lib64" PATH="/usr/bin:/home/km2/.cargo/bin:/usr/local/sbin:/usr/local/bin:/usr/bin:/usr/bin/site_perl:/usr/bin/vendor_perl:/usr/bin/core_perl" PYTHON="/usr/bin/python3" ./test-08.sh >test-08.unix.new.log 2>&1
  364. /bin/sh: warning: setlocale: LC_ALL: cannot change locale (en_US.UTF-8)
  365. rm -rf testroot-09
  366. LD_LIBRARY_PATH="/usr/lib64:/usr/lib64" PATH="/usr/bin:/home/km2/.cargo/bin:/usr/local/sbin:/usr/local/bin:/usr/bin:/usr/bin/site_perl:/usr/bin/vendor_perl:/usr/bin/core_perl" PYTHON="/usr/bin/python3" ./test-09.sh >test-09.unix.new.log 2>&1
  367. /bin/sh: warning: setlocale: LC_ALL: cannot change locale (en_US.UTF-8)
  368. rm -rf testroot-10
  369. LD_LIBRARY_PATH="/usr/lib64:/usr/lib64" PATH="/usr/bin:/home/km2/.cargo/bin:/usr/local/sbin:/usr/local/bin:/usr/bin:/usr/bin/site_perl:/usr/bin/vendor_perl:/usr/bin/core_perl" PYTHON="/usr/bin/python3" ./test-10.sh >test-10.unix.new.log 2>&1
  370. /bin/sh: warning: setlocale: LC_ALL: cannot change locale (en_US.UTF-8)
  371. rm -rf testroot-11
  372. LD_LIBRARY_PATH="/usr/lib64:/usr/lib64" PATH="/usr/bin:/home/km2/.cargo/bin:/usr/local/sbin:/usr/local/bin:/usr/bin:/usr/bin/site_perl:/usr/bin/vendor_perl:/usr/bin/core_perl" PYTHON="/usr/bin/python3" ./test-11.sh >test-11.unix.new.log 2>&1
  373. /bin/sh: warning: setlocale: LC_ALL: cannot change locale (en_US.UTF-8)
  374. /usr/bin/python3 benchmark_diff.py 1.14.0 test-04.unix.known_good-py3-svn1.14.log test-04.unix.new.log
  375. Info: SVN Version 1.14.0
  376. Info: Comparing test-04.unix.known_good-py3-svn1.14.log
  377. Info: Against test-04.unix.new.log
  378. Error: Test failed - test-04.unix.new.log
  379. Error: --------------------------------------------------------------------------------
  380. Error: Result(1) insert /bin/bash: warning: setlocale: LC_ALL: cannot change locale (en_US.UTF-8)
  381. Error: --------------------------------------------------------------------------------
  382. Error: Result(9) insert svnadmin: warning: cannot set LC_CTYPE locale
  383. Error: Result(10) insert svnadmin: warning: environment variable LC_ALL is en_US.UTF-8
  384. Error: Result(11) insert svnadmin: warning: please check that your locale name is correct
  385. Error: --------------------------------------------------------------------------------
  386. Error: Benchmark(10) replace commit_finalizing .
  387. Error: Result(14) replace Traceback (most recent call last):
  388. Error: Result(15) replace File "<workdir>/Examples/Client/svn_cmd.py", line 86, in initLocale
  389. Error: Result(16) replace locale.setlocale( locale.LC_ALL, '%s.%s' % (language_code, encoding) )
  390. Error: Result(17) replace File "/usr/lib/python3.8/locale.py", line 608, in setlocale
  391. Error: Result(18) replace return _setlocale(category, locale)
  392. Error: Result(19) replace locale.Error: unsupported locale setting
  393. Error: Result(20) replace
  394. Error: Result(21) replace During handling of the above exception, another exception occurred:
  395. Error: Result(22) replace
  396. Error: Result(23) replace Traceback (most recent call last):
  397. Error: Result(24) replace File "<workdir>/Examples/Client/svn_cmd.py", line 1583, in <module>
  398. Error: Result(25) replace sys.exit( main( sys.argv ) )
  399. Error: Result(26) replace File "<workdir>/Examples/Client/svn_cmd.py", line 61, in main
  400. Error: Result(27) replace initLocale()
  401. Error: Result(28) replace File "<workdir>/Examples/Client/svn_cmd.py", line 89, in initLocale
  402. Error: Result(29) replace locale.setlocale( locale.LC_ALL, 'en_GB.UTF-8' )
  403. Error: Result(30) replace File "/usr/lib/python3.8/locale.py", line 608, in setlocale
  404. Error: Result(31) replace return _setlocale(category, locale)
  405. Error: Result(32) replace locale.Error: unsupported locale setting
  406. Error: --------------------------------------------------------------------------------
  407. Error: Benchmark(12) replace commit_finalizing .
  408. Error: Result(34) replace Traceback (most recent call last):
  409. Error: Result(35) replace File "<workdir>/Examples/Client/svn_cmd.py", line 86, in initLocale
  410. Error: Result(36) replace locale.setlocale( locale.LC_ALL, '%s.%s' % (language_code, encoding) )
  411. Error: Result(37) replace File "/usr/lib/python3.8/locale.py", line 608, in setlocale
  412. Error: Result(38) replace return _setlocale(category, locale)
  413. Error: Result(39) replace locale.Error: unsupported locale setting
  414. Error: Result(40) replace
  415. Error: Result(41) replace During handling of the above exception, another exception occurred:
  416. Error: Result(42) replace
  417. Error: Result(43) replace Traceback (most recent call last):
  418. Error: Result(44) replace File "<workdir>/Examples/Client/svn_cmd.py", line 1583, in <module>
  419. Error: Result(45) replace sys.exit( main( sys.argv ) )
  420. Error: Result(46) replace File "<workdir>/Examples/Client/svn_cmd.py", line 61, in main
  421. Error: Result(47) replace initLocale()
  422. Error: Result(48) replace File "<workdir>/Examples/Client/svn_cmd.py", line 89, in initLocale
  423. Error: Result(49) replace locale.setlocale( locale.LC_ALL, 'en_GB.UTF-8' )
  424. Error: Result(50) replace File "/usr/lib/python3.8/locale.py", line 608, in setlocale
  425. Error: Result(51) replace return _setlocale(category, locale)
  426. Error: Result(52) replace locale.Error: unsupported locale setting
  427. Error: --------------------------------------------------------------------------------
  428. Error: Benchmark(15) replace commit_finalizing .
  429. Error: Benchmark(16) replace Info: pre_test_1.output start ------------------------------------
  430. Error: Benchmark(17) replace <PYTHON> <workdir>/Tests/test_04_commit_hook_test_1.py pre-commit <workdir>/Tests/testroot-04/repos 2-2
  431. Error: Benchmark(18) replace Info: pre-commit test 1
  432. Error: Benchmark(19) replace Info: Transaction( <workdir>/Tests/testroot-04/repos, 2-2) ...
  433. Error: Benchmark(20) replace Info: revproplist() ...
  434. Error: Benchmark(21) replace svn:author: <username>
  435. Error: Benchmark(22) replace svn:date: <numeric-date-and-time>
  436. Error: Benchmark(23) replace svn:log: pre-commit test 1
  437. Error: Benchmark(24) replace svn:txn-client-compat-version: 1.14.0
  438. Error: Benchmark(25) replace svn:txn-user-agent: SVN/1.14.0 (arch-os-string) ra_local
  439. Error: Benchmark(26) replace Info: changed() ...
  440. Error: Benchmark(27) replace trunk/test/a: action='A', kind=<node_kind.dir>, text_mod=0, prop_mod=0
  441. Error: Benchmark(28) replace Info: changed( copy_info=True ) ...
  442. Error: Benchmark(29) replace trunk/test/a: action='A', kind=<node_kind.dir>, text_mod=0, prop_mod=0 copyfrom_rev=0 copyfrom_path=None
  443. Error: Benchmark(30) replace Info: list() ...
  444. Error: Benchmark(31) replace /trunk: kind=<node_kind.dir>
  445. Error: Benchmark(32) replace /trunk/test: kind=<node_kind.dir>
  446. Error: Benchmark(33) replace /trunk/test/a: kind=<node_kind.dir>
  447. Error: Benchmark(34) replace Info: pre_test_1.output end --------------------------------------
  448. Error: Benchmark(35) replace Info: post_test_1.output start -----------------------------------
  449. Error: Benchmark(36) replace <PYTHON> <workdir>/Tests/test_04_commit_hook_test_1.py post-commit <workdir>/Tests/testroot-04/repos 3 2-2 is_revision
  450. Error: Benchmark(37) replace Info: post-commit test 1
  451. Error: Benchmark(38) replace Info: Transaction( <workdir>/Tests/testroot-04/repos, 3, is_revision=True) ...
  452. Error: Benchmark(39) replace Info: revproplist() ...
  453. Error: Benchmark(40) replace svn:author: <username>
  454. Error: Benchmark(41) replace svn:date: <numeric-date-and-time>
  455. Error: Benchmark(42) replace svn:log: pre-commit test 1
  456. Error: Benchmark(43) replace Info: changed() ...
  457. Error: Benchmark(44) replace trunk/test/a: action='A', kind=<node_kind.dir>, text_mod=0, prop_mod=0
  458. Error: Benchmark(45) replace Info: changed( copy_info=True ) ...
  459. Error: Benchmark(46) replace trunk/test/a: action='A', kind=<node_kind.dir>, text_mod=0, prop_mod=0 copyfrom_rev=0 copyfrom_path=None
  460. Error: Benchmark(47) replace Info: list() ...
  461. Error: Benchmark(48) replace /trunk: kind=<node_kind.dir>
  462. Error: Benchmark(49) replace /trunk/test: kind=<node_kind.dir>
  463. Error: Benchmark(50) replace /trunk/test/a: kind=<node_kind.dir>
  464. Error: Result(55) replace Traceback (most recent call last):
  465. Error: Result(56) replace File "<workdir>/Examples/Client/svn_cmd.py", line 86, in initLocale
  466. Error: Result(57) replace locale.setlocale( locale.LC_ALL, '%s.%s' % (language_code, encoding) )
  467. Error: Result(58) replace File "/usr/lib/python3.8/locale.py", line 608, in setlocale
  468. Error: Result(59) replace return _setlocale(category, locale)
  469. Error: Result(60) replace locale.Error: unsupported locale setting
  470. Error: Result(61) replace
  471. Error: Result(62) replace During handling of the above exception, another exception occurred:
  472. Error: Result(63) replace
  473. Error: Result(64) replace Traceback (most recent call last):
  474. Error: Result(65) replace File "<workdir>/Examples/Client/svn_cmd.py", line 1583, in <module>
  475. Error: Result(66) replace sys.exit( main( sys.argv ) )
  476. Error: Result(67) replace File "<workdir>/Examples/Client/svn_cmd.py", line 61, in main
  477. Error: Result(68) replace initLocale()
  478. Error: Result(69) replace File "<workdir>/Examples/Client/svn_cmd.py", line 89, in initLocale
  479. Error: Result(70) replace locale.setlocale( locale.LC_ALL, 'en_GB.UTF-8' )
  480. Error: Result(71) replace File "/usr/lib/python3.8/locale.py", line 608, in setlocale
  481. Error: Result(72) replace return _setlocale(category, locale)
  482. Error: Result(73) replace locale.Error: unsupported locale setting
  483. Error: Result(74) replace Info: pre_test_1.output start ------------------------------------
  484. Error: Result(75) replace cat: <workdir>/Tests/testroot-04/pre_test_1.output: No such file or directory
  485. Error: Result(76) replace Info: pre_test_1.output end --------------------------------------
  486. Error: Result(77) replace Info: post_test_1.output start -----------------------------------
  487. Error: Result(78) replace cat: <workdir>/Tests/testroot-04/post_test_1.output: No such file or directory
  488. Error: --------------------------------------------------------------------------------
  489. Error: Benchmark(54) replace A <workdir>/Tests/testroot-04/wc/a
  490. Error: Benchmark(55) replace U <workdir>/Tests/testroot-04/wc
  491. Error: Benchmark(56) replace update_started <workdir>/Tests/testroot-04/wc
  492. Error: Benchmark(57) replace Checked out revision 3
  493. Error: Result(82) replace Traceback (most recent call last):
  494. Error: Result(83) replace File "<workdir>/Examples/Client/svn_cmd.py", line 86, in initLocale
  495. Error: Result(84) replace locale.setlocale( locale.LC_ALL, '%s.%s' % (language_code, encoding) )
  496. Error: Result(85) replace File "/usr/lib/python3.8/locale.py", line 608, in setlocale
  497. Error: Result(86) replace return _setlocale(category, locale)
  498. Error: Result(87) replace locale.Error: unsupported locale setting
  499. Error: Result(88) replace
  500. Error: Result(89) replace During handling of the above exception, another exception occurred:
  501. Error: Result(90) replace
  502. Error: Result(91) replace Traceback (most recent call last):
  503. Error: Result(92) replace File "<workdir>/Examples/Client/svn_cmd.py", line 1583, in <module>
  504. Error: Result(93) replace sys.exit( main( sys.argv ) )
  505. Error: Result(94) replace File "<workdir>/Examples/Client/svn_cmd.py", line 61, in main
  506. Error: Result(95) replace initLocale()
  507. Error: Result(96) replace File "<workdir>/Examples/Client/svn_cmd.py", line 89, in initLocale
  508. Error: Result(97) replace locale.setlocale( locale.LC_ALL, 'en_GB.UTF-8' )
  509. Error: Result(98) replace File "/usr/lib/python3.8/locale.py", line 608, in setlocale
  510. Error: Result(99) replace return _setlocale(category, locale)
  511. Error: Result(100) replace locale.Error: unsupported locale setting
  512. Error: Result(101) replace ./test-04.sh: line 66: <workdir>/Tests/testroot-04/wc/file1.txt: No such file or directory
  513. Error: Result(102) replace ./test-04.sh: line 67: <workdir>/Tests/testroot-04/wc/a/file1.txt: No such file or directory
  514. Error: --------------------------------------------------------------------------------
  515. Error: Benchmark(59) replace A <workdir>/Tests/testroot-04/wc/file1.txt
  516. Error: Result(104) replace Traceback (most recent call last):
  517. Error: Result(105) replace File "<workdir>/Examples/Client/svn_cmd.py", line 86, in initLocale
  518. Error: Result(106) replace locale.setlocale( locale.LC_ALL, '%s.%s' % (language_code, encoding) )
  519. Error: Result(107) replace File "/usr/lib/python3.8/locale.py", line 608, in setlocale
  520. Error: Result(108) replace return _setlocale(category, locale)
  521. Error: Result(109) replace locale.Error: unsupported locale setting
  522. Error: Result(110) replace
  523. Error: Result(111) replace During handling of the above exception, another exception occurred:
  524. Error: Result(112) replace
  525. Error: Result(113) replace Traceback (most recent call last):
  526. Error: Result(114) replace File "<workdir>/Examples/Client/svn_cmd.py", line 1583, in <module>
  527. Error: Result(115) replace sys.exit( main( sys.argv ) )
  528. Error: Result(116) replace File "<workdir>/Examples/Client/svn_cmd.py", line 61, in main
  529. Error: Result(117) replace initLocale()
  530. Error: Result(118) replace File "<workdir>/Examples/Client/svn_cmd.py", line 89, in initLocale
  531. Error: Result(119) replace locale.setlocale( locale.LC_ALL, 'en_GB.UTF-8' )
  532. Error: Result(120) replace File "/usr/lib/python3.8/locale.py", line 608, in setlocale
  533. Error: Result(121) replace return _setlocale(category, locale)
  534. Error: Result(122) replace locale.Error: unsupported locale setting
  535. Error: --------------------------------------------------------------------------------
  536. Error: Benchmark(61) replace A <workdir>/Tests/testroot-04/wc/a/file1.txt
  537. Error: Result(124) replace Traceback (most recent call last):
  538. Error: Result(125) replace File "<workdir>/Examples/Client/svn_cmd.py", line 86, in initLocale
  539. Error: Result(126) replace locale.setlocale( locale.LC_ALL, '%s.%s' % (language_code, encoding) )
  540. Error: Result(127) replace File "/usr/lib/python3.8/locale.py", line 608, in setlocale
  541. Error: Result(128) replace return _setlocale(category, locale)
  542. Error: Result(129) replace locale.Error: unsupported locale setting
  543. Error: Result(130) replace
  544. Error: Result(131) replace During handling of the above exception, another exception occurred:
  545. Error: Result(132) replace
  546. Error: Result(133) replace Traceback (most recent call last):
  547. Error: Result(134) replace File "<workdir>/Examples/Client/svn_cmd.py", line 1583, in <module>
  548. Error: Result(135) replace sys.exit( main( sys.argv ) )
  549. Error: Result(136) replace File "<workdir>/Examples/Client/svn_cmd.py", line 61, in main
  550. Error: Result(137) replace initLocale()
  551. Error: Result(138) replace File "<workdir>/Examples/Client/svn_cmd.py", line 89, in initLocale
  552. Error: Result(139) replace locale.setlocale( locale.LC_ALL, 'en_GB.UTF-8' )
  553. Error: Result(140) replace File "/usr/lib/python3.8/locale.py", line 608, in setlocale
  554. Error: Result(141) replace return _setlocale(category, locale)
  555. Error: Result(142) replace locale.Error: unsupported locale setting
  556. Error: --------------------------------------------------------------------------------
  557. Error: Benchmark(63) replace A <workdir>/Tests/testroot-04/wc/a/file1.txt
  558. Error: Benchmark(64) replace A <workdir>/Tests/testroot-04/wc/file1.txt
  559. Error: Benchmark(65) replace commit_finalizing .
  560. Error: Benchmark(66) replace Revision 4
  561. Error: Benchmark(67) replace Info: pre_test_1.output start ------------------------------------
  562. Error: Benchmark(68) replace <PYTHON> <workdir>/Tests/test_04_commit_hook_test_1.py pre-commit <workdir>/Tests/testroot-04/repos 3-3
  563. Error: Benchmark(69) replace Info: pre-commit test 1
  564. Error: Benchmark(70) replace Info: Transaction( <workdir>/Tests/testroot-04/repos, 3-3) ...
  565. Error: Benchmark(71) replace Info: revproplist() ...
  566. Error: Benchmark(72) replace svn:author: <username>
  567. Error: Benchmark(73) replace svn:date: <numeric-date-and-time>
  568. Error: Benchmark(74) replace svn:log: Add two files
  569. Error: Benchmark(75) replace svn:txn-client-compat-version: 1.14.0
  570. Error: Benchmark(76) replace svn:txn-user-agent: SVN/1.14.0 (arch-os-string) ra_local
  571. Error: Benchmark(77) replace Info: changed() ...
  572. Error: Benchmark(78) replace trunk/test/a/file1.txt: action='A', kind=<node_kind.file>, text_mod=1, prop_mod=0
  573. Error: Benchmark(79) replace contents: 'file1 A\n'
  574. Error: Benchmark(80) replace trunk/test/file1.txt: action='A', kind=<node_kind.file>, text_mod=1, prop_mod=0
  575. Error: Benchmark(81) replace contents: 'file1 ROOT\n'
  576. Error: Benchmark(82) replace Info: changed( copy_info=True ) ...
  577. Error: Benchmark(83) replace trunk/test/a/file1.txt: action='A', kind=<node_kind.file>, text_mod=1, prop_mod=0 copyfrom_rev=0 copyfrom_path=None
  578. Error: Benchmark(84) replace contents: 'file1 A\n'
  579. Error: Benchmark(85) replace trunk/test/file1.txt: action='A', kind=<node_kind.file>, text_mod=1, prop_mod=0 copyfrom_rev=0 copyfrom_path=None
  580. Error: Benchmark(86) replace contents: 'file1 ROOT\n'
  581. Error: Benchmark(87) replace Info: list() ...
  582. Error: Benchmark(88) replace /trunk: kind=<node_kind.dir>
  583. Error: Benchmark(89) replace /trunk/test: kind=<node_kind.dir>
  584. Error: Benchmark(90) replace /trunk/test/a: kind=<node_kind.dir>
  585. Error: Benchmark(91) replace /trunk/test/a/file1.txt: kind=<node_kind.file>
  586. Error: Benchmark(92) replace /trunk/test/file1.txt: kind=<node_kind.file>
  587. Error: Benchmark(93) replace Info: pre_test_1.output end --------------------------------------
  588. Error: Benchmark(94) replace Info: post_test_1.output start -----------------------------------
  589. Error: Benchmark(95) replace <PYTHON> <workdir>/Tests/test_04_commit_hook_test_1.py post-commit <workdir>/Tests/testroot-04/repos 4 3-3 is_revision
  590. Error: Benchmark(96) replace Info: post-commit test 1
  591. Error: Benchmark(97) replace Info: Transaction( <workdir>/Tests/testroot-04/repos, 4, is_revision=True) ...
  592. Error: Benchmark(98) replace Info: revproplist() ...
  593. Error: Benchmark(99) replace svn:author: <username>
  594. Error: Benchmark(100) replace svn:date: <numeric-date-and-time>
  595. Error: Benchmark(101) replace svn:log: Add two files
  596. Error: Benchmark(102) replace Info: changed() ...
  597. Error: Benchmark(103) replace trunk/test/a/file1.txt: action='A', kind=<node_kind.file>, text_mod=1, prop_mod=0
  598. Error: Benchmark(104) replace contents: 'file1 A\n'
  599. Error: Benchmark(105) replace trunk/test/file1.txt: action='A', kind=<node_kind.file>, text_mod=1, prop_mod=0
  600. Error: Benchmark(106) replace contents: 'file1 ROOT\n'
  601. Error: Benchmark(107) replace Info: changed( copy_info=True ) ...
  602. Error: Benchmark(108) replace trunk/test/a/file1.txt: action='A', kind=<node_kind.file>, text_mod=1, prop_mod=0 copyfrom_rev=0 copyfrom_path=None
  603. Error: Benchmark(109) replace contents: 'file1 A\n'
  604. Error: Benchmark(110) replace trunk/test/file1.txt: action='A', kind=<node_kind.file>, text_mod=1, prop_mod=0 copyfrom_rev=0 copyfrom_path=None
  605. Error: Benchmark(111) replace contents: 'file1 ROOT\n'
  606. Error: Benchmark(112) replace Info: list() ...
  607. Error: Benchmark(113) replace /trunk: kind=<node_kind.dir>
  608. Error: Benchmark(114) replace /trunk/test: kind=<node_kind.dir>
  609. Error: Benchmark(115) replace /trunk/test/a: kind=<node_kind.dir>
  610. Error: Benchmark(116) replace /trunk/test/a/file1.txt: kind=<node_kind.file>
  611. Error: Benchmark(117) replace /trunk/test/file1.txt: kind=<node_kind.file>
  612. Error: Result(144) replace Traceback (most recent call last):
  613. Error: Result(145) replace File "<workdir>/Examples/Client/svn_cmd.py", line 86, in initLocale
  614. Error: Result(146) replace locale.setlocale( locale.LC_ALL, '%s.%s' % (language_code, encoding) )
  615. Error: Result(147) replace File "/usr/lib/python3.8/locale.py", line 608, in setlocale
  616. Error: Result(148) replace return _setlocale(category, locale)
  617. Error: Result(149) replace locale.Error: unsupported locale setting
  618. Error: Result(150) replace
  619. Error: Result(151) replace During handling of the above exception, another exception occurred:
  620. Error: Result(152) replace
  621. Error: Result(153) replace Traceback (most recent call last):
  622. Error: Result(154) replace File "<workdir>/Examples/Client/svn_cmd.py", line 1583, in <module>
  623. Error: Result(155) replace sys.exit( main( sys.argv ) )
  624. Error: Result(156) replace File "<workdir>/Examples/Client/svn_cmd.py", line 61, in main
  625. Error: Result(157) replace initLocale()
  626. Error: Result(158) replace File "<workdir>/Examples/Client/svn_cmd.py", line 89, in initLocale
  627. Error: Result(159) replace locale.setlocale( locale.LC_ALL, 'en_GB.UTF-8' )
  628. Error: Result(160) replace File "/usr/lib/python3.8/locale.py", line 608, in setlocale
  629. Error: Result(161) replace return _setlocale(category, locale)
  630. Error: Result(162) replace locale.Error: unsupported locale setting
  631. Error: Result(163) replace Info: pre_test_1.output start ------------------------------------
  632. Error: Result(164) replace cat: <workdir>/Tests/testroot-04/pre_test_1.output: No such file or directory
  633. Error: Result(165) replace Info: pre_test_1.output end --------------------------------------
  634. Error: Result(166) replace Info: post_test_1.output start -----------------------------------
  635. Error: Result(167) replace cat: <workdir>/Tests/testroot-04/post_test_1.output: No such file or directory
  636. Error: --------------------------------------------------------------------------------
  637. Error: Result(170) insert ./test-04.sh: line 81: <workdir>/Tests/testroot-04/wc/file1.txt: No such file or directory
  638. Error: --------------------------------------------------------------------------------
  639. Error: Benchmark(121) replace property_added <workdir>/Tests/testroot-04/wc/a/file1.txt
  640. Error: Result(172) replace Traceback (most recent call last):
  641. Error: Result(173) replace File "<workdir>/Examples/Client/svn_cmd.py", line 86, in initLocale
  642. Error: Result(174) replace locale.setlocale( locale.LC_ALL, '%s.%s' % (language_code, encoding) )
  643. Error: Result(175) replace File "/usr/lib/python3.8/locale.py", line 608, in setlocale
  644. Error: Result(176) replace return _setlocale(category, locale)
  645. Error: Result(177) replace locale.Error: unsupported locale setting
  646. Error: Result(178) replace
  647. Error: Result(179) replace During handling of the above exception, another exception occurred:
  648. Error: Result(180) replace
  649. Error: Result(181) replace Traceback (most recent call last):
  650. Error: Result(182) replace File "<workdir>/Examples/Client/svn_cmd.py", line 1583, in <module>
  651. Error: Result(183) replace sys.exit( main( sys.argv ) )
  652. Error: Result(184) replace File "<workdir>/Examples/Client/svn_cmd.py", line 61, in main
  653. Error: Result(185) replace initLocale()
  654. Error: Result(186) replace File "<workdir>/Examples/Client/svn_cmd.py", line 89, in initLocale
  655. Error: Result(187) replace locale.setlocale( locale.LC_ALL, 'en_GB.UTF-8' )
  656. Error: Result(188) replace File "/usr/lib/python3.8/locale.py", line 608, in setlocale
  657. Error: Result(189) replace return _setlocale(category, locale)
  658. Error: Result(190) replace locale.Error: unsupported locale setting
  659. Error: --------------------------------------------------------------------------------
  660. Error: Benchmark(123) replace M <workdir>/Tests/testroot-04/wc/a/file1.txt
  661. Error: Benchmark(124) replace M <workdir>/Tests/testroot-04/wc/file1.txt
  662. Error: Benchmark(125) replace commit_finalizing .
  663. Error: Benchmark(126) replace Revision 5
  664. Error: Benchmark(127) replace Info: pre_test_1.output start ------------------------------------
  665. Error: Benchmark(128) replace <PYTHON> <workdir>/Tests/test_04_commit_hook_test_1.py pre-commit <workdir>/Tests/testroot-04/repos 4-4
  666. Error: Benchmark(129) replace Info: pre-commit test 1
  667. Error: Benchmark(130) replace Info: Transaction( <workdir>/Tests/testroot-04/repos, 4-4) ...
  668. Error: Benchmark(131) replace Info: revproplist() ...
  669. Error: Benchmark(132) replace svn:author: <username>
  670. Error: Benchmark(133) replace svn:date: <numeric-date-and-time>
  671. Error: Benchmark(134) replace svn:log: Mod one file Mod one prop
  672. Error: Benchmark(135) replace svn:txn-client-compat-version: 1.14.0
  673. Error: Benchmark(136) replace svn:txn-user-agent: SVN/1.14.0 (arch-os-string) ra_local
  674. Error: Benchmark(137) replace Info: changed() ...
  675. Error: Benchmark(138) replace trunk/test/a/file1.txt: action='R', kind=<node_kind.file>, text_mod=0, prop_mod=1
  676. Error: Benchmark(139) replace svn:eol-style: native
  677. Error: Benchmark(140) replace contents: 'file1 A\n'
  678. Error: Benchmark(141) replace trunk/test/file1.txt: action='R', kind=<node_kind.file>, text_mod=1, prop_mod=0
  679. Error: Benchmark(142) replace contents: 'file1 ROOT ln 2\n'
  680. Error: Benchmark(143) replace Info: changed( copy_info=True ) ...
  681. Error: Benchmark(144) replace trunk/test/a/file1.txt: action='R', kind=<node_kind.file>, text_mod=0, prop_mod=1 copyfrom_rev=0 copyfrom_path=None
  682. Error: Benchmark(145) replace svn:eol-style: native
  683. Error: Benchmark(146) replace contents: 'file1 A\n'
  684. Error: Benchmark(147) replace trunk/test/file1.txt: action='R', kind=<node_kind.file>, text_mod=1, prop_mod=0 copyfrom_rev=0 copyfrom_path=None
  685. Error: Benchmark(148) replace contents: 'file1 ROOT ln 2\n'
  686. Error: Benchmark(149) replace Info: list() ...
  687. Error: Benchmark(150) replace /trunk: kind=<node_kind.dir>
  688. Error: Benchmark(151) replace /trunk/test: kind=<node_kind.dir>
  689. Error: Benchmark(152) replace /trunk/test/a: kind=<node_kind.dir>
  690. Error: Benchmark(153) replace /trunk/test/a/file1.txt: kind=<node_kind.file>
  691. Error: Benchmark(154) replace /trunk/test/file1.txt: kind=<node_kind.file>
  692. Error: Benchmark(155) replace Info: pre_test_1.output end --------------------------------------
  693. Error: Benchmark(156) replace Info: post_test_1.output start -----------------------------------
  694. Error: Benchmark(157) replace <PYTHON> <workdir>/Tests/test_04_commit_hook_test_1.py post-commit <workdir>/Tests/testroot-04/repos 5 4-4 is_revision
  695. Error: Benchmark(158) replace Info: post-commit test 1
  696. Error: Benchmark(159) replace Info: Transaction( <workdir>/Tests/testroot-04/repos, 5, is_revision=True) ...
  697. Error: Benchmark(160) replace Info: revproplist() ...
  698. Error: Benchmark(161) replace svn:author: <username>
  699. Error: Benchmark(162) replace svn:date: <numeric-date-and-time>
  700. Error: Benchmark(163) replace svn:log: Mod one file Mod one prop
  701. Error: Benchmark(164) replace Info: changed() ...
  702. Error: Benchmark(165) replace trunk/test/a/file1.txt: action='R', kind=<node_kind.file>, text_mod=0, prop_mod=1
  703. Error: Benchmark(166) replace svn:eol-style: native
  704. Error: Benchmark(167) replace contents: 'file1 A\n'
  705. Error: Benchmark(168) replace trunk/test/file1.txt: action='R', kind=<node_kind.file>, text_mod=1, prop_mod=0
  706. Error: Benchmark(169) replace contents: 'file1 ROOT ln 2\n'
  707. Error: Benchmark(170) replace Info: changed( copy_info=True ) ...
  708. Error: Benchmark(171) replace trunk/test/a/file1.txt: action='R', kind=<node_kind.file>, text_mod=0, prop_mod=1 copyfrom_rev=0 copyfrom_path=None
  709. Error: Benchmark(172) replace svn:eol-style: native
  710. Error: Benchmark(173) replace contents: 'file1 A\n'
  711. Error: Benchmark(174) replace trunk/test/file1.txt: action='R', kind=<node_kind.file>, text_mod=1, prop_mod=0 copyfrom_rev=0 copyfrom_path=None
  712. Error: Benchmark(175) replace contents: 'file1 ROOT ln 2\n'
  713. Error: Benchmark(176) replace Info: list() ...
  714. Error: Benchmark(177) replace /trunk: kind=<node_kind.dir>
  715. Error: Benchmark(178) replace /trunk/test: kind=<node_kind.dir>
  716. Error: Benchmark(179) replace /trunk/test/a: kind=<node_kind.dir>
  717. Error: Benchmark(180) replace /trunk/test/a/file1.txt: kind=<node_kind.file>
  718. Error: Benchmark(181) replace /trunk/test/file1.txt: kind=<node_kind.file>
  719. Error: Result(192) replace Traceback (most recent call last):
  720. Error: Result(193) replace File "<workdir>/Examples/Client/svn_cmd.py", line 86, in initLocale
  721. Error: Result(194) replace locale.setlocale( locale.LC_ALL, '%s.%s' % (language_code, encoding) )
  722. Error: Result(195) replace File "/usr/lib/python3.8/locale.py", line 608, in setlocale
  723. Error: Result(196) replace return _setlocale(category, locale)
  724. Error: Result(197) replace locale.Error: unsupported locale setting
  725. Error: Result(198) replace
  726. Error: Result(199) replace During handling of the above exception, another exception occurred:
  727. Error: Result(200) replace
  728. Error: Result(201) replace Traceback (most recent call last):
  729. Error: Result(202) replace File "<workdir>/Examples/Client/svn_cmd.py", line 1583, in <module>
  730. Error: Result(203) replace sys.exit( main( sys.argv ) )
  731. Error: Result(204) replace File "<workdir>/Examples/Client/svn_cmd.py", line 61, in main
  732. Error: Result(205) replace initLocale()
  733. Error: Result(206) replace File "<workdir>/Examples/Client/svn_cmd.py", line 89, in initLocale
  734. Error: Result(207) replace locale.setlocale( locale.LC_ALL, 'en_GB.UTF-8' )
  735. Error: Result(208) replace File "/usr/lib/python3.8/locale.py", line 608, in setlocale
  736. Error: Result(209) replace return _setlocale(category, locale)
  737. Error: Result(210) replace locale.Error: unsupported locale setting
  738. Error: Result(211) replace Info: pre_test_1.output start ------------------------------------
  739. Error: Result(212) replace cat: <workdir>/Tests/testroot-04/pre_test_1.output: No such file or directory
  740. Error: Result(213) replace Info: pre_test_1.output end --------------------------------------
  741. Error: Result(214) replace Info: post_test_1.output start -----------------------------------
  742. Error: Result(215) replace cat: <workdir>/Tests/testroot-04/post_test_1.output: No such file or directory
  743. Error: --------------------------------------------------------------------------------
  744. Error: Benchmark(185) replace D <workdir>/Tests/testroot-04/wc/a/file1.txt
  745. Error: Result(219) replace Traceback (most recent call last):
  746. Error: Result(220) replace File "<workdir>/Examples/Client/svn_cmd.py", line 86, in initLocale
  747. Error: Result(221) replace locale.setlocale( locale.LC_ALL, '%s.%s' % (language_code, encoding) )
  748. Error: Result(222) replace File "/usr/lib/python3.8/locale.py", line 608, in setlocale
  749. Error: Result(223) replace return _setlocale(category, locale)
  750. Error: Result(224) replace locale.Error: unsupported locale setting
  751. Error: Result(225) replace
  752. Error: Result(226) replace During handling of the above exception, another exception occurred:
  753. Error: Result(227) replace
  754. Error: Result(228) replace Traceback (most recent call last):
  755. Error: Result(229) replace File "<workdir>/Examples/Client/svn_cmd.py", line 1583, in <module>
  756. Error: Result(230) replace sys.exit( main( sys.argv ) )
  757. Error: Result(231) replace File "<workdir>/Examples/Client/svn_cmd.py", line 61, in main
  758. Error: Result(232) replace initLocale()
  759. Error: Result(233) replace File "<workdir>/Examples/Client/svn_cmd.py", line 89, in initLocale
  760. Error: Result(234) replace locale.setlocale( locale.LC_ALL, 'en_GB.UTF-8' )
  761. Error: Result(235) replace File "/usr/lib/python3.8/locale.py", line 608, in setlocale
  762. Error: Result(236) replace return _setlocale(category, locale)
  763. Error: Result(237) replace locale.Error: unsupported locale setting
  764. Error: --------------------------------------------------------------------------------
  765. Error: Benchmark(187) replace D <workdir>/Tests/testroot-04/wc/a/file1.txt
  766. Error: Benchmark(188) replace commit_finalizing .
  767. Error: Benchmark(189) replace Revision 6
  768. Error: Benchmark(190) replace Info: pre_test_1.output start ------------------------------------
  769. Error: Benchmark(191) replace <PYTHON> <workdir>/Tests/test_04_commit_hook_test_1.py pre-commit <workdir>/Tests/testroot-04/repos 5-5
  770. Error: Benchmark(192) replace Info: pre-commit test 1
  771. Error: Benchmark(193) replace Info: Transaction( <workdir>/Tests/testroot-04/repos, 5-5) ...
  772. Error: Benchmark(194) replace Info: revproplist() ...
  773. Error: Benchmark(195) replace svn:author: <username>
  774. Error: Benchmark(196) replace svn:date: <numeric-date-and-time>
  775. Error: Benchmark(197) replace svn:log: Delete one file
  776. Error: Benchmark(198) replace svn:txn-client-compat-version: 1.14.0
  777. Error: Benchmark(199) replace svn:txn-user-agent: SVN/1.14.0 (arch-os-string) ra_local
  778. Error: Benchmark(200) replace Info: changed() ...
  779. Error: Benchmark(201) replace trunk/test/a/file1.txt: action='D', kind=<node_kind.file>, text_mod=0, prop_mod=0
  780. Error: Benchmark(202) replace Info: changed( copy_info=True ) ...
  781. Error: Benchmark(203) replace trunk/test/a/file1.txt: action='D', kind=<node_kind.file>, text_mod=0, prop_mod=0 copyfrom_rev=0 copyfrom_path=None
  782. Error: Benchmark(204) replace Info: list() ...
  783. Error: Benchmark(205) replace /trunk: kind=<node_kind.dir>
  784. Error: Benchmark(206) replace /trunk/test: kind=<node_kind.dir>
  785. Error: Benchmark(207) replace /trunk/test/a: kind=<node_kind.dir>
  786. Error: Benchmark(208) replace /trunk/test/file1.txt: kind=<node_kind.file>
  787. Error: Benchmark(209) replace Info: pre_test_1.output end --------------------------------------
  788. Error: Benchmark(210) replace Info: post_test_1.output start -----------------------------------
  789. Error: Benchmark(211) replace <PYTHON> <workdir>/Tests/test_04_commit_hook_test_1.py post-commit <workdir>/Tests/testroot-04/repos 6 5-5 is_revision
  790. Error: Benchmark(212) replace Info: post-commit test 1
  791. Error: Benchmark(213) replace Info: Transaction( <workdir>/Tests/testroot-04/repos, 6, is_revision=True) ...
  792. Error: Benchmark(214) replace Info: revproplist() ...
  793. Error: Benchmark(215) replace svn:author: <username>
  794. Error: Benchmark(216) replace svn:date: <numeric-date-and-time>
  795. Error: Benchmark(217) replace svn:log: Delete one file
  796. Error: Benchmark(218) replace Info: changed() ...
  797. Error: Benchmark(219) replace trunk/test/a/file1.txt: action='D', kind=<node_kind.file>, text_mod=0, prop_mod=0
  798. Error: Benchmark(220) replace Info: changed( copy_info=True ) ...
  799. Error: Benchmark(221) replace trunk/test/a/file1.txt: action='D', kind=<node_kind.file>, text_mod=0, prop_mod=0 copyfrom_rev=0 copyfrom_path=None
  800. Error: Benchmark(222) replace Info: list() ...
  801. Error: Benchmark(223) replace /trunk: kind=<node_kind.dir>
  802. Error: Benchmark(224) replace /trunk/test: kind=<node_kind.dir>
  803. Error: Benchmark(225) replace /trunk/test/a: kind=<node_kind.dir>
  804. Error: Benchmark(226) replace /trunk/test/file1.txt: kind=<node_kind.file>
  805. Error: Result(239) replace Traceback (most recent call last):
  806. Error: Result(240) replace File "<workdir>/Examples/Client/svn_cmd.py", line 86, in initLocale
  807. Error: Result(241) replace locale.setlocale( locale.LC_ALL, '%s.%s' % (language_code, encoding) )
  808. Error: Result(242) replace File "/usr/lib/python3.8/locale.py", line 608, in setlocale
  809. Error: Result(243) replace return _setlocale(category, locale)
  810. Error: Result(244) replace locale.Error: unsupported locale setting
  811. Error: Result(245) replace
  812. Error: Result(246) replace During handling of the above exception, another exception occurred:
  813. Error: Result(247) replace
  814. Error: Result(248) replace Traceback (most recent call last):
  815. Error: Result(249) replace File "<workdir>/Examples/Client/svn_cmd.py", line 1583, in <module>
  816. Error: Result(250) replace sys.exit( main( sys.argv ) )
  817. Error: Result(251) replace File "<workdir>/Examples/Client/svn_cmd.py", line 61, in main
  818. Error: Result(252) replace initLocale()
  819. Error: Result(253) replace File "<workdir>/Examples/Client/svn_cmd.py", line 89, in initLocale
  820. Error: Result(254) replace locale.setlocale( locale.LC_ALL, 'en_GB.UTF-8' )
  821. Error: Result(255) replace File "/usr/lib/python3.8/locale.py", line 608, in setlocale
  822. Error: Result(256) replace return _setlocale(category, locale)
  823. Error: Result(257) replace locale.Error: unsupported locale setting
  824. Error: Result(258) replace Info: pre_test_1.output start ------------------------------------
  825. Error: Result(259) replace cat: <workdir>/Tests/testroot-04/pre_test_1.output: No such file or directory
  826. Error: Result(260) replace Info: pre_test_1.output end --------------------------------------
  827. Error: Result(261) replace Info: post_test_1.output start -----------------------------------
  828. Error: Result(262) replace cat: <workdir>/Tests/testroot-04/post_test_1.output: No such file or directory
  829. Error: --------------------------------------------------------------------------------
  830. Error: Benchmark(230) replace A <workdir>/Tests/testroot-04/wc/file1copy.txt
  831. Error: Result(266) replace Traceback (most recent call last):
  832. Error: Result(267) replace File "<workdir>/Examples/Client/svn_cmd.py", line 86, in initLocale
  833. Error: Result(268) replace locale.setlocale( locale.LC_ALL, '%s.%s' % (language_code, encoding) )
  834. Error: Result(269) replace File "/usr/lib/python3.8/locale.py", line 608, in setlocale
  835. Error: Result(270) replace return _setlocale(category, locale)
  836. Error: Result(271) replace locale.Error: unsupported locale setting
  837. Error: Result(272) replace
  838. Error: Result(273) replace During handling of the above exception, another exception occurred:
  839. Error: Result(274) replace
  840. Error: Result(275) replace Traceback (most recent call last):
  841. Error: Result(276) replace File "<workdir>/Examples/Client/svn_cmd.py", line 1583, in <module>
  842. Error: Result(277) replace sys.exit( main( sys.argv ) )
  843. Error: Result(278) replace File "<workdir>/Examples/Client/svn_cmd.py", line 61, in main
  844. Error: Result(279) replace initLocale()
  845. Error: Result(280) replace File "<workdir>/Examples/Client/svn_cmd.py", line 89, in initLocale
  846. Error: Result(281) replace locale.setlocale( locale.LC_ALL, 'en_GB.UTF-8' )
  847. Error: Result(282) replace File "/usr/lib/python3.8/locale.py", line 608, in setlocale
  848. Error: Result(283) replace return _setlocale(category, locale)
  849. Error: Result(284) replace locale.Error: unsupported locale setting
  850. Error: --------------------------------------------------------------------------------
  851. Error: Benchmark(232) replace commit_copied <workdir>/Tests/testroot-04/wc/file1copy.txt
  852. Error: Benchmark(233) replace commit_finalizing .
  853. Error: Benchmark(234) replace Revision 7
  854. Error: Benchmark(235) replace Info: pre_test_1.output start ------------------------------------
  855. Error: Benchmark(236) replace <PYTHON> <workdir>/Tests/test_04_commit_hook_test_1.py pre-commit <workdir>/Tests/testroot-04/repos 6-6
  856. Error: Benchmark(237) replace Info: pre-commit test 1
  857. Error: Benchmark(238) replace Info: Transaction( <workdir>/Tests/testroot-04/repos, 6-6) ...
  858. Error: Benchmark(239) replace Info: revproplist() ...
  859. Error: Benchmark(240) replace svn:author: <username>
  860. Error: Benchmark(241) replace svn:date: <numeric-date-and-time>
  861. Error: Benchmark(242) replace svn:log: Copy one file
  862. Error: Benchmark(243) replace svn:txn-client-compat-version: 1.14.0
  863. Error: Benchmark(244) replace svn:txn-user-agent: SVN/1.14.0 (arch-os-string) ra_local
  864. Error: Benchmark(245) replace Info: changed() ...
  865. Error: Benchmark(246) replace trunk/test/file1copy.txt: action='A', kind=<node_kind.file>, text_mod=0, prop_mod=0
  866. Error: Benchmark(247) replace contents: 'file1 ROOT ln 2\n'
  867. Error: Benchmark(248) replace Info: changed( copy_info=True ) ...
  868. Error: Benchmark(249) replace trunk/test/file1copy.txt: action='A', kind=<node_kind.file>, text_mod=0, prop_mod=0 copyfrom_rev=5 copyfrom_path='/trunk/test/file1.txt'
  869. Error: Benchmark(250) replace contents: 'file1 ROOT ln 2\n'
  870. Error: Benchmark(251) replace Info: list() ...
  871. Error: Benchmark(252) replace /trunk: kind=<node_kind.dir>
  872. Error: Benchmark(253) replace /trunk/test: kind=<node_kind.dir>
  873. Error: Benchmark(254) replace /trunk/test/a: kind=<node_kind.dir>
  874. Error: Benchmark(255) replace /trunk/test/file1.txt: kind=<node_kind.file>
  875. Error: Benchmark(256) replace /trunk/test/file1copy.txt: kind=<node_kind.file>
  876. Error: Benchmark(257) replace Info: pre_test_1.output end --------------------------------------
  877. Error: Benchmark(258) replace Info: post_test_1.output start -----------------------------------
  878. Error: Benchmark(259) replace <PYTHON> <workdir>/Tests/test_04_commit_hook_test_1.py post-commit <workdir>/Tests/testroot-04/repos 7 6-6 is_revision
  879. Error: Benchmark(260) replace Info: post-commit test 1
  880. Error: Benchmark(261) replace Info: Transaction( <workdir>/Tests/testroot-04/repos, 7, is_revision=True) ...
  881. Error: Benchmark(262) replace Info: revproplist() ...
  882. Error: Benchmark(263) replace svn:author: <username>
  883. Error: Benchmark(264) replace svn:date: <numeric-date-and-time>
  884. Error: Benchmark(265) replace svn:log: Copy one file
  885. Error: Benchmark(266) replace Info: changed() ...
  886. Error: Benchmark(267) replace trunk/test/file1copy.txt: action='A', kind=<node_kind.file>, text_mod=0, prop_mod=0
  887. Error: Benchmark(268) replace contents: 'file1 ROOT ln 2\n'
  888. Error: Benchmark(269) replace Info: changed( copy_info=True ) ...
  889. Error: Benchmark(270) replace trunk/test/file1copy.txt: action='A', kind=<node_kind.file>, text_mod=0, prop_mod=0 copyfrom_rev=5 copyfrom_path='/trunk/test/file1.txt'
  890. Error: Benchmark(271) replace contents: 'file1 ROOT ln 2\n'
  891. Error: Benchmark(272) replace Info: list() ...
  892. Error: Benchmark(273) replace /trunk: kind=<node_kind.dir>
  893. Error: Benchmark(274) replace /trunk/test: kind=<node_kind.dir>
  894. Error: Benchmark(275) replace /trunk/test/a: kind=<node_kind.dir>
  895. Error: Benchmark(276) replace /trunk/test/file1.txt: kind=<node_kind.file>
  896. Error: Benchmark(277) replace /trunk/test/file1copy.txt: kind=<node_kind.file>
  897. Error: Benchmark(278) replace Info: post_test_1.output end -------------------------------------
  898. Error: Benchmark(279) replace
  899. Error: Result(286) replace Traceback (most recent call last):
  900. Error: Result(287) replace File "<workdir>/Examples/Client/svn_cmd.py", line 86, in initLocale
  901. Error: Result(288) replace locale.setlocale( locale.LC_ALL, '%s.%s' % (language_code, encoding) )
  902. Error: Result(289) replace File "/usr/lib/python3.8/locale.py", line 608, in setlocale
  903. Error: Result(290) replace return _setlocale(category, locale)
  904. Error: Result(291) replace locale.Error: unsupported locale setting
  905. Error: Result(292) replace
  906. Error: Result(293) replace During handling of the above exception, another exception occurred:
  907. Error: Result(294) replace
  908. Error: Result(295) replace Traceback (most recent call last):
  909. Error: Result(296) replace File "<workdir>/Examples/Client/svn_cmd.py", line 1583, in <module>
  910. Error: Result(297) replace sys.exit( main( sys.argv ) )
  911. Error: Result(298) replace File "<workdir>/Examples/Client/svn_cmd.py", line 61, in main
  912. Error: Result(299) replace initLocale()
  913. Error: Result(300) replace File "<workdir>/Examples/Client/svn_cmd.py", line 89, in initLocale
  914. Error: Result(301) replace locale.setlocale( locale.LC_ALL, 'en_GB.UTF-8' )
  915. Error: Result(302) replace File "/usr/lib/python3.8/locale.py", line 608, in setlocale
  916. Error: Result(303) replace return _setlocale(category, locale)
  917. Error: Result(304) replace locale.Error: unsupported locale setting
  918. Error: Result(305) replace Info: pre_test_1.output start ------------------------------------
  919. Error: Result(306) replace cat: <workdir>/Tests/testroot-04/pre_test_1.output: No such file or directory
  920. Error: Result(307) replace Info: pre_test_1.output end --------------------------------------
  921. Error: Result(308) replace Info: post_test_1.output start -----------------------------------
  922. Error: Result(309) replace cat: <workdir>/Tests/testroot-04/post_test_1.output: No such file or directory
  923. Error: Result(310) replace Info: post_test_1.output end -------------------------------------
  924. Error: Result(311) replace
  925. Error: --------------------------------------------------------------------------------
  926. make: *** [Makefile:30: test-04.unix.new.log.clean] Error 1
  927. make: *** Waiting for unfinished jobs....
  928. make: *** [Makefile:8: test-01.unix.new.log] Error 1
  929. ==> ОШИБКА: Произошел сбой в check().
  930. Прерывание...
  931. ==> ОШИБКА: Makepkg не смог собрать python-pysvn.
  932. ==> Перезапустить сборку python-pysvn ? да/Нет [y/N]
  933. ==> ------------------------------------------------
  934. ==>
RAW Paste Data