SHARE
TWEET

arm-rpi-linux-gnueabi build for macosx

Nikolay1983 Mar 20th, 2013 92 Never
Not a member of Pastebin yet? Sign Up, it unlocks many cool features!
  1. .config
  2. [DEBUG]    ==> Executing: 'grep' '-E' '^(# |)CT_' '.config'
  3. [DEBUG]    CT_CONFIGURE_has_cvs=y
  4. [DEBUG]    CT_CONFIGURE_has_svn=y
  5. [DEBUG]    CT_MODULES=y
  6. [DEBUG]    # CT_OBSOLETE is not set
  7. [DEBUG]    CT_EXPERIMENTAL=y
  8. [DEBUG]    CT_DEBUG_CT=y
  9. [DEBUG]    # CT_DEBUG_PAUSE_STEPS is not set
  10. [DEBUG]    CT_DEBUG_CT_SAVE_STEPS=y
  11. [DEBUG]    CT_DEBUG_CT_SAVE_STEPS_GZIP=y
  12. [DEBUG]    # CT_NO_OVERIDE_LC_MESSAGES is not set
  13. [DEBUG]    # CT_DEBUG_INTERACTIVE is not set
  14. [DEBUG]    CT_LOCAL_TARBALLS_DIR=""
  15. [DEBUG]    CT_CUSTOM_LOCATION_ROOT_DIR=""
  16. [DEBUG]    CT_WORK_DIR="${CT_TOP_DIR}/.build"
  17. [DEBUG]    CT_PREFIX_DIR="/Volumes/Crosstool/${CT_TARGET}"
  18. [DEBUG]    CT_INSTALL_DIR="${CT_PREFIX_DIR}"
  19. [DEBUG]    CT_RM_RF_PREFIX_DIR=y
  20. [DEBUG]    CT_REMOVE_DOCS=y
  21. [DEBUG]    CT_INSTALL_DIR_RO=y
  22. [DEBUG]    CT_STRIP_ALL_TOOLCHAIN_EXECUTABLES=y
  23. [DEBUG]    # CT_FORBID_DOWNLOAD is not set
  24. [DEBUG]    # CT_FORCE_DOWNLOAD is not set
  25. [DEBUG]    CT_CONNECT_TIMEOUT=10
  26. [DEBUG]    # CT_ONLY_DOWNLOAD is not set
  27. [DEBUG]    # CT_USE_MIRROR is not set
  28. [DEBUG]    # CT_FORCE_EXTRACT is not set
  29. [DEBUG]    CT_OVERIDE_CONFIG_GUESS_SUB=y
  30. [DEBUG]    # CT_ONLY_EXTRACT is not set
  31. [DEBUG]    CT_PATCH_BUNDLED=y
  32. [DEBUG]    # CT_PATCH_LOCAL is not set
  33. [DEBUG]    # CT_PATCH_BUNDLED_LOCAL is not set
  34. [DEBUG]    # CT_PATCH_LOCAL_BUNDLED is not set
  35. [DEBUG]    # CT_PATCH_BUNDLED_FALLBACK_LOCAL is not set
  36. [DEBUG]    # CT_PATCH_LOCAL_FALLBACK_BUNDLED is not set
  37. [DEBUG]    # CT_PATCH_NONE is not set
  38. [DEBUG]    CT_PATCH_ORDER="bundled"
  39. [DEBUG]    CT_PARALLEL_JOBS=3
  40. [DEBUG]    CT_LOAD=0
  41. [DEBUG]    CT_USE_PIPES=y
  42. [DEBUG]    CT_EXTRA_FLAGS_FOR_HOST=""
  43. [DEBUG]    # CT_CONFIG_SHELL_SH is not set
  44. [DEBUG]    # CT_CONFIG_SHELL_ASH is not set
  45. [DEBUG]    CT_CONFIG_SHELL_BASH=y
  46. [DEBUG]    # CT_CONFIG_SHELL_CUSTOM is not set
  47. [DEBUG]    CT_CONFIG_SHELL="${bash}"
  48. [DEBUG]    # CT_LOG_ERROR is not set
  49. [DEBUG]    # CT_LOG_WARN is not set
  50. [DEBUG]    # CT_LOG_INFO is not set
  51. [DEBUG]    # CT_LOG_EXTRA is not set
  52. [DEBUG]    # CT_LOG_ALL is not set
  53. [DEBUG]    CT_LOG_DEBUG=y
  54. [DEBUG]    CT_LOG_LEVEL_MAX="DEBUG"
  55. [DEBUG]    # CT_LOG_SEE_TOOLS_WARN is not set
  56. [DEBUG]    CT_LOG_TO_FILE=y
  57. [DEBUG]    # CT_LOG_FILE_COMPRESS is not set
  58. [DEBUG]    CT_ARCH="arm"
  59. [DEBUG]    CT_ARCH_SUPPORTS_BOTH_MMU=y
  60. [DEBUG]    CT_ARCH_SUPPORTS_BOTH_ENDIAN=y
  61. [DEBUG]    CT_ARCH_SUPPORTS_32=y
  62. [DEBUG]    CT_ARCH_SUPPORTS_WITH_ARCH=y
  63. [DEBUG]    CT_ARCH_SUPPORTS_WITH_CPU=y
  64. [DEBUG]    CT_ARCH_SUPPORTS_WITH_TUNE=y
  65. [DEBUG]    CT_ARCH_SUPPORTS_WITH_FLOAT=y
  66. [DEBUG]    CT_ARCH_SUPPORTS_WITH_FPU=y
  67. [DEBUG]    CT_ARCH_SUPPORTS_SOFTFP=y
  68. [DEBUG]    CT_ARCH_DEFAULT_HAS_MMU=y
  69. [DEBUG]    CT_ARCH_DEFAULT_LE=y
  70. [DEBUG]    CT_ARCH_DEFAULT_32=y
  71. [DEBUG]    CT_ARCH_ARCH="armv6zk"
  72. [DEBUG]    CT_ARCH_CPU="arm1176jzf-s"
  73. [DEBUG]    CT_ARCH_TUNE="arm1176jzf-s"
  74. [DEBUG]    CT_ARCH_FPU="vfp"
  75. [DEBUG]    # CT_ARCH_BE is not set
  76. [DEBUG]    CT_ARCH_LE=y
  77. [DEBUG]    CT_ARCH_32=y
  78. [DEBUG]    CT_ARCH_BITNESS=32
  79. [DEBUG]    CT_ARCH_FLOAT_HW=y
  80. [DEBUG]    # CT_ARCH_FLOAT_SW is not set
  81. [DEBUG]    CT_TARGET_CFLAGS=""
  82. [DEBUG]    CT_TARGET_LDFLAGS=""
  83. [DEBUG]    # CT_ARCH_alpha is not set
  84. [DEBUG]    CT_ARCH_arm=y
  85. [DEBUG]    # CT_ARCH_avr32 is not set
  86. [DEBUG]    # CT_ARCH_blackfin is not set
  87. [DEBUG]    # CT_ARCH_m68k is not set
  88. [DEBUG]    # CT_ARCH_microblaze is not set
  89. [DEBUG]    # CT_ARCH_mips is not set
  90. [DEBUG]    # CT_ARCH_powerpc is not set
  91. [DEBUG]    # CT_ARCH_s390 is not set
  92. [DEBUG]    # CT_ARCH_sh is not set
  93. [DEBUG]    # CT_ARCH_sparc is not set
  94. [DEBUG]    # CT_ARCH_x86 is not set
  95. [DEBUG]    CT_ARCH_alpha_AVAILABLE=y
  96. [DEBUG]    CT_ARCH_arm_AVAILABLE=y
  97. [DEBUG]    CT_ARCH_avr32_AVAILABLE=y
  98. [DEBUG]    CT_ARCH_blackfin_AVAILABLE=y
  99. [DEBUG]    CT_ARCH_m68k_AVAILABLE=y
  100. [DEBUG]    CT_ARCH_microblaze_AVAILABLE=y
  101. [DEBUG]    CT_ARCH_mips_AVAILABLE=y
  102. [DEBUG]    CT_ARCH_powerpc_AVAILABLE=y
  103. [DEBUG]    CT_ARCH_s390_AVAILABLE=y
  104. [DEBUG]    CT_ARCH_sh_AVAILABLE=y
  105. [DEBUG]    CT_ARCH_sparc_AVAILABLE=y
  106. [DEBUG]    CT_ARCH_x86_AVAILABLE=y
  107. [DEBUG]    # CT_MULTILIB is not set
  108. [DEBUG]    CT_ARCH_USE_MMU=y
  109. [DEBUG]    CT_ARCH_ENDIAN="little"
  110. [DEBUG]    # CT_ARCH_FLOAT_SOFTFP is not set
  111. [DEBUG]    CT_ARCH_FLOAT="hard"
  112. [DEBUG]    CT_ARCH_ARM_MODE="arm"
  113. [DEBUG]    CT_ARCH_ARM_MODE_ARM=y
  114. [DEBUG]    # CT_ARCH_ARM_MODE_THUMB is not set
  115. [DEBUG]    # CT_ARCH_ARM_INTERWORKING is not set
  116. [DEBUG]    CT_ARCH_ARM_EABI=y
  117. [DEBUG]    CT_FORCE_SYSROOT=y
  118. [DEBUG]    CT_USE_SYSROOT=y
  119. [DEBUG]    CT_SYSROOT_NAME="sysroot"
  120. [DEBUG]    CT_SYSROOT_DIR_PREFIX=""
  121. [DEBUG]    # CT_WANTS_STATIC_LINK=y
  122. [DEBUG]    # CT_STATIC_TOOLCHAIN is not set
  123. [DEBUG]    CT_TOOLCHAIN_PKGVERSION=""
  124. [DEBUG]    CT_TOOLCHAIN_BUGURL=""
  125. [DEBUG]    CT_TARGET_VENDOR="rpi"
  126. [DEBUG]    CT_TARGET_ALIAS_SED_EXPR=""
  127. [DEBUG]    CT_TARGET_ALIAS=""
  128. [DEBUG]    # CT_NATIVE is not set
  129. [DEBUG]    CT_CROSS=y
  130. [DEBUG]    # CT_CROSS_NATIVE is not set
  131. [DEBUG]    # CT_CANADIAN is not set
  132. [DEBUG]    CT_TOOLCHAIN_TYPE="cross"
  133. [DEBUG]    CT_BUILD=""
  134. [DEBUG]    CT_BUILD_PREFIX=""
  135. [DEBUG]    CT_BUILD_SUFFIX=""
  136. [DEBUG]    # CT_TOOLCHAIN_ENABLE_NLS is not set
  137. [DEBUG]    CT_KERNEL_SUPPORTS_SHARED_LIBS=y
  138. [DEBUG]    CT_KERNEL="linux"
  139. [DEBUG]    CT_KERNEL_VERSION="3.2.32"
  140. [DEBUG]    # CT_KERNEL_bare_metal is not set
  141. [DEBUG]    CT_KERNEL_linux=y
  142. [DEBUG]    CT_KERNEL_bare_metal_AVAILABLE=y
  143. [DEBUG]    CT_KERNEL_linux_AVAILABLE=y
  144. [DEBUG]    # CT_KERNEL_V_3_6_3 is not set
  145. [DEBUG]    # CT_KERNEL_V_3_6_2 is not set
  146. [DEBUG]    # CT_KERNEL_V_3_6_1 is not set
  147. [DEBUG]    # CT_KERNEL_V_3_6 is not set
  148. [DEBUG]    # CT_KERNEL_V_3_5_7 is not set
  149. [DEBUG]    # CT_KERNEL_V_3_4_15 is not set
  150. [DEBUG]    # CT_KERNEL_V_3_3_8 is not set
  151. [DEBUG]    CT_KERNEL_V_3_2_32=y
  152. [DEBUG]    # CT_KERNEL_V_3_1_10 is not set
  153. [DEBUG]    # CT_KERNEL_V_3_0_48 is not set
  154. [DEBUG]    # CT_KERNEL_V_2_6_39_4 is not set
  155. [DEBUG]    # CT_KERNEL_V_2_6_38_8 is not set
  156. [DEBUG]    # CT_KERNEL_V_2_6_37_6 is not set
  157. [DEBUG]    # CT_KERNEL_V_2_6_36_4 is not set
  158. [DEBUG]    # CT_KERNEL_V_2_6_33_20 is not set
  159. [DEBUG]    # CT_KERNEL_V_2_6_32_60 is not set
  160. [DEBUG]    # CT_KERNEL_V_2_6_31_14 is not set
  161. [DEBUG]    # CT_KERNEL_V_2_6_27_62 is not set
  162. [DEBUG]    # CT_KERNEL_LINUX_CUSTOM is not set
  163. [DEBUG]    CT_KERNEL_mingw32_AVAILABLE=y
  164. [DEBUG]    CT_SHARED_LIBS=y
  165. [DEBUG]    CT_KERNEL_LINUX_VERBOSITY_0=y
  166. [DEBUG]    # CT_KERNEL_LINUX_VERBOSITY_1 is not set
  167. [DEBUG]    # CT_KERNEL_LINUX_VERBOSITY_2 is not set
  168. [DEBUG]    CT_KERNEL_LINUX_VERBOSE_LEVEL=0
  169. [DEBUG]    CT_KERNEL_LINUX_INSTALL_CHECK=y
  170. [DEBUG]    CT_ARCH_BINFMT_ELF=y
  171. [DEBUG]    CT_BINUTILS_V_2_22=y
  172. [DEBUG]    # CT_BINUTILS_V_2_21_53 is not set
  173. [DEBUG]    # CT_BINUTILS_V_2_21_1a is not set
  174. [DEBUG]    # CT_BINUTILS_V_2_20_1a is not set
  175. [DEBUG]    # CT_BINUTILS_V_2_19_1a is not set
  176. [DEBUG]    # CT_BINUTILS_V_2_18a is not set
  177. [DEBUG]    # CT_BINUTILS_CUSTOM is not set
  178. [DEBUG]    CT_BINUTILS_VERSION="2.22"
  179. [DEBUG]    CT_BINUTILS_2_22_or_later=y
  180. [DEBUG]    CT_BINUTILS_2_21_or_later=y
  181. [DEBUG]    CT_BINUTILS_2_20_or_later=y
  182. [DEBUG]    CT_BINUTILS_2_19_or_later=y
  183. [DEBUG]    CT_BINUTILS_2_18_or_later=y
  184. [DEBUG]    CT_BINUTILS_HAS_HASH_STYLE=y
  185. [DEBUG]    CT_BINUTILS_HAS_GOLD=y
  186. [DEBUG]    CT_BINUTILS_GOLD_SUPPORTS_ARCH=y
  187. [DEBUG]    CT_BINUTILS_HAS_PLUGINS=y
  188. [DEBUG]    CT_BINUTILS_HAS_PKGVERSION_BUGURL=y
  189. [DEBUG]    CT_BINUTILS_FORCE_LD_BFD=y
  190. [DEBUG]    CT_BINUTILS_LINKER_LD=y
  191. [DEBUG]    # CT_BINUTILS_LINKER_LD_GOLD is not set
  192. [DEBUG]    # CT_BINUTILS_LINKER_GOLD_LD is not set
  193. [DEBUG]    CT_BINUTILS_LINKERS_LIST="ld"
  194. [DEBUG]    CT_BINUTILS_LINKER_DEFAULT="bfd"
  195. [DEBUG]    # CT_BINUTILS_PLUGINS is not set
  196. [DEBUG]    CT_BINUTILS_EXTRA_CONFIG_ARRAY=""
  197. [DEBUG]    # CT_BINUTILS_FOR_TARGET is not set
  198. [DEBUG]    CT_CC="gcc"
  199. [DEBUG]    CT_CC_VERSION="linaro-4.7-2012.10"
  200. [DEBUG]    CT_CC_gcc=y
  201. [DEBUG]    CT_CC_GCC_SHOW_LINARO=y
  202. [DEBUG]    CT_CC_V_linaro_4_7_2012_10=y
  203. [DEBUG]    # CT_CC_V_4_7_2 is not set
  204. [DEBUG]    # CT_CC_V_4_7_1 is not set
  205. [DEBUG]    # CT_CC_V_4_7_0 is not set
  206. [DEBUG]    # CT_CC_V_linaro_4_6_2012_10 is not set
  207. [DEBUG]    # CT_CC_V_4_6_3 is not set
  208. [DEBUG]    # CT_CC_V_4_6_2 is not set
  209. [DEBUG]    # CT_CC_V_4_6_1 is not set
  210. [DEBUG]    # CT_CC_V_4_6_0 is not set
  211. [DEBUG]    # CT_CC_V_linaro_4_5_2012_03 is not set
  212. [DEBUG]    # CT_CC_V_4_5_3 is not set
  213. [DEBUG]    # CT_CC_V_4_5_2 is not set
  214. [DEBUG]    # CT_CC_V_4_5_1 is not set
  215. [DEBUG]    # CT_CC_V_4_5_0 is not set
  216. [DEBUG]    # CT_CC_V_linaro_4_4_2011_02_0 is not set
  217. [DEBUG]    # CT_CC_V_4_4_7 is not set
  218. [DEBUG]    # CT_CC_V_4_4_6 is not set
  219. [DEBUG]    # CT_CC_V_4_4_5 is not set
  220. [DEBUG]    # CT_CC_V_4_4_4 is not set
  221. [DEBUG]    # CT_CC_V_4_4_3 is not set
  222. [DEBUG]    # CT_CC_V_4_4_2 is not set
  223. [DEBUG]    # CT_CC_V_4_4_1 is not set
  224. [DEBUG]    # CT_CC_V_4_4_0 is not set
  225. [DEBUG]    # CT_CC_V_4_3_6 is not set
  226. [DEBUG]    # CT_CC_V_4_3_5 is not set
  227. [DEBUG]    # CT_CC_V_4_3_4 is not set
  228. [DEBUG]    # CT_CC_V_4_3_3 is not set
  229. [DEBUG]    # CT_CC_V_4_3_2 is not set
  230. [DEBUG]    # CT_CC_V_4_3_1 is not set
  231. [DEBUG]    # CT_CC_V_4_2_4 is not set
  232. [DEBUG]    # CT_CC_V_4_2_2 is not set
  233. [DEBUG]    # CT_CC_CUSTOM is not set
  234. [DEBUG]    CT_CC_GCC_4_2_or_later=y
  235. [DEBUG]    CT_CC_GCC_4_3_or_later=y
  236. [DEBUG]    CT_CC_GCC_4_4_or_later=y
  237. [DEBUG]    CT_CC_GCC_4_5_or_later=y
  238. [DEBUG]    CT_CC_GCC_4_6_or_later=y
  239. [DEBUG]    CT_CC_GCC_4_7=y
  240. [DEBUG]    CT_CC_GCC_4_7_or_later=y
  241. [DEBUG]    CT_CC_GCC_HAS_GRAPHITE=y
  242. [DEBUG]    CT_CC_GCC_HAS_LTO=y
  243. [DEBUG]    CT_CC_GCC_HAS_PKGVERSION_BUGURL=y
  244. [DEBUG]    CT_CC_GCC_HAS_BUILD_ID=y
  245. [DEBUG]    CT_CC_GCC_HAS_LNK_HASH_STYLE=y
  246. [DEBUG]    CT_CC_GCC_USE_GMP_MPFR=y
  247. [DEBUG]    CT_CC_GCC_USE_PPL_CLOOG=y
  248. [DEBUG]    CT_CC_GCC_USE_MPC=y
  249. [DEBUG]    CT_CC_GCC_HAS_LIBQUADMATH=y
  250. [DEBUG]    # CT_CC_LANG_FORTRAN is not set
  251. [DEBUG]    CT_CC_SUPPORT_CXX=y
  252. [DEBUG]    CT_CC_SUPPORT_FORTRAN=y
  253. [DEBUG]    CT_CC_SUPPORT_JAVA=y
  254. [DEBUG]    CT_CC_SUPPORT_ADA=y
  255. [DEBUG]    CT_CC_SUPPORT_OBJC=y
  256. [DEBUG]    CT_CC_SUPPORT_OBJCXX=y
  257. [DEBUG]    CT_CC_LANG_CXX=y
  258. [DEBUG]    # CT_CC_LANG_JAVA is not set
  259. [DEBUG]    # CT_CC_LANG_ADA is not set
  260. [DEBUG]    # CT_CC_LANG_OBJC is not set
  261. [DEBUG]    # CT_CC_LANG_OBJCXX is not set
  262. [DEBUG]    CT_CC_LANG_OTHERS=""
  263. [DEBUG]    CT_CC_ENABLE_CXX_FLAGS=""
  264. [DEBUG]    CT_CC_CORE_EXTRA_CONFIG_ARRAY=""
  265. [DEBUG]    CT_CC_EXTRA_CONFIG_ARRAY=""
  266. [DEBUG]    # CT_CC_STATIC_LIBSTDCXX=y
  267. [DEBUG]    # CT_CC_GCC_SYSTEM_ZLIB is not set
  268. [DEBUG]    CT_CC_GCC_USE_GRAPHITE=y
  269. [DEBUG]    CT_CC_GCC_USE_LTO=y
  270. [DEBUG]    CT_CC_GCC_ENABLE_TARGET_OPTSPACE=y
  271. [DEBUG]    # CT_CC_GCC_LIBMUDFLAP is not set
  272. [DEBUG]    # CT_CC_GCC_LIBGOMP is not set
  273. [DEBUG]    # CT_CC_GCC_LIBSSP is not set
  274. [DEBUG]    # CT_CC_GCC_LIBQUADMATH is not set
  275. [DEBUG]    CT_CC_CXA_ATEXIT=y
  276. [DEBUG]    # CT_CC_GCC_DISABLE_PCH is not set
  277. [DEBUG]    CT_CC_GCC_SJLJ_EXCEPTIONS=m
  278. [DEBUG]    CT_CC_GCC_LDBL_128=m
  279. [DEBUG]    # CT_CC_GCC_BUILD_ID is not set
  280. [DEBUG]    CT_CC_GCC_LNK_HASH_STYLE_DEFAULT=y
  281. [DEBUG]    # CT_CC_GCC_LNK_HASH_STYLE_SYSV is not set
  282. [DEBUG]    # CT_CC_GCC_LNK_HASH_STYLE_GNU is not set
  283. [DEBUG]    # CT_CC_GCC_LNK_HASH_STYLE_BOTH is not set
  284. [DEBUG]    CT_CC_GCC_LNK_HASH_STYLE=""
  285. [DEBUG]    CT_LIBC="eglibc"
  286. [DEBUG]    CT_LIBC_VERSION="2_15"
  287. [DEBUG]    CT_LIBC_eglibc=y
  288. [DEBUG]    # CT_LIBC_glibc is not set
  289. [DEBUG]    # CT_LIBC_uClibc is not set
  290. [DEBUG]    CT_LIBC_eglibc_AVAILABLE=y
  291. [DEBUG]    # CT_LIBC_EGLIBC_V_2_16 is not set
  292. [DEBUG]    CT_LIBC_EGLIBC_V_2_15=y
  293. [DEBUG]    # CT_LIBC_EGLIBC_V_2_14 is not set
  294. [DEBUG]    # CT_LIBC_EGLIBC_V_2_13 is not set
  295. [DEBUG]    # CT_LIBC_EGLIBC_V_2_12 is not set
  296. [DEBUG]    # CT_LIBC_EGLIBC_V_2_11 is not set
  297. [DEBUG]    # CT_LIBC_EGLIBC_V_2_10 is not set
  298. [DEBUG]    # CT_LIBC_EGLIBC_V_2_9 is not set
  299. [DEBUG]    # CT_LIBC_EGLIBC_V_TRUNK is not set
  300. [DEBUG]    CT_LIBC_EGLIBC_2_15_or_later=y
  301. [DEBUG]    CT_LIBC_EGLIBC_2_14_or_later=y
  302. [DEBUG]    CT_LIBC_EGLIBC_2_13_or_later=y
  303. [DEBUG]    CT_LIBC_EGLIBC_2_12_or_later=y
  304. [DEBUG]    CT_LIBC_EGLIBC_2_11_or_later=y
  305. [DEBUG]    CT_LIBC_EGLIBC_2_10_or_later=y
  306. [DEBUG]    CT_LIBC_EGLIBC_2_9_or_later=y
  307. [DEBUG]    CT_LIBC_EGLIBC_HAS_PKGVERSION_BUGURL=y
  308. [DEBUG]    CT_EGLIBC_REVISION="HEAD"
  309. [DEBUG]    # CT_EGLIBC_HTTP is not set
  310. [DEBUG]    # CT_EGLIBC_CHECKOUT is not set
  311. [DEBUG]    CT_EGLIBC_OPT_SIZE=y
  312. [DEBUG]    # CT_EGLIBC_CUSTOM_CONFIG is not set
  313. [DEBUG]    CT_LIBC_glibc_AVAILABLE=y
  314. [DEBUG]    CT_LIBC_mingw_AVAILABLE=y
  315. [DEBUG]    CT_LIBC_newlib_AVAILABLE=y
  316. [DEBUG]    CT_LIBC_none_AVAILABLE=y
  317. [DEBUG]    CT_LIBC_uClibc_AVAILABLE=y
  318. [DEBUG]    CT_LIBC_SUPPORT_THREADS_ANY=y
  319. [DEBUG]    CT_LIBC_SUPPORT_NPTL=y
  320. [DEBUG]    CT_LIBC_SUPPORT_LINUXTHREADS=y
  321. [DEBUG]    CT_THREADS="nptl"
  322. [DEBUG]    CT_THREADS_NPTL=y
  323. [DEBUG]    # CT_THREADS_LINUXTHREADS is not set
  324. [DEBUG]    CT_LIBC_XLDD=y
  325. [DEBUG]    CT_LIBC_GLIBC_MAY_FORCE_PORTS=y
  326. [DEBUG]    CT_LIBC_glibc_familly=y
  327. [DEBUG]    CT_LIBC_GLIBC_EXTRA_CONFIG_ARRAY=""
  328. [DEBUG]    CT_LIBC_GLIBC_CONFIGPARMS=""
  329. [DEBUG]    CT_LIBC_GLIBC_EXTRA_CFLAGS=""
  330. [DEBUG]    CT_LIBC_EXTRA_CC_ARGS=""
  331. [DEBUG]    # CT_LIBC_ENABLE_FORTIFIED_BUILD is not set
  332. [DEBUG]    # CT_LIBC_DISABLE_VERSIONING is not set
  333. [DEBUG]    CT_LIBC_OLDEST_ABI=""
  334. [DEBUG]    CT_LIBC_GLIBC_FORCE_UNWIND=y
  335. [DEBUG]    CT_LIBC_GLIBC_USE_PORTS=y
  336. [DEBUG]    CT_LIBC_ADDONS_LIST=""
  337. [DEBUG]    # CT_LIBC_LOCALES is not set
  338. [DEBUG]    # CT_LIBC_GLIBC_KERNEL_VERSION_NONE is not set
  339. [DEBUG]    CT_LIBC_GLIBC_KERNEL_VERSION_AS_HEADERS=y
  340. [DEBUG]    # CT_LIBC_GLIBC_KERNEL_VERSION_CHOSEN is not set
  341. [DEBUG]    CT_LIBC_GLIBC_MIN_KERNEL="3.2.32"
  342. [DEBUG]    CT_DEBUG_dmalloc=y
  343. [DEBUG]    CT_DMALLOC_V_5_5_2=y
  344. [DEBUG]    CT_DMALLOC_VERSION="5.5.2"
  345. [DEBUG]    CT_DEBUG_duma=y
  346. [DEBUG]    CT_DUMA_A=y
  347. [DEBUG]    CT_DUMA_SO=y
  348. [DEBUG]    CT_DUMA_V_2_5_15=y
  349. [DEBUG]    CT_DUMA_VERSION="2_5_15"
  350. [DEBUG]    CT_DEBUG_gdb=y
  351. [DEBUG]    CT_GDB_CROSS=y
  352. [DEBUG]    # CT_GDB_CROSS_STATIC is not set
  353. [DEBUG]    # CT_GDB_CROSS_SIM is not set
  354. [DEBUG]    CT_GDB_CROSS_PYTHON=y
  355. [DEBUG]    CT_GDB_CROSS_EXTRA_CONFIG_ARRAY=""
  356. [DEBUG]    # CT_GDB_NATIVE is not set
  357. [DEBUG]    CT_GDB_GDBSERVER=y
  358. [DEBUG]    CT_GDB_GDBSERVER_HAS_IPA_LIB=y
  359. [DEBUG]    CT_GDB_GDBSERVER_STATIC=y
  360. [DEBUG]    # CT_DEBUG_GDB_SHOW_LINARO is not set
  361. [DEBUG]    CT_GDB_V_7_4_1=y
  362. [DEBUG]    # CT_GDB_V_7_4 is not set
  363. [DEBUG]    # CT_GDB_V_7_3_1 is not set
  364. [DEBUG]    # CT_GDB_V_7_3a is not set
  365. [DEBUG]    # CT_GDB_V_7_2a is not set
  366. [DEBUG]    # CT_GDB_V_7_1a is not set
  367. [DEBUG]    # CT_GDB_V_7_0_1a is not set
  368. [DEBUG]    # CT_GDB_V_7_0a is not set
  369. [DEBUG]    # CT_GDB_V_6_8a is not set
  370. [DEBUG]    # CT_GDB_CUSTOM is not set
  371. [DEBUG]    CT_GDB_7_2_or_later=y
  372. [DEBUG]    CT_GDB_7_0_or_later=y
  373. [DEBUG]    CT_GDB_HAS_PKGVERSION_BUGURL=y
  374. [DEBUG]    CT_GDB_INSTALL_GDBINIT=y
  375. [DEBUG]    CT_GDB_VERSION="7.4.1"
  376. [DEBUG]    CT_DEBUG_ltrace=y
  377. [DEBUG]    CT_LTRACE_V_0_5_3=y
  378. [DEBUG]    # CT_LTRACE_V_0_5_2 is not set
  379. [DEBUG]    CT_LTRACE_VERSION="0.5.3"
  380. [DEBUG]    CT_LTRACE_0_5_3_or_later=y
  381. [DEBUG]    CT_DEBUG_strace=y
  382. [DEBUG]    CT_STRACE_V_4_5_20=y
  383. [DEBUG]    # CT_STRACE_V_4_5_19 is not set
  384. [DEBUG]    # CT_STRACE_V_4_5_18 is not set
  385. [DEBUG]    CT_STRACE_VERSION="4.5.20"
  386. [DEBUG]    CT_COMPLIBS_NEEDED=y
  387. [DEBUG]    CT_GMP_NEEDED=y
  388. [DEBUG]    CT_MPFR_NEEDED=y
  389. [DEBUG]    CT_PPL_NEEDED=y
  390. [DEBUG]    CT_CLOOG_NEEDED=y
  391. [DEBUG]    CT_MPC_NEEDED=y
  392. [DEBUG]    CT_COMPLIBS=y
  393. [DEBUG]    CT_GMP=y
  394. [DEBUG]    CT_MPFR=y
  395. [DEBUG]    CT_PPL=y
  396. [DEBUG]    CT_CLOOG=y
  397. [DEBUG]    CT_MPC=y
  398. [DEBUG]    CT_LIBELF_TARGET=y
  399. [DEBUG]    CT_GMP_V_5_0_2=y
  400. [DEBUG]    # CT_GMP_V_5_0_1 is not set
  401. [DEBUG]    # CT_GMP_V_4_3_2 is not set
  402. [DEBUG]    # CT_GMP_V_4_3_1 is not set
  403. [DEBUG]    # CT_GMP_V_4_3_0 is not set
  404. [DEBUG]    CT_GMP_VERSION="5.0.2"
  405. [DEBUG]    CT_MPFR_V_3_1_0=y
  406. [DEBUG]    # CT_MPFR_V_3_0_1 is not set
  407. [DEBUG]    # CT_MPFR_V_3_0_0 is not set
  408. [DEBUG]    # CT_MPFR_V_2_4_2 is not set
  409. [DEBUG]    # CT_MPFR_V_2_4_1 is not set
  410. [DEBUG]    # CT_MPFR_V_2_4_0 is not set
  411. [DEBUG]    CT_MPFR_VERSION="3.1.0"
  412. [DEBUG]    CT_PPL_V_0_11_2=y
  413. [DEBUG]    # CT_PPL_V_0_11_1 is not set
  414. [DEBUG]    # CT_PPL_V_0_11 is not set
  415. [DEBUG]    # CT_PPL_V_0_10_2 is not set
  416. [DEBUG]    CT_PPL_VERSION="0.11.2"
  417. [DEBUG]    CT_PPL_0_11=y
  418. [DEBUG]    CT_PPL_NEEDS_LIBPWL=y
  419. [DEBUG]    CT_CLOOG_V_0_15_11=y
  420. [DEBUG]    # CT_CLOOG_V_0_15_10 is not set
  421. [DEBUG]    # CT_CLOOG_V_0_15_9 is not set
  422. [DEBUG]    # CT_CLOOG_V_0_15_8 is not set
  423. [DEBUG]    # CT_CLOOG_V_0_15_7 is not set
  424. [DEBUG]    # CT_CLOOG_V_0_15_6 is not set
  425. [DEBUG]    CT_CLOOG_VERSION="0.15.11"
  426. [DEBUG]    CT_CLOOG_0_15_1x=y
  427. [DEBUG]    CT_CLOOG_NEEDS_AUTORECONF=y
  428. [DEBUG]    CT_MPC_V_0_9=y
  429. [DEBUG]    # CT_MPC_V_0_8_2 is not set
  430. [DEBUG]    # CT_MPC_V_0_8_1 is not set
  431. [DEBUG]    # CT_MPC_V_0_7 is not set
  432. [DEBUG]    CT_MPC_VERSION="0.9"
  433. [DEBUG]    CT_LIBELF_V_0_8_13=y
  434. [DEBUG]    # CT_LIBELF_V_0_8_12 is not set
  435. [DEBUG]    CT_LIBELF_VERSION="0.8.13"
  436. [DEBUG]    # CT_COMPLIBS_CHECK is not set
  437. [DEBUG]    CT_COMP_TOOLS=y
  438. [DEBUG]    CT_COMP_TOOLS_make=y
  439. [DEBUG]    CT_COMP_TOOLS_m4=y
  440. [DEBUG]    CT_COMP_TOOLS_autoconf=y
  441. [DEBUG]    CT_COMP_TOOLS_automake=y
  442. [DEBUG]    CT_COMP_TOOLS_libtool=y
  443. [DEBUG]    CT_TEST_SUITE=y
  444. [DEBUG]    CT_TEST_SUITE_GCC=y
  445.  
  446. ... some part missing because the log is too big for pastebin =-(
  447.  
  448.  
  449. [ALL  ]    arm-rpi-linux-gnueabi-gcc     rpc_tblout.c -c -std=gnu99 -fgnu89-inline -Os -U_FORTIFY_SOURCE -Wall -Winline -Wwrite-strings -fmerge-all-constants -march=armv6zk -mcpu=arm1176jzf-s -mfpu=vfp -mhard-float -mlittle-endian -mtune=arm1176jzf-s -Wstrict-prototypes        -I../include -I/Volumes/CrosstoolCompile1/crosstool-ng-1.17.0/.build/arm-rpi-linux-gnueabi/build/build-libc-final/sunrpc -I/Volumes/CrosstoolCompile1/crosstool-ng-1.17.0/.build/arm-rpi-linux-gnueabi/build/build-libc-final -I../ports/sysdeps/arm/elf -I../ports/sysdeps/unix/sysv/linux/arm/eabi/nptl -I../ports/sysdeps/unix/sysv/linux/arm/eabi -I../ports/sysdeps/unix/sysv/linux/arm/nptl -I../ports/sysdeps/unix/sysv/linux/arm -I../nptl/sysdeps/unix/sysv/linux -I../nptl/sysdeps/pthread -I../sysdeps/pthread -I../ports/sysdeps/unix/sysv/linux -I../sysdeps/unix/sysv/linux -I../sysdeps/gnu -I../sysdeps/unix/common -I../sysdeps/unix/mman -I../sysdeps/unix/inet -I../nptl/sysdeps/unix/sysv -I../ports/sysdeps/unix/sysv -I../sysdeps/unix/sysv -I../ports/sysdeps/unix/arm -I../nptl/sysdeps/unix -I../ports/sysdeps/unix -I../sysdeps/unix -I../sysdeps/posix -I../ports/sysdeps/arm/eabi -I../ports/sysdeps/arm/fpu -I../ports/sysdeps/arm/nptl -I../ports/sysdeps/arm -I../sysdeps/wordsize-32 -I../sysdeps/ieee754/flt-32 -I../sysdeps/ieee754/dbl-64 -I../sysdeps/ieee754 -I../sysdeps/generic/elf -I../sysdeps/generic -I../nptl -I../ports  -I.. -I../libio -I. -nostdinc -isystem /Volumes/CrosstoolCompile1/crosstool-ng-1.17.0/.build/arm-rpi-linux-gnueabi/buildtools/lib/gcc/arm-rpi-linux-gnueabi/4.7.3/include -isystem /Volumes/CrosstoolCompile1/crosstool-ng-1.17.0/.build/arm-rpi-linux-gnueabi/buildtools/lib/gcc/arm-rpi-linux-gnueabi/4.7.3/include-fixed -isystem /Volumes/Crosstool/arm-rpi-linux-gnueabi/arm-rpi-linux-gnueabi/sysroot/usr/include -D_LIBC_REENTRANT -include ../include/libc-symbols.h   -DNOT_IN_libc=1    -D_RPC_THREAD_SAFE_ -o /Volumes/CrosstoolCompile1/crosstool-ng-1.17.0/.build/arm-rpi-linux-gnueabi/build/build-libc-final/sunrpc/rpc_tblout.o -MD -MP -MF /Volumes/CrosstoolCompile1/crosstool-ng-1.17.0/.build/arm-rpi-linux-gnueabi/build/build-libc-final/sunrpc/rpc_tblout.o.dt -MT /Volumes/CrosstoolCompile1/crosstool-ng-1.17.0/.build/arm-rpi-linux-gnueabi/build/build-libc-final/sunrpc/rpc_tblout.o
  450. [ALL  ]    arm-rpi-linux-gnueabi-gcc     rpc_sample.c -c -std=gnu99 -fgnu89-inline -Os -U_FORTIFY_SOURCE -Wall -Winline -Wwrite-strings -fmerge-all-constants -march=armv6zk -mcpu=arm1176jzf-s -mfpu=vfp -mhard-float -mlittle-endian -mtune=arm1176jzf-s -Wstrict-prototypes        -I../include -I/Volumes/CrosstoolCompile1/crosstool-ng-1.17.0/.build/arm-rpi-linux-gnueabi/build/build-libc-final/sunrpc -I/Volumes/CrosstoolCompile1/crosstool-ng-1.17.0/.build/arm-rpi-linux-gnueabi/build/build-libc-final -I../ports/sysdeps/arm/elf -I../ports/sysdeps/unix/sysv/linux/arm/eabi/nptl -I../ports/sysdeps/unix/sysv/linux/arm/eabi -I../ports/sysdeps/unix/sysv/linux/arm/nptl -I../ports/sysdeps/unix/sysv/linux/arm -I../nptl/sysdeps/unix/sysv/linux -I../nptl/sysdeps/pthread -I../sysdeps/pthread -I../ports/sysdeps/unix/sysv/linux -I../sysdeps/unix/sysv/linux -I../sysdeps/gnu -I../sysdeps/unix/common -I../sysdeps/unix/mman -I../sysdeps/unix/inet -I../nptl/sysdeps/unix/sysv -I../ports/sysdeps/unix/sysv -I../sysdeps/unix/sysv -I../ports/sysdeps/unix/arm -I../nptl/sysdeps/unix -I../ports/sysdeps/unix -I../sysdeps/unix -I../sysdeps/posix -I../ports/sysdeps/arm/eabi -I../ports/sysdeps/arm/fpu -I../ports/sysdeps/arm/nptl -I../ports/sysdeps/arm -I../sysdeps/wordsize-32 -I../sysdeps/ieee754/flt-32 -I../sysdeps/ieee754/dbl-64 -I../sysdeps/ieee754 -I../sysdeps/generic/elf -I../sysdeps/generic -I../nptl -I../ports  -I.. -I../libio -I. -nostdinc -isystem /Volumes/CrosstoolCompile1/crosstool-ng-1.17.0/.build/arm-rpi-linux-gnueabi/buildtools/lib/gcc/arm-rpi-linux-gnueabi/4.7.3/include -isystem /Volumes/CrosstoolCompile1/crosstool-ng-1.17.0/.build/arm-rpi-linux-gnueabi/buildtools/lib/gcc/arm-rpi-linux-gnueabi/4.7.3/include-fixed -isystem /Volumes/Crosstool/arm-rpi-linux-gnueabi/arm-rpi-linux-gnueabi/sysroot/usr/include -D_LIBC_REENTRANT -include ../include/libc-symbols.h   -DNOT_IN_libc=1    -D_RPC_THREAD_SAFE_ -o /Volumes/CrosstoolCompile1/crosstool-ng-1.17.0/.build/arm-rpi-linux-gnueabi/build/build-libc-final/sunrpc/rpc_sample.o -MD -MP -MF /Volumes/CrosstoolCompile1/crosstool-ng-1.17.0/.build/arm-rpi-linux-gnueabi/build/build-libc-final/sunrpc/rpc_sample.o.dt -MT /Volumes/CrosstoolCompile1/crosstool-ng-1.17.0/.build/arm-rpi-linux-gnueabi/build/build-libc-final/sunrpc/rpc_sample.o
  451. [ALL  ]    gcc rpc_main.c -c -D_RPC_THREAD_SAFE_ -D_CROSS_RPCGEN_               -o /Volumes/CrosstoolCompile1/crosstool-ng-1.17.0/.build/arm-rpi-linux-gnueabi/build/build-libc-final/sunrpc/cross-rpc_main.o -MD -MP -MF /Volumes/CrosstoolCompile1/crosstool-ng-1.17.0/.build/arm-rpi-linux-gnueabi/build/build-libc-final/sunrpc/cross-rpc_main.o.dt -MT /Volumes/CrosstoolCompile1/crosstool-ng-1.17.0/.build/arm-rpi-linux-gnueabi/build/build-libc-final/sunrpc/cross-rpc_main.o
  452. [ALL  ]    In file included from rpc_main.c:51:
  453. [ERROR]    proto.h:61: error: expected declaration specifiers or '...' before numeric constant
  454. [ERROR]    proto.h:61: error: expected ')' before '!=' token
  455. [ERROR]    proto.h:61: error: expected ')' before '?' token
  456. [ALL  ]    rpc_main.c: In function 'h_output':
  457. [ALL  ]    rpc_main.c:654: warning: format not a string literal and no format arguments
  458. [ALL  ]    rpc_main.c:654: warning: format not a string literal and no format arguments
  459. [ERROR]    make[3]: *** [/Volumes/CrosstoolCompile1/crosstool-ng-1.17.0/.build/arm-rpi-linux-gnueabi/build/build-libc-final/sunrpc/cross-rpc_main.o] Error 1
  460. [ALL  ]    make[3]: *** Waiting for unfinished jobs....
  461. [ALL  ]    make[3]: Leaving directory `/Volumes/CrosstoolCompile1/crosstool-ng-1.17.0/.build/src/eglibc-2_15/sunrpc'
  462. [ERROR]    make[2]: *** [sunrpc/others] Error 2
  463. [ALL  ]    make[2]: Leaving directory `/Volumes/CrosstoolCompile1/crosstool-ng-1.17.0/.build/src/eglibc-2_15'
  464. [ERROR]    make[1]: *** [all] Error 2
  465. [ALL  ]    make[1]: Leaving directory `/Volumes/CrosstoolCompile1/crosstool-ng-1.17.0/.build/arm-rpi-linux-gnueabi/build/build-libc-final'
  466. [ERROR]  
  467. [ERROR]  >>
  468. [ERROR]  >>  Build failed in step 'Installing C library'
  469. [ERROR]  >>        called in step '(top-level)'
  470. [ERROR]  >>
  471. [ERROR]  >>  Error happened in: CT_DoExecLog[scripts/functions@258]
  472. [ERROR]  >>        called from: do_libc_backend_once[scripts/build/libc/glibc-eglibc.sh-common@445]
  473. [ERROR]  >>        called from: do_libc_backend[scripts/build/libc/glibc-eglibc.sh-common@143]
  474. [ERROR]  >>        called from: do_libc[scripts/build/libc/glibc-eglibc.sh-common@65]
  475. [ERROR]  >>        called from: main[scripts/crosstool-NG.sh@609]
  476. [ERROR]  >>
  477. [ERROR]  >>  For more info on this error, look at the file: 'build.log'
  478. [ERROR]  >>  There is a list of known issues, some with workarounds, in:
  479. [ERROR]  >>      '/usr/local/share/doc/crosstool-ng/ct-ng.1.17.0/B - Known issues.txt'
  480. [ERROR]  
  481. [ERROR]  (elapsed: 32:05.00)
RAW Paste Data
We use cookies for various purposes including analytics. By continuing to use Pastebin, you agree to our use of cookies as described in the Cookies Policy. OK, I Understand
 
Top