SHARE
TWEET

Untitled

a guest Jun 2nd, 2017 6 Never
Not a member of Pastebin yet? Sign Up, it unlocks many cool features!
  1. UATHelper: Packaging (Android (ETC2)): ====6/2/2017 11:41:49 AM====PERFORMING FINAL APK PACKAGE OPERATION================================================
  2. UATHelper: Packaging (Android (ETC2)): UEDeployAndroid.RunCommandLineProgramAndReturnResult: Making .apk with Ant... (note: it's safe to ignore javac obsolete warnings)
  3. UATHelper: Packaging (Android (ETC2)):     [javac] Z:\src\com\epicgames\ue4\GameActivity.java:705: error: package com.oculus.svclib does not exist
  4. UATHelper: Packaging (Android (ETC2)):     [javac]                 com.oculus.svclib.OVREntitlementChecker.doAutomatedCheck(this);
  5. UATHelper: Packaging (Android (ETC2)):     [javac]                                  ^
  6. UATHelper: Packaging (Android (ETC2)):     [javac] Note: Some input files use or override a deprecated API.
  7. UATHelper: Packaging (Android (ETC2)):     [javac] Note: Recompile with -Xlint:deprecation for details.
  8. UATHelper: Packaging (Android (ETC2)):     [javac] 1 error
  9. UATHelper: Packaging (Android (ETC2)): BUILD FAILED
  10. UATHelper: Packaging (Android (ETC2)): D:\projects\Android\android-sdk\tools\ant\build.xml:716: The following error occurred while executing this line:
  11. UATHelper: Packaging (Android (ETC2)): D:\projects\Android\android-sdk\tools\ant\build.xml:730: Compile failed; see the compiler error output for details.
  12. UATHelper: Packaging (Android (ETC2)): Total time: 14 seconds
  13. UATHelper: Packaging (Android (ETC2)): Program.Main: ERROR: AutomationTool terminated with exception: System.IO.FileNotFoundException: Could not find file 'D:\projects\Unreal Projects\GVR_PhC_Titan_08\Intermediate/Android/APK/bin/GVR_PhC_Titan_08-release.apk'.
  14. UATHelper: Packaging (Android (ETC2)): File name: 'D:\projects\Unreal Projects\GVR_PhC_Titan_08\Intermediate/Android/APK/bin/GVR_PhC_Titan_08-release.apk'
  15. UATHelper: Packaging (Android (ETC2)):    at System.IO.__Error.WinIOError(Int32 errorCode, String maybeFullPath)
  16. UATHelper: Packaging (Android (ETC2)):    at System.IO.File.InternalCopy(String sourceFileName, String destFileName, Boolean overwrite, Boolean checkHost)
  17. UATHelper: Packaging (Android (ETC2)):    at UnrealBuildTool.UEDeployAndroid.MakeApk(AndroidToolChain ToolChain, String ProjectName, String ProjectDirectory, String OutputPath, String EngineDirectory, Boolean bForDistribution, String CookFlavor, Boolean bMakeSeparateApks, Boolean bIncrementalPackage, Boolean bDisallowPackagingDataInApk, Boolean bDisallowExte
  18. rnalFilesDir)
  19. UATHelper: Packaging (Android (ETC2)):    at UnrealBuildTool.UEDeployAndroid.PrepForUATPackageOrDeploy(FileReference ProjectFile, String ProjectName, String ProjectDirectory, String ExecutablePath, String EngineDirectory, Boolean bForDistribution, String CookFlavor, Boolean bIsDataDeploy)
  20. UATHelper: Packaging (Android (ETC2)):    at AndroidPlatform.Package(ProjectParams Params, DeploymentContext SC, Int32 WorkingCL)
  21. UATHelper: Packaging (Android (ETC2)):    at Project.Package(ProjectParams Params, Int32 WorkingCL)
  22. UATHelper: Packaging (Android (ETC2)):    at BuildCookRun.DoBuildCookRun(ProjectParams Params)
  23. UATHelper: Packaging (Android (ETC2)):    at BuildCookRun.ExecuteBuild()
  24. UATHelper: Packaging (Android (ETC2)):    at AutomationTool.BuildCommand.Execute()
  25. UATHelper: Packaging (Android (ETC2)):    at AutomationTool.Automation.Execute(List`1 CommandsToExecute, CaselessDictionary`1 Commands)
  26. UATHelper: Packaging (Android (ETC2)):    at AutomationTool.Automation.Process(String[] Arguments)
  27. UATHelper: Packaging (Android (ETC2)):    at AutomationTool.Program.MainProc(Object Param)
  28. UATHelper: Packaging (Android (ETC2)):    at AutomationTool.InternalUtils.RunSingleInstance(Func`2 Main, Object Param)
  29. UATHelper: Packaging (Android (ETC2)):    at AutomationTool.Program.Main()
  30. UATHelper: Packaging (Android (ETC2)): Program.Main: AutomationTool exiting with ExitCode=1 (Error_Unknown)
  31. UATHelper: Packaging (Android (ETC2)): BUILD FAILED
  32. PackagingResults:Error: Error Unknown Error
RAW Paste Data
We use cookies for various purposes including analytics. By continuing to use Pastebin, you agree to our use of cookies as described in the Cookies Policy. OK, I Understand
 
Top