JZTech101

Untitled

Mar 25th, 2014
170
0
Never
Not a member of Pastebin yet? Sign Up, it unlocks many cool features!
text 5.67 KB | None | 0 0
  1. ./gjztech101@home ~/Documents/workspace/ThaumicTinkerer $ ./gradlew build
  2. ****************************
  3. Powered By MCP:
  4. http://mcp.ocean-labs.de/
  5. Searge, ProfMobius, Fesh0r,
  6. R4wk, ZeuX, IngisKahn
  7. MCP Data version : unknown
  8. ****************************
  9. :downloadClient SKIPPED
  10. :downloadServer SKIPPED
  11. :extractUserDev
  12. :mergeJars SKIPPED
  13. :applyBinPatches SKIPPED
  14. :downloadMcpTools UP-TO-DATE
  15. :genSrgs UP-TO-DATE
  16. :deobfBinJar UP-TO-DATE
  17. :compileApiJava UP-TO-DATE
  18. :processApiResources UP-TO-DATE
  19. :apiClasses UP-TO-DATE
  20. :sourceMainJava
  21. :compileJava
  22. warning: [options] bootstrap class path not set in conjunction with -source 1.6
  23. /home/jztech101/Documents/workspace/ThaumicTinkerer/build/sources/java/vazkii/tinkerer/common/block/tile/TileSummon.java:26: error: cannot find symbol
  24. if(tile instanceof TilePedestal && ((TilePedestal) tile).getStackInSlot(0) != null && ((TilePedestal) tile).getStackInSlot(0).getItem() instanceof ItemMobAspect){
  25. ^
  26. symbol: method getStackInSlot(int)
  27. location: class TilePedestal
  28. /home/jztech101/Documents/workspace/ThaumicTinkerer/build/sources/java/vazkii/tinkerer/common/block/tile/TileSummon.java:26: error: cannot find symbol
  29. if(tile instanceof TilePedestal && ((TilePedestal) tile).getStackInSlot(0) != null && ((TilePedestal) tile).getStackInSlot(0).getItem() instanceof ItemMobAspect){
  30. ^
  31. symbol: method getStackInSlot(int)
  32. location: class TilePedestal
  33. /home/jztech101/Documents/workspace/ThaumicTinkerer/build/sources/java/vazkii/tinkerer/common/block/tile/TileSummon.java:41: error: cannot find symbol
  34. aspects.add(ModItems.mobAspect.getAspect(ped1.getStackInSlot(0)));
  35. ^
  36. symbol: method getStackInSlot(int)
  37. location: variable ped1 of type TilePedestal
  38. /home/jztech101/Documents/workspace/ThaumicTinkerer/build/sources/java/vazkii/tinkerer/common/block/tile/TileSummon.java:43: error: cannot find symbol
  39. aspects.add(ModItems.mobAspect.getAspect(ped2.getStackInSlot(0)));
  40. ^
  41. symbol: method getStackInSlot(int)
  42. location: variable ped2 of type TilePedestal
  43. /home/jztech101/Documents/workspace/ThaumicTinkerer/build/sources/java/vazkii/tinkerer/common/block/tile/TileSummon.java:45: error: cannot find symbol
  44. aspects.add(ModItems.mobAspect.getAspect(ped3.getStackInSlot(0)));
  45. ^
  46. symbol: method getStackInSlot(int)
  47. location: variable ped3 of type TilePedestal
  48. /home/jztech101/Documents/workspace/ThaumicTinkerer/build/sources/java/vazkii/tinkerer/common/block/tile/TileSummon.java:50: error: cannot find symbol
  49. boolean isInfused=ModItems.mobAspect.isInfused(ped1.getStackInSlot(0)) &&
  50. ^
  51. symbol: method getStackInSlot(int)
  52. location: variable ped1 of type TilePedestal
  53. /home/jztech101/Documents/workspace/ThaumicTinkerer/build/sources/java/vazkii/tinkerer/common/block/tile/TileSummon.java:51: error: cannot find symbol
  54. ModItems.mobAspect.isInfused(ped2.getStackInSlot(0)) &&
  55. ^
  56. symbol: method getStackInSlot(int)
  57. location: variable ped2 of type TilePedestal
  58. /home/jztech101/Documents/workspace/ThaumicTinkerer/build/sources/java/vazkii/tinkerer/common/block/tile/TileSummon.java:52: error: cannot find symbol
  59. ModItems.mobAspect.isInfused(ped3.getStackInSlot(0));
  60. ^
  61. symbol: method getStackInSlot(int)
  62. location: variable ped3 of type TilePedestal
  63. /home/jztech101/Documents/workspace/ThaumicTinkerer/build/sources/java/vazkii/tinkerer/common/block/tile/TileSummon.java:59: error: cannot find symbol
  64. ped1.setInventorySlotContents(0, null);
  65. ^
  66. symbol: method setInventorySlotContents(int,<null>)
  67. location: variable ped1 of type TilePedestal
  68. /home/jztech101/Documents/workspace/ThaumicTinkerer/build/sources/java/vazkii/tinkerer/common/block/tile/TileSummon.java:60: error: cannot find symbol
  69. ped2.setInventorySlotContents(0, null);
  70. ^
  71. symbol: method setInventorySlotContents(int,<null>)
  72. location: variable ped2 of type TilePedestal
  73. /home/jztech101/Documents/workspace/ThaumicTinkerer/build/sources/java/vazkii/tinkerer/common/block/tile/TileSummon.java:61: error: cannot find symbol
  74. ped3.setInventorySlotContents(0, null);
  75. ^
  76. symbol: method setInventorySlotContents(int,<null>)
  77. location: variable ped3 of type TilePedestal
  78. /home/jztech101/Documents/workspace/ThaumicTinkerer/build/sources/java/vazkii/tinkerer/common/block/tile/peripheral/PeripheralDeconstructor.java:45: error: cannot find symbol
  79. case 1 : return new Object[] { deconstructor.getStackInSlot(0) != null };
  80. ^
  81. symbol: method getStackInSlot(int)
  82. location: variable deconstructor of type TileDeconstructionTable
  83. Note: Some input files use or override a deprecated API.
  84. Note: Recompile with -Xlint:deprecation for details.
  85. Note: Some input files use unchecked or unsafe operations.
  86. Note: Recompile with -Xlint:unchecked for details.
  87. 12 errors
  88. 1 warning
  89. :compileJava FAILED
  90.  
  91. FAILURE: Build failed with an exception.
  92.  
  93. * What went wrong:
  94. Execution failed for task ':compileJava'.
  95. > Compilation failed; see the compiler error output for details.
  96.  
  97. * Try:
  98. Run with --stacktrace option to get the stack trace. Run with --info or --debug option to get more log output.
  99.  
  100. BUILD FAILED
Advertisement
Add Comment
Please, Sign In to add comment