SHARE
TWEET

Untitled

a guest May 17th, 2020 10 Never
Not a member of Pastebin yet? Sign Up, it unlocks many cool features!
  1. myuser@nanopineo2:~/testa/cockroach-v20.1.0$ make clean
  2. make -C src/github.com/cockroachdb/cockroach clean
  3. make[1]: Entering directory '/home/myuser/testa/cockroach-v20.1.0/src/github.com/cockroachdb/cockroach'
  4. Running make with -j4
  5. GOPATH set to /home/myuser/testa/cockroach-v20.1.0
  6. fatal: not a git repository (or any of the parent directories): .git
  7. rm -rf /home/myuser/testa/cockroach-v20.1.0/native/aarch64-linux-gnu/cryptopp
  8. find ./pkg/sql/colexec -type f -name '*.eg.go' -exec rm {} +
  9. test -d ./pkg/sql/exec && find ./pkg/sql/exec -type f -name '*.eg.go' -exec rm {} + || true
  10. rm -rf /home/myuser/testa/cockroach-v20.1.0/native/aarch64-linux-gnu/jemalloc
  11. rm -rf /home/myuser/testa/cockroach-v20.1.0/native/aarch64-linux-gnu/protobuf
  12. rm -rf /home/myuser/testa/cockroach-v20.1.0/native/aarch64-linux-gnu/rocksdb
  13. rm -rf /home/myuser/testa/cockroach-v20.1.0/native/aarch64-linux-gnu/snappy
  14. rm -rf /home/myuser/testa/cockroach-v20.1.0/native/aarch64-linux-gnu/libroach
  15. rm -rf /home/myuser/testa/cockroach-v20.1.0/native/aarch64-linux-gnu/krb5
  16. rm -rf bin/.go_protobuf_sources bin/.gw_protobuf_sources bin/.cpp_protobuf_sources build/defs.mk*
  17. go clean  -tags ' gss make aarch64_linux_gnu' -ldflags '-X github.com/cockroachdb/cockroach/pkg/build.typ=development -extldflags ""' -i -cache github.com/cockroachdb/cockroach...
  18. warning: ignoring symlink /home/myuser/testa/cockroach-v20.1.0/src/github.com/cockroachdb/cockroach/c-deps/libedit/include/editline
  19. warning: ignoring symlink /home/myuser/testa/cockroach-v20.1.0/src/github.com/cockroachdb/cockroach/vendor/github.com/apache/arrow/python/cmake_modules
  20. find ./pkg -name node_modules -prune -o -type f \( -name 'zcgo_flags*.go' -o -name '*.test' \) -exec rm {} +
  21. for f in cockroach*; do if [ -f "$f" ]; then rm "$f"; fi; done
  22. rm -rf artifacts bin cockroach.src.tgz pkg/sql/parser/gen
  23. make[1]: Leaving directory '/home/myuser/testa/cockroach-v20.1.0/src/github.com/cockroachdb/cockroach'
  24. myuser@nanopineo2:~/testa/cockroach-v20.1.0$ make build
  25. make -C src/github.com/cockroachdb/cockroach build
  26. make[1]: Entering directory '/home/myuser/testa/cockroach-v20.1.0/src/github.com/cockroachdb/cockroach'
  27. Makefile:52: build/defs.mk: No such file or directory
  28. GOPATH set to /home/myuser/testa/cockroach-v20.1.0
  29. fatal: not a git repository (or any of the parent directories): .git
  30. Detected change in build system. Rebooting make.
  31. gitdir=$(git rev-parse --git-dir 2>/dev/null || true); \
  32. if test -n "$gitdir"; then \
  33.    git submodule update --init --recursive; \
  34. fi
  35. mkdir -p bin
  36. touch bin/.submodules-initialized
  37. go install -v ./pkg/cmd/prereqs
  38. github.com/cockroachdb/cockroach/vendor/github.com/pkg/errors
  39. github.com/cockroachdb/cockroach/pkg/testutils/buildutil
  40. github.com/cockroachdb/cockroach/pkg/cmd/prereqs
  41. github.com/cockroachdb/cockroach/vendor/golang.org/x/tools/internal/semver
  42. github.com/cockroachdb/cockroach/vendor/github.com/cockroachdb/gostdlib/x/tools/internal/semver
  43. github.com/cockroachdb/cockroach/vendor/honnef.co/go/tools/deprecated
  44. github.com/cockroachdb/cockroach/vendor/honnef.co/go/tools/arg
  45. github.com/cockroachdb/cockroach/vendor/github.com/armon/go-radix
  46. github.com/cockroachdb/cockroach/vendor/github.com/golang/dep/gps/paths
  47. github.com/cockroachdb/cockroach/vendor/github.com/cockroachdb/gostdlib/go/printer
  48. github.com/cockroachdb/cockroach/vendor/github.com/cockroachdb/crlfmt/internal/parser
  49. github.com/cockroachdb/cockroach/vendor/github.com/cockroachdb/gostdlib/x/tools/go/ast/astutil
  50. github.com/cockroachdb/cockroach/vendor/github.com/client9/misspell
  51. github.com/cockroachdb/cockroach/vendor/github.com/cockroachdb/crlfmt/internal/render
  52. github.com/cockroachdb/cockroach/vendor/github.com/cockroachdb/gostdlib/x/tools/go/internal/packagesdriver
  53. github.com/cockroachdb/cockroach/vendor/github.com/cockroachdb/gostdlib/x/tools/internal/fastwalk
  54. github.com/cockroachdb/cockroach/vendor/github.com/cockroachdb/gostdlib/x/tools/internal/gopathwalk
  55. github.com/cockroachdb/cockroach/vendor/github.com/cockroachdb/gostdlib/go/format
  56. github.com/cockroachdb/cockroach/vendor/github.com/cockroachdb/gostdlib/x/tools/internal/span
  57. github.com/cockroachdb/cockroach/vendor/golang.org/x/tools/go/internal/gcimporter
  58. github.com/cockroachdb/cockroach/vendor/github.com/cockroachdb/gostdlib/x/tools/internal/module
  59. github.com/cockroachdb/cockroach/vendor/github.com/cockroachdb/ttycolor
  60. github.com/cockroachdb/cockroach/vendor/github.com/cockroachdb/stress
  61. github.com/cockroachdb/cockroach/vendor/github.com/cockroachdb/gostdlib/cmd/gofmt
  62. github.com/cockroachdb/cockroach/vendor/github.com/client9/misspell/cmd/misspell
  63. github.com/cockroachdb/cockroach/vendor/golang.org/x/tools/go/gcexportdata
  64. github.com/cockroachdb/cockroach/vendor/github.com/cockroachdb/gostdlib/x/tools/go/packages
  65. github.com/cockroachdb/cockroach/vendor/github.com/Masterminds/semver
  66. github.com/cockroachdb/cockroach/vendor/github.com/Masterminds/vcs
  67. github.com/cockroachdb/cockroach/vendor/github.com/cockroachdb/gostdlib/x/tools/internal/imports
  68. github.com/cockroachdb/cockroach/vendor/github.com/boltdb/bolt
  69. github.com/cockroachdb/cockroach/vendor/github.com/golang/protobuf/proto
  70. github.com/cockroachdb/cockroach/vendor/github.com/golang/dep/gps/pkgtree
  71. github.com/cockroachdb/cockroach/vendor/github.com/golang/dep/internal/fs
  72. github.com/cockroachdb/cockroach/vendor/github.com/jmank88/nuts
  73. github.com/cockroachdb/cockroach/vendor/github.com/cockroachdb/gostdlib/x/tools/imports
  74. github.com/cockroachdb/cockroach/vendor/github.com/cockroachdb/gostdlib/x/tools/cmd/goimports
  75. github.com/cockroachdb/cockroach/vendor/github.com/cockroachdb/crlfmt
  76. github.com/cockroachdb/cockroach/vendor/github.com/nightlyone/lockfile
  77. github.com/cockroachdb/cockroach/vendor/github.com/sdboyer/constext
  78. github.com/cockroachdb/cockroach/vendor/golang.org/x/sync/errgroup
  79. github.com/cockroachdb/cockroach/vendor/github.com/pelletier/go-toml
  80. github.com/cockroachdb/cockroach/vendor/github.com/golang/dep/gps/internal/pb
  81. github.com/cockroachdb/cockroach/vendor/github.com/golang/dep/gps
  82. github.com/cockroachdb/cockroach/vendor/gopkg.in/yaml.v2
  83. github.com/cockroachdb/cockroach/vendor/github.com/golang/dep/internal/feedback
  84. github.com/cockroachdb/cockroach/vendor/github.com/golang/dep/gps/verify
  85. github.com/cockroachdb/cockroach/vendor/github.com/golang/glog
  86. github.com/cockroachdb/cockroach/vendor/github.com/golang/dep
  87. github.com/cockroachdb/cockroach/vendor/github.com/golang/protobuf/protoc-gen-go/descriptor
  88. github.com/cockroachdb/cockroach/vendor/github.com/golang/protobuf/ptypes/struct
  89. github.com/cockroachdb/cockroach/vendor/github.com/ghodss/yaml
  90. github.com/cockroachdb/cockroach/vendor/github.com/golang/protobuf/jsonpb
  91. github.com/cockroachdb/cockroach/vendor/github.com/golang/protobuf/protoc-gen-go/generator/internal/remap
  92. github.com/cockroachdb/cockroach/vendor/github.com/golang/protobuf/protoc-gen-go/plugin
  93. github.com/cockroachdb/cockroach/vendor/github.com/golang/dep/internal/importers/base
  94. github.com/cockroachdb/cockroach/vendor/github.com/grpc-ecosystem/grpc-gateway/utilities
  95. github.com/cockroachdb/cockroach/vendor/github.com/golang/dep/internal/importers/glide
  96. github.com/cockroachdb/cockroach/vendor/github.com/golang/dep/internal/importers/glock
  97. github.com/cockroachdb/cockroach/vendor/github.com/golang/dep/internal/importers/godep
  98. github.com/cockroachdb/cockroach/vendor/github.com/golang/dep/internal/importers/govend
  99. github.com/cockroachdb/cockroach/vendor/github.com/golang/dep/internal/importers/govendor
  100. github.com/cockroachdb/cockroach/vendor/github.com/golang/dep/internal/importers/gvt
  101. github.com/cockroachdb/cockroach/vendor/github.com/golang/dep/internal/importers/vndr
  102. github.com/cockroachdb/cockroach/vendor/github.com/grpc-ecosystem/grpc-gateway/codegenerator
  103. github.com/cockroachdb/cockroach/vendor/github.com/golang/protobuf/protoc-gen-go/generator
  104. github.com/cockroachdb/cockroach/vendor/github.com/golang/dep/internal/importers
  105. github.com/cockroachdb/cockroach/vendor/github.com/grpc-ecosystem/grpc-gateway/protoc-gen-grpc-gateway/httprule
  106. github.com/cockroachdb/cockroach/vendor/github.com/golang/dep/cmd/dep
  107. github.com/cockroachdb/cockroach/vendor/google.golang.org/genproto/googleapis/api/annotations
  108. github.com/cockroachdb/cockroach/vendor/github.com/kevinburke/go-bindata
  109. github.com/cockroachdb/cockroach/vendor/golang.org/x/tools/go/ast/astutil
  110. github.com/cockroachdb/cockroach/vendor/github.com/kevinburke/go-bindata/go-bindata
  111. github.com/cockroachdb/cockroach/vendor/golang.org/x/tools/go/buildutil
  112. github.com/cockroachdb/cockroach/vendor/github.com/grpc-ecosystem/grpc-gateway/protoc-gen-grpc-gateway/descriptor
  113. github.com/cockroachdb/cockroach/vendor/golang.org/x/tools/go/internal/cgo
  114. github.com/cockroachdb/cockroach/vendor/golang.org/x/tools/go/loader
  115. github.com/cockroachdb/cockroach/vendor/github.com/kisielk/errcheck/internal/errcheck
  116. github.com/cockroachdb/cockroach/vendor/github.com/grpc-ecosystem/grpc-gateway/protoc-gen-grpc-gateway/generator
  117. github.com/cockroachdb/cockroach/vendor/github.com/grpc-ecosystem/grpc-gateway/protoc-gen-grpc-gateway/gengateway
  118. github.com/cockroachdb/cockroach/vendor/github.com/kisielk/gotool/internal/load
  119. github.com/cockroachdb/cockroach/vendor/golang.org/x/tools/cover
  120. github.com/cockroachdb/cockroach/vendor/github.com/grpc-ecosystem/grpc-gateway/protoc-gen-grpc-gateway
  121. github.com/cockroachdb/cockroach/vendor/github.com/kisielk/gotool
  122. github.com/cockroachdb/cockroach/vendor/github.com/mattn/goveralls
  123. github.com/cockroachdb/cockroach/vendor/github.com/kisielk/errcheck
  124. github.com/cockroachdb/cockroach/vendor/github.com/mmatczuk/go_generics/globals
  125. github.com/cockroachdb/cockroach/vendor/github.com/mibk/dupl/suffixtree
  126. github.com/cockroachdb/cockroach/vendor/github.com/wadey/gocovmerge
  127. github.com/cockroachdb/cockroach/vendor/github.com/mibk/dupl/syntax
  128. github.com/cockroachdb/cockroach/vendor/github.com/mmatczuk/go_generics/cmd/go_generics
  129. github.com/cockroachdb/cockroach/vendor/github.com/mibk/dupl/syntax/golang
  130. github.com/cockroachdb/cockroach/vendor/github.com/mibk/dupl/output
  131. github.com/cockroachdb/cockroach/vendor/github.com/mibk/dupl/job
  132. github.com/cockroachdb/cockroach/vendor/github.com/mibk/dupl
  133. github.com/cockroachdb/cockroach/vendor/golang.org/x/lint
  134. github.com/cockroachdb/cockroach/vendor/golang.org/x/perf/internal/stats
  135. github.com/cockroachdb/cockroach/vendor/golang.org/x/lint/golint
  136. github.com/cockroachdb/cockroach/vendor/golang.org/x/perf/storage/benchfmt
  137. github.com/cockroachdb/cockroach/vendor/golang.org/x/tools/cmd/goyacc
  138. github.com/cockroachdb/cockroach/vendor/golang.org/x/perf/benchstat
  139. github.com/cockroachdb/cockroach/vendor/golang.org/x/perf/cmd/benchstat
  140. github.com/cockroachdb/cockroach/vendor/golang.org/x/tools/internal/fastwalk
  141. github.com/cockroachdb/cockroach/vendor/golang.org/x/tools/go/analysis
  142. github.com/cockroachdb/cockroach/vendor/golang.org/x/tools/go/internal/packagesdriver
  143. github.com/cockroachdb/cockroach/vendor/golang.org/x/tools/internal/gopathwalk
  144. github.com/cockroachdb/cockroach/vendor/golang.org/x/tools/go/ast/inspector
  145. github.com/cockroachdb/cockroach/vendor/golang.org/x/tools/go/analysis/internal/analysisflags
  146. github.com/cockroachdb/cockroach/vendor/golang.org/x/tools/go/packages
  147. github.com/cockroachdb/cockroach/vendor/golang.org/x/tools/go/analysis/passes/inspect
  148. github.com/cockroachdb/cockroach/vendor/golang.org/x/tools/go/analysis/passes/shadow
  149. github.com/cockroachdb/cockroach/vendor/golang.org/x/tools/go/types/objectpath
  150. github.com/cockroachdb/cockroach/vendor/golang.org/x/tools/cmd/stringer
  151. github.com/cockroachdb/cockroach/vendor/github.com/BurntSushi/toml
  152. github.com/cockroachdb/cockroach/vendor/golang.org/x/tools/go/analysis/internal/checker
  153. github.com/cockroachdb/cockroach/vendor/golang.org/x/tools/go/analysis/internal/facts
  154. github.com/cockroachdb/cockroach/vendor/golang.org/x/tools/go/analysis/unitchecker
  155. github.com/cockroachdb/cockroach/vendor/honnef.co/go/tools/config
  156. github.com/cockroachdb/cockroach/vendor/golang.org/x/tools/go/analysis/singlechecker
  157. github.com/cockroachdb/cockroach/vendor/golang.org/x/tools/go/types/typeutil
  158. github.com/cockroachdb/cockroach/vendor/golang.org/x/tools/go/analysis/passes/shadow/cmd/shadow
  159. github.com/cockroachdb/cockroach/vendor/honnef.co/go/tools/ssa
  160. github.com/cockroachdb/cockroach/vendor/honnef.co/go/tools/functions
  161. github.com/cockroachdb/cockroach/vendor/honnef.co/go/tools/internal/passes/buildssa
  162. github.com/cockroachdb/cockroach/vendor/honnef.co/go/tools/internal/renameio
  163. github.com/cockroachdb/cockroach/vendor/honnef.co/go/tools/facts
  164. github.com/cockroachdb/cockroach/vendor/honnef.co/go/tools/internal/cache
  165. github.com/cockroachdb/cockroach/vendor/honnef.co/go/tools/loader
  166. github.com/cockroachdb/cockroach/vendor/honnef.co/go/tools/version
  167. github.com/cockroachdb/cockroach/vendor/honnef.co/go/tools/lint
  168. github.com/cockroachdb/cockroach/vendor/honnef.co/go/tools/printf
  169. github.com/cockroachdb/cockroach/vendor/honnef.co/go/tools/ssautil
  170. github.com/cockroachdb/cockroach/vendor/honnef.co/go/tools/go/types/typeutil
  171. github.com/cockroachdb/cockroach/vendor/honnef.co/go/tools/lint/lintutil/format
  172. github.com/cockroachdb/cockroach/vendor/honnef.co/go/tools/lint/lintdsl
  173. github.com/cockroachdb/cockroach/vendor/honnef.co/go/tools/staticcheck/vrp
  174. github.com/cockroachdb/cockroach/vendor/honnef.co/go/tools/lint/lintutil
  175. github.com/cockroachdb/cockroach/vendor/honnef.co/go/tools/internal/sharedcheck
  176. github.com/cockroachdb/cockroach/vendor/honnef.co/go/tools/unused
  177. github.com/cockroachdb/cockroach/vendor/honnef.co/go/tools/simple
  178. github.com/cockroachdb/cockroach/vendor/honnef.co/go/tools/stylecheck
  179. github.com/cockroachdb/cockroach/vendor/honnef.co/go/tools/staticcheck
  180. github.com/cockroachdb/cockroach/vendor/honnef.co/go/tools/cmd/staticcheck
  181. touch bin/.bootstrap
  182. mkdir -p pkg/sql/parser/gen
  183. set -euo pipefail; \
  184. awk '/func.*sqlSymUnion/ {print $(NF - 1)}' pkg/sql/parser/sql.y | \
  185. sed -e 's/[]\/$*.^|[]/\\&/g' | \
  186. sed -e "s/^/s_(type|token) <(/" | \
  187. awk '{print $0")>_\\1 <union> /* <\\2> */_"}' > pkg/sql/parser/gen/types_regex.tmp; \
  188. sed -E -f pkg/sql/parser/gen/types_regex.tmp < pkg/sql/parser/sql.y | \
  189. awk -f pkg/sql/parser/replace_help_rules.awk | \
  190. sed -Ee 's,//.*$,,g;s,/[*]([^*]|[*][^/])*[*]/, ,g;s/ +$//g' > pkg/sql/parser/gen/sql-gen.y.tmp || rm pkg/sql/parser/gen/sql-gen.y.tmp
  191. mv -f pkg/sql/parser/gen/sql-gen.y.tmp pkg/sql/parser/gen/sql-gen.y
  192. rm pkg/sql/parser/gen/types_regex.tmp
  193. set -euo pipefail; \
  194.   ret=$(cd pkg/sql/parser/gen && goyacc -p sql -o sql.go.tmp sql-gen.y); \
  195.   if expr "$ret" : ".*conflicts" >/dev/null; then \
  196.     echo "$ret"; exit 1; \
  197.   fi
  198. (echo "// Code generated by goyacc. DO NOT EDIT."; \
  199.  echo "// GENERATED FILE DO NOT EDIT"; \
  200.  cat pkg/sql/parser/gen/sql.go.tmp | \
  201.  sed -E 's/^const ([A-Z][_A-Z0-9]*) =.*$/const \1 = lex.\1/g') > pkg/sql/parser/sql.go.tmp || rm pkg/sql/parser/sql.go.tmp
  202. mv -f pkg/sql/parser/sql.go.tmp pkg/sql/parser/sql.go
  203. goimports -w pkg/sql/parser/sql.go
  204. mv -f pkg/sql/parser/helpmap_test.go.tmp pkg/sql/parser/helpmap_test.go
  205. gofmt -s -w pkg/sql/parser/helpmap_test.go
  206. (echo "// Code generated by make. DO NOT EDIT."; \
  207.  echo "// GENERATED FILE DO NOT EDIT"; \
  208.  echo; \
  209.  echo "package lex"; \
  210.  echo; \
  211.  grep '^const [A-Z][_A-Z0-9]* ' pkg/sql/parser/gen/sql.go.tmp) > pkg/sql/lex/tokens.go.tmp || rm pkg/sql/lex/tokens.go.tmp
  212. mv -f pkg/sql/lex/tokens.go.tmp pkg/sql/lex/tokens.go
  213. rm -rf /home/myuser/testa/cockroach-v20.1.0/native//protobuf
  214. mkdir -p /home/myuser/testa/cockroach-v20.1.0/native//protobuf
  215. cd /home/myuser/testa/cockroach-v20.1.0/native//protobuf && cmake -DCMAKE_TARGET_MESSAGES=OFF   -Dprotobuf_BUILD_TESTS=OFF /home/myuser/testa/cockroach-v20.1.0/src/github.com/cockroachdb/cockroach/c-deps/protobuf/cmake \
  216.   -DCMAKE_BUILD_TYPE=Release
  217. -- The C compiler identification is GNU 7.5.0
  218. -- The CXX compiler identification is GNU 7.5.0
  219. -- Check for working C compiler: /usr/bin/cc
  220. -- Check for working C compiler: /usr/bin/cc -- works
  221. -- Detecting C compiler ABI info
  222. -- Detecting C compiler ABI info - done
  223. -- Detecting C compile features
  224. -- Detecting C compile features - done
  225. -- Check for working CXX compiler: /usr/bin/c++
  226. -- Check for working CXX compiler: /usr/bin/c++ -- works
  227. -- Detecting CXX compiler ABI info
  228. -- Detecting CXX compiler ABI info - done
  229. -- Detecting CXX compile features
  230. -- Detecting CXX compile features - done
  231. -- Looking for pthread.h
  232. -- Looking for pthread.h - found
  233. -- Looking for pthread_create
  234. -- Looking for pthread_create - not found
  235. -- Looking for pthread_create in pthreads
  236. -- Looking for pthread_create in pthreads - not found
  237. -- Looking for pthread_create in pthread
  238. -- Looking for pthread_create in pthread - found
  239. -- Found Threads: TRUE  
  240. -- Could NOT find ZLIB (missing: ZLIB_LIBRARY ZLIB_INCLUDE_DIR)
  241. -- Configuring done
  242. -- Generating done
  243. -- Build files have been written to: /home/myuser/testa/cockroach-v20.1.0/native/protobuf
  244. go install -v uptodate
  245. bin/prereqs ./pkg/cmd/uptodate > bin/uptodate.d.tmp
  246. mv -f bin/uptodate.d.tmp bin/uptodate.d
  247. github.com/cockroachdb/cockroach/vendor/github.com/MichaelTJones/walk
  248. github.com/cockroachdb/cockroach/vendor/github.com/spf13/pflag
  249. github.com/cockroachdb/cockroach/pkg/cmd/uptodate
  250. Scanning dependencies of target libprotobuf
  251. [  0%] Building CXX object CMakeFiles/libprotobuf.dir/home/myuser/testa/cockroach-v20.1.0/src/github.com/cockroachdb/cockroach/c-deps/protobuf/src/google/protobuf/arena.cc.o
  252. [  2%] Building CXX object CMakeFiles/libprotobuf.dir/home/myuser/testa/cockroach-v20.1.0/src/github.com/cockroachdb/cockroach/c-deps/protobuf/src/google/protobuf/arenastring.cc.o
  253. [  2%] Building CXX object CMakeFiles/libprotobuf.dir/home/myuser/testa/cockroach-v20.1.0/src/github.com/cockroachdb/cockroach/c-deps/protobuf/src/google/protobuf/extension_set.cc.o
  254. [  4%] Building CXX object CMakeFiles/libprotobuf.dir/home/myuser/testa/cockroach-v20.1.0/src/github.com/cockroachdb/cockroach/c-deps/protobuf/src/google/protobuf/generated_message_table_driven_lite.cc.o
  255. [  4%] Building CXX object CMakeFiles/libprotobuf.dir/home/myuser/testa/cockroach-v20.1.0/src/github.com/cockroachdb/cockroach/c-deps/protobuf/src/google/protobuf/generated_message_util.cc.o
  256. [  7%] Building CXX object CMakeFiles/libprotobuf.dir/home/myuser/testa/cockroach-v20.1.0/src/github.com/cockroachdb/cockroach/c-deps/protobuf/src/google/protobuf/implicit_weak_message.cc.o
  257. [  7%] Building CXX object CMakeFiles/libprotobuf.dir/home/myuser/testa/cockroach-v20.1.0/src/github.com/cockroachdb/cockroach/c-deps/protobuf/src/google/protobuf/io/coded_stream.cc.o
  258. [  9%] Building CXX object CMakeFiles/libprotobuf.dir/home/myuser/testa/cockroach-v20.1.0/src/github.com/cockroachdb/cockroach/c-deps/protobuf/src/google/protobuf/io/zero_copy_stream.cc.o
  259. [  9%] Building CXX object CMakeFiles/libprotobuf.dir/home/myuser/testa/cockroach-v20.1.0/src/github.com/cockroachdb/cockroach/c-deps/protobuf/src/google/protobuf/io/zero_copy_stream_impl_lite.cc.o
  260. [ 12%] Building CXX object CMakeFiles/libprotobuf.dir/home/myuser/testa/cockroach-v20.1.0/src/github.com/cockroachdb/cockroach/c-deps/protobuf/src/google/protobuf/message_lite.cc.o
  261. [ 12%] Building CXX object CMakeFiles/libprotobuf.dir/home/myuser/testa/cockroach-v20.1.0/src/github.com/cockroachdb/cockroach/c-deps/protobuf/src/google/protobuf/repeated_field.cc.o
  262. [ 14%] Building CXX object CMakeFiles/libprotobuf.dir/home/myuser/testa/cockroach-v20.1.0/src/github.com/cockroachdb/cockroach/c-deps/protobuf/src/google/protobuf/stubs/bytestream.cc.o
  263. [ 14%] Building CXX object CMakeFiles/libprotobuf.dir/home/myuser/testa/cockroach-v20.1.0/src/github.com/cockroachdb/cockroach/c-deps/protobuf/src/google/protobuf/stubs/common.cc.o
  264. [ 17%] Building CXX object CMakeFiles/libprotobuf.dir/home/myuser/testa/cockroach-v20.1.0/src/github.com/cockroachdb/cockroach/c-deps/protobuf/src/google/protobuf/stubs/int128.cc.o
  265. [ 17%] Building CXX object CMakeFiles/libprotobuf.dir/home/myuser/testa/cockroach-v20.1.0/src/github.com/cockroachdb/cockroach/c-deps/protobuf/src/google/protobuf/stubs/io_win32.cc.o
  266. [ 19%] Building CXX object CMakeFiles/libprotobuf.dir/home/myuser/testa/cockroach-v20.1.0/src/github.com/cockroachdb/cockroach/c-deps/protobuf/src/google/protobuf/stubs/status.cc.o
  267. [ 19%] Building CXX object CMakeFiles/libprotobuf.dir/home/myuser/testa/cockroach-v20.1.0/src/github.com/cockroachdb/cockroach/c-deps/protobuf/src/google/protobuf/stubs/statusor.cc.o
  268. [ 21%] Building CXX object CMakeFiles/libprotobuf.dir/home/myuser/testa/cockroach-v20.1.0/src/github.com/cockroachdb/cockroach/c-deps/protobuf/src/google/protobuf/stubs/stringpiece.cc.o
  269. [ 21%] Building CXX object CMakeFiles/libprotobuf.dir/home/myuser/testa/cockroach-v20.1.0/src/github.com/cockroachdb/cockroach/c-deps/protobuf/src/google/protobuf/stubs/stringprintf.cc.o
  270. [ 24%] Building CXX object CMakeFiles/libprotobuf.dir/home/myuser/testa/cockroach-v20.1.0/src/github.com/cockroachdb/cockroach/c-deps/protobuf/src/google/protobuf/stubs/structurally_valid.cc.o
  271. [ 24%] Building CXX object CMakeFiles/libprotobuf.dir/home/myuser/testa/cockroach-v20.1.0/src/github.com/cockroachdb/cockroach/c-deps/protobuf/src/google/protobuf/stubs/strutil.cc.o
  272. [ 26%] Building CXX object CMakeFiles/libprotobuf.dir/home/myuser/testa/cockroach-v20.1.0/src/github.com/cockroachdb/cockroach/c-deps/protobuf/src/google/protobuf/stubs/time.cc.o
  273. [ 29%] Building CXX object CMakeFiles/libprotobuf.dir/home/myuser/testa/cockroach-v20.1.0/src/github.com/cockroachdb/cockroach/c-deps/protobuf/src/google/protobuf/wire_format_lite.cc.o
  274. [ 29%] Building CXX object CMakeFiles/libprotobuf.dir/home/myuser/testa/cockroach-v20.1.0/src/github.com/cockroachdb/cockroach/c-deps/protobuf/src/google/protobuf/any.cc.o
  275. [ 31%] Building CXX object CMakeFiles/libprotobuf.dir/home/myuser/testa/cockroach-v20.1.0/src/github.com/cockroachdb/cockroach/c-deps/protobuf/src/google/protobuf/any.pb.cc.o
  276. [ 31%] Building CXX object CMakeFiles/libprotobuf.dir/home/myuser/testa/cockroach-v20.1.0/src/github.com/cockroachdb/cockroach/c-deps/protobuf/src/google/protobuf/api.pb.cc.o
  277. [ 34%] Building CXX object CMakeFiles/libprotobuf.dir/home/myuser/testa/cockroach-v20.1.0/src/github.com/cockroachdb/cockroach/c-deps/protobuf/src/google/protobuf/compiler/importer.cc.o
  278. [ 34%] Building CXX object CMakeFiles/libprotobuf.dir/home/myuser/testa/cockroach-v20.1.0/src/github.com/cockroachdb/cockroach/c-deps/protobuf/src/google/protobuf/compiler/parser.cc.o
  279. [ 36%] Building CXX object CMakeFiles/libprotobuf.dir/home/myuser/testa/cockroach-v20.1.0/src/github.com/cockroachdb/cockroach/c-deps/protobuf/src/google/protobuf/descriptor.cc.o
  280. [ 36%] Building CXX object CMakeFiles/libprotobuf.dir/home/myuser/testa/cockroach-v20.1.0/src/github.com/cockroachdb/cockroach/c-deps/protobuf/src/google/protobuf/descriptor.pb.cc.o
  281. [ 39%] Building CXX object CMakeFiles/libprotobuf.dir/home/myuser/testa/cockroach-v20.1.0/src/github.com/cockroachdb/cockroach/c-deps/protobuf/src/google/protobuf/descriptor_database.cc.o
  282. [ 39%] Building CXX object CMakeFiles/libprotobuf.dir/home/myuser/testa/cockroach-v20.1.0/src/github.com/cockroachdb/cockroach/c-deps/protobuf/src/google/protobuf/duration.pb.cc.o
  283. [ 41%] Building CXX object CMakeFiles/libprotobuf.dir/home/myuser/testa/cockroach-v20.1.0/src/github.com/cockroachdb/cockroach/c-deps/protobuf/src/google/protobuf/dynamic_message.cc.o
  284. [ 41%] Building CXX object CMakeFiles/libprotobuf.dir/home/myuser/testa/cockroach-v20.1.0/src/github.com/cockroachdb/cockroach/c-deps/protobuf/src/google/protobuf/empty.pb.cc.o
  285. [ 43%] Building CXX object CMakeFiles/libprotobuf.dir/home/myuser/testa/cockroach-v20.1.0/src/github.com/cockroachdb/cockroach/c-deps/protobuf/src/google/protobuf/extension_set_heavy.cc.o
  286. [ 43%] Building CXX object CMakeFiles/libprotobuf.dir/home/myuser/testa/cockroach-v20.1.0/src/github.com/cockroachdb/cockroach/c-deps/protobuf/src/google/protobuf/field_mask.pb.cc.o
  287. [ 46%] Building CXX object CMakeFiles/libprotobuf.dir/home/myuser/testa/cockroach-v20.1.0/src/github.com/cockroachdb/cockroach/c-deps/protobuf/src/google/protobuf/generated_message_reflection.cc.o
  288. [ 46%] Building CXX object CMakeFiles/libprotobuf.dir/home/myuser/testa/cockroach-v20.1.0/src/github.com/cockroachdb/cockroach/c-deps/protobuf/src/google/protobuf/generated_message_table_driven.cc.o
  289. [ 48%] Building CXX object CMakeFiles/libprotobuf.dir/home/myuser/testa/cockroach-v20.1.0/src/github.com/cockroachdb/cockroach/c-deps/protobuf/src/google/protobuf/io/gzip_stream.cc.o
  290. [ 48%] Building CXX object CMakeFiles/libprotobuf.dir/home/myuser/testa/cockroach-v20.1.0/src/github.com/cockroachdb/cockroach/c-deps/protobuf/src/google/protobuf/io/printer.cc.o
  291. [ 51%] Building CXX object CMakeFiles/libprotobuf.dir/home/myuser/testa/cockroach-v20.1.0/src/github.com/cockroachdb/cockroach/c-deps/protobuf/src/google/protobuf/io/strtod.cc.o
  292. [ 51%] Building CXX object CMakeFiles/libprotobuf.dir/home/myuser/testa/cockroach-v20.1.0/src/github.com/cockroachdb/cockroach/c-deps/protobuf/src/google/protobuf/io/tokenizer.cc.o
  293. [ 53%] Building CXX object CMakeFiles/libprotobuf.dir/home/myuser/testa/cockroach-v20.1.0/src/github.com/cockroachdb/cockroach/c-deps/protobuf/src/google/protobuf/io/zero_copy_stream_impl.cc.o
  294. [ 53%] Building CXX object CMakeFiles/libprotobuf.dir/home/myuser/testa/cockroach-v20.1.0/src/github.com/cockroachdb/cockroach/c-deps/protobuf/src/google/protobuf/map_field.cc.o
  295. [ 56%] Building CXX object CMakeFiles/libprotobuf.dir/home/myuser/testa/cockroach-v20.1.0/src/github.com/cockroachdb/cockroach/c-deps/protobuf/src/google/protobuf/message.cc.o
  296. [ 58%] Building CXX object CMakeFiles/libprotobuf.dir/home/myuser/testa/cockroach-v20.1.0/src/github.com/cockroachdb/cockroach/c-deps/protobuf/src/google/protobuf/reflection_ops.cc.o
  297. [ 58%] Building CXX object CMakeFiles/libprotobuf.dir/home/myuser/testa/cockroach-v20.1.0/src/github.com/cockroachdb/cockroach/c-deps/protobuf/src/google/protobuf/service.cc.o
  298. [ 60%] Building CXX object CMakeFiles/libprotobuf.dir/home/myuser/testa/cockroach-v20.1.0/src/github.com/cockroachdb/cockroach/c-deps/protobuf/src/google/protobuf/source_context.pb.cc.o
  299. [ 60%] Building CXX object CMakeFiles/libprotobuf.dir/home/myuser/testa/cockroach-v20.1.0/src/github.com/cockroachdb/cockroach/c-deps/protobuf/src/google/protobuf/struct.pb.cc.o
  300. [ 63%] Building CXX object CMakeFiles/libprotobuf.dir/home/myuser/testa/cockroach-v20.1.0/src/github.com/cockroachdb/cockroach/c-deps/protobuf/src/google/protobuf/stubs/mathlimits.cc.o
  301. [ 63%] Building CXX object CMakeFiles/libprotobuf.dir/home/myuser/testa/cockroach-v20.1.0/src/github.com/cockroachdb/cockroach/c-deps/protobuf/src/google/protobuf/stubs/substitute.cc.o
  302. [ 65%] Building CXX object CMakeFiles/libprotobuf.dir/home/myuser/testa/cockroach-v20.1.0/src/github.com/cockroachdb/cockroach/c-deps/protobuf/src/google/protobuf/text_format.cc.o
  303. [ 65%] Building CXX object CMakeFiles/libprotobuf.dir/home/myuser/testa/cockroach-v20.1.0/src/github.com/cockroachdb/cockroach/c-deps/protobuf/src/google/protobuf/timestamp.pb.cc.o
  304. [ 68%] Building CXX object CMakeFiles/libprotobuf.dir/home/myuser/testa/cockroach-v20.1.0/src/github.com/cockroachdb/cockroach/c-deps/protobuf/src/google/protobuf/type.pb.cc.o
  305. [ 68%] Building CXX object CMakeFiles/libprotobuf.dir/home/myuser/testa/cockroach-v20.1.0/src/github.com/cockroachdb/cockroach/c-deps/protobuf/src/google/protobuf/unknown_field_set.cc.o
  306. [ 70%] Building CXX object CMakeFiles/libprotobuf.dir/home/myuser/testa/cockroach-v20.1.0/src/github.com/cockroachdb/cockroach/c-deps/protobuf/src/google/protobuf/util/delimited_message_util.cc.o
  307. [ 70%] Building CXX object CMakeFiles/libprotobuf.dir/home/myuser/testa/cockroach-v20.1.0/src/github.com/cockroachdb/cockroach/c-deps/protobuf/src/google/protobuf/util/field_comparator.cc.o
  308. [ 73%] Building CXX object CMakeFiles/libprotobuf.dir/home/myuser/testa/cockroach-v20.1.0/src/github.com/cockroachdb/cockroach/c-deps/protobuf/src/google/protobuf/util/field_mask_util.cc.o
  309. [ 73%] Building CXX object CMakeFiles/libprotobuf.dir/home/myuser/testa/cockroach-v20.1.0/src/github.com/cockroachdb/cockroach/c-deps/protobuf/src/google/protobuf/util/internal/datapiece.cc.o
  310. [ 75%] Building CXX object CMakeFiles/libprotobuf.dir/home/myuser/testa/cockroach-v20.1.0/src/github.com/cockroachdb/cockroach/c-deps/protobuf/src/google/protobuf/util/internal/default_value_objectwriter.cc.o
  311. [ 75%] Building CXX object CMakeFiles/libprotobuf.dir/home/myuser/testa/cockroach-v20.1.0/src/github.com/cockroachdb/cockroach/c-deps/protobuf/src/google/protobuf/util/internal/error_listener.cc.o
  312. [ 78%] Building CXX object CMakeFiles/libprotobuf.dir/home/myuser/testa/cockroach-v20.1.0/src/github.com/cockroachdb/cockroach/c-deps/protobuf/src/google/protobuf/util/internal/field_mask_utility.cc.o
  313. [ 78%] Building CXX object CMakeFiles/libprotobuf.dir/home/myuser/testa/cockroach-v20.1.0/src/github.com/cockroachdb/cockroach/c-deps/protobuf/src/google/protobuf/util/internal/json_escaping.cc.o
  314. [ 80%] Building CXX object CMakeFiles/libprotobuf.dir/home/myuser/testa/cockroach-v20.1.0/src/github.com/cockroachdb/cockroach/c-deps/protobuf/src/google/protobuf/util/internal/json_objectwriter.cc.o
  315. [ 80%] Building CXX object CMakeFiles/libprotobuf.dir/home/myuser/testa/cockroach-v20.1.0/src/github.com/cockroachdb/cockroach/c-deps/protobuf/src/google/protobuf/util/internal/json_stream_parser.cc.o
  316. [ 82%] Building CXX object CMakeFiles/libprotobuf.dir/home/myuser/testa/cockroach-v20.1.0/src/github.com/cockroachdb/cockroach/c-deps/protobuf/src/google/protobuf/util/internal/object_writer.cc.o
  317. [ 82%] Building CXX object CMakeFiles/libprotobuf.dir/home/myuser/testa/cockroach-v20.1.0/src/github.com/cockroachdb/cockroach/c-deps/protobuf/src/google/protobuf/util/internal/proto_writer.cc.o
  318. [ 85%] Building CXX object CMakeFiles/libprotobuf.dir/home/myuser/testa/cockroach-v20.1.0/src/github.com/cockroachdb/cockroach/c-deps/protobuf/src/google/protobuf/util/internal/protostream_objectsource.cc.o
  319. /home/myuser/testa/cockroach-v20.1.0/src/github.com/cockroachdb/cockroach/c-deps/protobuf/src/google/protobuf/util/internal/protostream_objectsource.cc: In static member function 'static google::protobuf::util::Status google::protobuf::util::converter::ProtoStreamObjectSource::RenderDuration(const google::protobuf::util::converter::ProtoStreamObjectSource*, const google::protobuf::Type&, google::protobuf::StringPiece, google::protobuf::util::converter::ObjectWriter*)':
  320. /home/myuser/testa/cockroach-v20.1.0/src/github.com/cockroachdb/cockroach/c-deps/protobuf/src/google/protobuf/util/internal/protostream_objectsource.cc:388:19: warning: format '%lld' expects argument of type 'long long int', but argument 3 has type 'google::protobuf::int64 {aka long int}' [-Wformat=]
  321.            .c_str());
  322.                    ^
  323. [ 85%] Building CXX object CMakeFiles/libprotobuf.dir/home/myuser/testa/cockroach-v20.1.0/src/github.com/cockroachdb/cockroach/c-deps/protobuf/src/google/protobuf/util/internal/protostream_objectwriter.cc.o
  324. [ 87%] Building CXX object CMakeFiles/libprotobuf.dir/home/myuser/testa/cockroach-v20.1.0/src/github.com/cockroachdb/cockroach/c-deps/protobuf/src/google/protobuf/util/internal/type_info.cc.o
  325. [ 90%] Building CXX object CMakeFiles/libprotobuf.dir/home/myuser/testa/cockroach-v20.1.0/src/github.com/cockroachdb/cockroach/c-deps/protobuf/src/google/protobuf/util/internal/type_info_test_helper.cc.o
  326. [ 90%] Building CXX object CMakeFiles/libprotobuf.dir/home/myuser/testa/cockroach-v20.1.0/src/github.com/cockroachdb/cockroach/c-deps/protobuf/src/google/protobuf/util/internal/utility.cc.o
  327. [ 92%] Building CXX object CMakeFiles/libprotobuf.dir/home/myuser/testa/cockroach-v20.1.0/src/github.com/cockroachdb/cockroach/c-deps/protobuf/src/google/protobuf/util/json_util.cc.o
  328. [ 92%] Building CXX object CMakeFiles/libprotobuf.dir/home/myuser/testa/cockroach-v20.1.0/src/github.com/cockroachdb/cockroach/c-deps/protobuf/src/google/protobuf/util/message_differencer.cc.o
  329. [ 95%] Building CXX object CMakeFiles/libprotobuf.dir/home/myuser/testa/cockroach-v20.1.0/src/github.com/cockroachdb/cockroach/c-deps/protobuf/src/google/protobuf/util/time_util.cc.o
  330. [ 95%] Building CXX object CMakeFiles/libprotobuf.dir/home/myuser/testa/cockroach-v20.1.0/src/github.com/cockroachdb/cockroach/c-deps/protobuf/src/google/protobuf/util/type_resolver_util.cc.o
  331. [ 97%] Building CXX object CMakeFiles/libprotobuf.dir/home/myuser/testa/cockroach-v20.1.0/src/github.com/cockroachdb/cockroach/c-deps/protobuf/src/google/protobuf/wire_format.cc.o
  332. [ 97%] Building CXX object CMakeFiles/libprotobuf.dir/home/myuser/testa/cockroach-v20.1.0/src/github.com/cockroachdb/cockroach/c-deps/protobuf/src/google/protobuf/wrappers.pb.cc.o
  333. [100%] Linking CXX static library libprotobuf.a
  334. Scanning dependencies of target js_embed
  335. [  0%] Building CXX object CMakeFiles/js_embed.dir/home/myuser/testa/cockroach-v20.1.0/src/github.com/cockroachdb/cockroach/c-deps/protobuf/src/google/protobuf/compiler/js/embed.cc.o
  336. [  1%] Linking CXX executable js_embed
  337. [  2%] Generating /home/myuser/testa/cockroach-v20.1.0/src/github.com/cockroachdb/cockroach/c-deps/protobuf/src/google/protobuf/compiler/js/well_known_types_embed.cc
  338. Scanning dependencies of target libprotoc
  339. [  2%] Building CXX object CMakeFiles/libprotoc.dir/home/myuser/testa/cockroach-v20.1.0/src/github.com/cockroachdb/cockroach/c-deps/protobuf/src/google/protobuf/compiler/code_generator.cc.o
  340. [  3%] Building CXX object CMakeFiles/libprotoc.dir/home/myuser/testa/cockroach-v20.1.0/src/github.com/cockroachdb/cockroach/c-deps/protobuf/src/google/protobuf/compiler/command_line_interface.cc.o
  341. [  3%] Building CXX object CMakeFiles/libprotoc.dir/home/myuser/testa/cockroach-v20.1.0/src/github.com/cockroachdb/cockroach/c-deps/protobuf/src/google/protobuf/compiler/cpp/cpp_enum.cc.o
  342. [  4%] Building CXX object CMakeFiles/libprotoc.dir/home/myuser/testa/cockroach-v20.1.0/src/github.com/cockroachdb/cockroach/c-deps/protobuf/src/google/protobuf/compiler/cpp/cpp_enum_field.cc.o
  343. [  4%] Building CXX object CMakeFiles/libprotoc.dir/home/myuser/testa/cockroach-v20.1.0/src/github.com/cockroachdb/cockroach/c-deps/protobuf/src/google/protobuf/compiler/cpp/cpp_extension.cc.o
  344. [  5%] Building CXX object CMakeFiles/libprotoc.dir/home/myuser/testa/cockroach-v20.1.0/src/github.com/cockroachdb/cockroach/c-deps/protobuf/src/google/protobuf/compiler/cpp/cpp_field.cc.o
  345. [  5%] Building CXX object CMakeFiles/libprotoc.dir/home/myuser/testa/cockroach-v20.1.0/src/github.com/cockroachdb/cockroach/c-deps/protobuf/src/google/protobuf/compiler/cpp/cpp_file.cc.o
  346. [  6%] Building CXX object CMakeFiles/libprotoc.dir/home/myuser/testa/cockroach-v20.1.0/src/github.com/cockroachdb/cockroach/c-deps/protobuf/src/google/protobuf/compiler/cpp/cpp_generator.cc.o
  347. [  6%] Building CXX object CMakeFiles/libprotoc.dir/home/myuser/testa/cockroach-v20.1.0/src/github.com/cockroachdb/cockroach/c-deps/protobuf/src/google/protobuf/compiler/cpp/cpp_helpers.cc.o
  348. [  7%] Building CXX object CMakeFiles/libprotoc.dir/home/myuser/testa/cockroach-v20.1.0/src/github.com/cockroachdb/cockroach/c-deps/protobuf/src/google/protobuf/compiler/cpp/cpp_map_field.cc.o
  349. [  7%] Building CXX object CMakeFiles/libprotoc.dir/home/myuser/testa/cockroach-v20.1.0/src/github.com/cockroachdb/cockroach/c-deps/protobuf/src/google/protobuf/compiler/cpp/cpp_message.cc.o
  350. [  9%] Building CXX object CMakeFiles/libprotoc.dir/home/myuser/testa/cockroach-v20.1.0/src/github.com/cockroachdb/cockroach/c-deps/protobuf/src/google/protobuf/compiler/cpp/cpp_message_field.cc.o
  351. [  9%] Building CXX object CMakeFiles/libprotoc.dir/home/myuser/testa/cockroach-v20.1.0/src/github.com/cockroachdb/cockroach/c-deps/protobuf/src/google/protobuf/compiler/cpp/cpp_padding_optimizer.cc.o
  352. [ 10%] Building CXX object CMakeFiles/libprotoc.dir/home/myuser/testa/cockroach-v20.1.0/src/github.com/cockroachdb/cockroach/c-deps/protobuf/src/google/protobuf/compiler/cpp/cpp_primitive_field.cc.o
  353. [ 11%] Building CXX object CMakeFiles/libprotoc.dir/home/myuser/testa/cockroach-v20.1.0/src/github.com/cockroachdb/cockroach/c-deps/protobuf/src/google/protobuf/compiler/cpp/cpp_service.cc.o
  354. [ 11%] Building CXX object CMakeFiles/libprotoc.dir/home/myuser/testa/cockroach-v20.1.0/src/github.com/cockroachdb/cockroach/c-deps/protobuf/src/google/protobuf/compiler/cpp/cpp_string_field.cc.o
  355. [ 12%] Building CXX object CMakeFiles/libprotoc.dir/home/myuser/testa/cockroach-v20.1.0/src/github.com/cockroachdb/cockroach/c-deps/protobuf/src/google/protobuf/compiler/csharp/csharp_doc_comment.cc.o
  356. [ 12%] Building CXX object CMakeFiles/libprotoc.dir/home/myuser/testa/cockroach-v20.1.0/src/github.com/cockroachdb/cockroach/c-deps/protobuf/src/google/protobuf/compiler/csharp/csharp_enum.cc.o
  357. [ 13%] Building CXX object CMakeFiles/libprotoc.dir/home/myuser/testa/cockroach-v20.1.0/src/github.com/cockroachdb/cockroach/c-deps/protobuf/src/google/protobuf/compiler/csharp/csharp_enum_field.cc.o
  358. [ 13%] Building CXX object CMakeFiles/libprotoc.dir/home/myuser/testa/cockroach-v20.1.0/src/github.com/cockroachdb/cockroach/c-deps/protobuf/src/google/protobuf/compiler/csharp/csharp_field_base.cc.o
  359. [ 14%] Building CXX object CMakeFiles/libprotoc.dir/home/myuser/testa/cockroach-v20.1.0/src/github.com/cockroachdb/cockroach/c-deps/protobuf/src/google/protobuf/compiler/csharp/csharp_generator.cc.o
  360. [ 14%] Building CXX object CMakeFiles/libprotoc.dir/home/myuser/testa/cockroach-v20.1.0/src/github.com/cockroachdb/cockroach/c-deps/protobuf/src/google/protobuf/compiler/csharp/csharp_helpers.cc.o
  361. [ 15%] Building CXX object CMakeFiles/libprotoc.dir/home/myuser/testa/cockroach-v20.1.0/src/github.com/cockroachdb/cockroach/c-deps/protobuf/src/google/protobuf/compiler/csharp/csharp_map_field.cc.o
  362. [ 15%] Building CXX object CMakeFiles/libprotoc.dir/home/myuser/testa/cockroach-v20.1.0/src/github.com/cockroachdb/cockroach/c-deps/protobuf/src/google/protobuf/compiler/csharp/csharp_message.cc.o
  363. [ 17%] Building CXX object CMakeFiles/libprotoc.dir/home/myuser/testa/cockroach-v20.1.0/src/github.com/cockroachdb/cockroach/c-deps/protobuf/src/google/protobuf/compiler/csharp/csharp_message_field.cc.o
  364. [ 17%] Building CXX object CMakeFiles/libprotoc.dir/home/myuser/testa/cockroach-v20.1.0/src/github.com/cockroachdb/cockroach/c-deps/protobuf/src/google/protobuf/compiler/csharp/csharp_primitive_field.cc.o
  365. [ 18%] Building CXX object CMakeFiles/libprotoc.dir/home/myuser/testa/cockroach-v20.1.0/src/github.com/cockroachdb/cockroach/c-deps/protobuf/src/google/protobuf/compiler/csharp/csharp_reflection_class.cc.o
  366. [ 18%] Building CXX object CMakeFiles/libprotoc.dir/home/myuser/testa/cockroach-v20.1.0/src/github.com/cockroachdb/cockroach/c-deps/protobuf/src/google/protobuf/compiler/csharp/csharp_repeated_enum_field.cc.o
  367. [ 19%] Building CXX object CMakeFiles/libprotoc.dir/home/myuser/testa/cockroach-v20.1.0/src/github.com/cockroachdb/cockroach/c-deps/protobuf/src/google/protobuf/compiler/csharp/csharp_repeated_message_field.cc.o
  368. [ 19%] Building CXX object CMakeFiles/libprotoc.dir/home/myuser/testa/cockroach-v20.1.0/src/github.com/cockroachdb/cockroach/c-deps/protobuf/src/google/protobuf/compiler/csharp/csharp_repeated_primitive_field.cc.o
  369. [ 20%] Building CXX object CMakeFiles/libprotoc.dir/home/myuser/testa/cockroach-v20.1.0/src/github.com/cockroachdb/cockroach/c-deps/protobuf/src/google/protobuf/compiler/csharp/csharp_source_generator_base.cc.o
  370. [ 20%] Building CXX object CMakeFiles/libprotoc.dir/home/myuser/testa/cockroach-v20.1.0/src/github.com/cockroachdb/cockroach/c-deps/protobuf/src/google/protobuf/compiler/csharp/csharp_wrapper_field.cc.o
  371. [ 21%] Building CXX object CMakeFiles/libprotoc.dir/home/myuser/testa/cockroach-v20.1.0/src/github.com/cockroachdb/cockroach/c-deps/protobuf/src/google/protobuf/compiler/java/java_context.cc.o
  372. [ 21%] Building CXX object CMakeFiles/libprotoc.dir/home/myuser/testa/cockroach-v20.1.0/src/github.com/cockroachdb/cockroach/c-deps/protobuf/src/google/protobuf/compiler/java/java_doc_comment.cc.o
  373. [ 22%] Building CXX object CMakeFiles/libprotoc.dir/home/myuser/testa/cockroach-v20.1.0/src/github.com/cockroachdb/cockroach/c-deps/protobuf/src/google/protobuf/compiler/java/java_enum.cc.o
  374. [ 22%] Building CXX object CMakeFiles/libprotoc.dir/home/myuser/testa/cockroach-v20.1.0/src/github.com/cockroachdb/cockroach/c-deps/protobuf/src/google/protobuf/compiler/java/java_enum_field.cc.o
  375. [ 23%] Building CXX object CMakeFiles/libprotoc.dir/home/myuser/testa/cockroach-v20.1.0/src/github.com/cockroachdb/cockroach/c-deps/protobuf/src/google/protobuf/compiler/java/java_enum_field_lite.cc.o
  376. [ 25%] Building CXX object CMakeFiles/libprotoc.dir/home/myuser/testa/cockroach-v20.1.0/src/github.com/cockroachdb/cockroach/c-deps/protobuf/src/google/protobuf/compiler/java/java_enum_lite.cc.o
  377. [ 25%] Building CXX object CMakeFiles/libprotoc.dir/home/myuser/testa/cockroach-v20.1.0/src/github.com/cockroachdb/cockroach/c-deps/protobuf/src/google/protobuf/compiler/java/java_extension.cc.o
  378. [ 26%] Building CXX object CMakeFiles/libprotoc.dir/home/myuser/testa/cockroach-v20.1.0/src/github.com/cockroachdb/cockroach/c-deps/protobuf/src/google/protobuf/compiler/java/java_extension_lite.cc.o
  379. [ 26%] Building CXX object CMakeFiles/libprotoc.dir/home/myuser/testa/cockroach-v20.1.0/src/github.com/cockroachdb/cockroach/c-deps/protobuf/src/google/protobuf/compiler/java/java_field.cc.o
  380. [ 27%] Building CXX object CMakeFiles/libprotoc.dir/home/myuser/testa/cockroach-v20.1.0/src/github.com/cockroachdb/cockroach/c-deps/protobuf/src/google/protobuf/compiler/java/java_file.cc.o
  381. [ 27%] Building CXX object CMakeFiles/libprotoc.dir/home/myuser/testa/cockroach-v20.1.0/src/github.com/cockroachdb/cockroach/c-deps/protobuf/src/google/protobuf/compiler/java/java_generator.cc.o
  382. [ 28%] Building CXX object CMakeFiles/libprotoc.dir/home/myuser/testa/cockroach-v20.1.0/src/github.com/cockroachdb/cockroach/c-deps/protobuf/src/google/protobuf/compiler/java/java_generator_factory.cc.o
  383. [ 28%] Building CXX object CMakeFiles/libprotoc.dir/home/myuser/testa/cockroach-v20.1.0/src/github.com/cockroachdb/cockroach/c-deps/protobuf/src/google/protobuf/compiler/java/java_helpers.cc.o
  384. [ 29%] Building CXX object CMakeFiles/libprotoc.dir/home/myuser/testa/cockroach-v20.1.0/src/github.com/cockroachdb/cockroach/c-deps/protobuf/src/google/protobuf/compiler/java/java_lazy_message_field.cc.o
  385. [ 29%] Building CXX object CMakeFiles/libprotoc.dir/home/myuser/testa/cockroach-v20.1.0/src/github.com/cockroachdb/cockroach/c-deps/protobuf/src/google/protobuf/compiler/java/java_lazy_message_field_lite.cc.o
  386. [ 30%] Building CXX object CMakeFiles/libprotoc.dir/home/myuser/testa/cockroach-v20.1.0/src/github.com/cockroachdb/cockroach/c-deps/protobuf/src/google/protobuf/compiler/java/java_map_field.cc.o
  387. [ 30%] Building CXX object CMakeFiles/libprotoc.dir/home/myuser/testa/cockroach-v20.1.0/src/github.com/cockroachdb/cockroach/c-deps/protobuf/src/google/protobuf/compiler/java/java_map_field_lite.cc.o
  388. [ 31%] Building CXX object CMakeFiles/libprotoc.dir/home/myuser/testa/cockroach-v20.1.0/src/github.com/cockroachdb/cockroach/c-deps/protobuf/src/google/protobuf/compiler/java/java_message.cc.o
  389. [ 31%] Building CXX object CMakeFiles/libprotoc.dir/home/myuser/testa/cockroach-v20.1.0/src/github.com/cockroachdb/cockroach/c-deps/protobuf/src/google/protobuf/compiler/java/java_message_builder.cc.o
  390. [ 32%] Building CXX object CMakeFiles/libprotoc.dir/home/myuser/testa/cockroach-v20.1.0/src/github.com/cockroachdb/cockroach/c-deps/protobuf/src/google/protobuf/compiler/java/java_message_builder_lite.cc.o
  391. [ 32%] Building CXX object CMakeFiles/libprotoc.dir/home/myuser/testa/cockroach-v20.1.0/src/github.com/cockroachdb/cockroach/c-deps/protobuf/src/google/protobuf/compiler/java/java_message_field.cc.o
  392. [ 34%] Building CXX object CMakeFiles/libprotoc.dir/home/myuser/testa/cockroach-v20.1.0/src/github.com/cockroachdb/cockroach/c-deps/protobuf/src/google/protobuf/compiler/java/java_message_field_lite.cc.o
  393. [ 34%] Building CXX object CMakeFiles/libprotoc.dir/home/myuser/testa/cockroach-v20.1.0/src/github.com/cockroachdb/cockroach/c-deps/protobuf/src/google/protobuf/compiler/java/java_message_lite.cc.o
  394. [ 35%] Building CXX object CMakeFiles/libprotoc.dir/home/myuser/testa/cockroach-v20.1.0/src/github.com/cockroachdb/cockroach/c-deps/protobuf/src/google/protobuf/compiler/java/java_name_resolver.cc.o
  395. [ 35%] Building CXX object CMakeFiles/libprotoc.dir/home/myuser/testa/cockroach-v20.1.0/src/github.com/cockroachdb/cockroach/c-deps/protobuf/src/google/protobuf/compiler/java/java_primitive_field.cc.o
  396. [ 36%] Building CXX object CMakeFiles/libprotoc.dir/home/myuser/testa/cockroach-v20.1.0/src/github.com/cockroachdb/cockroach/c-deps/protobuf/src/google/protobuf/compiler/java/java_primitive_field_lite.cc.o
  397. [ 36%] Building CXX object CMakeFiles/libprotoc.dir/home/myuser/testa/cockroach-v20.1.0/src/github.com/cockroachdb/cockroach/c-deps/protobuf/src/google/protobuf/compiler/java/java_service.cc.o
  398. [ 37%] Building CXX object CMakeFiles/libprotoc.dir/home/myuser/testa/cockroach-v20.1.0/src/github.com/cockroachdb/cockroach/c-deps/protobuf/src/google/protobuf/compiler/java/java_shared_code_generator.cc.o
  399. [ 37%] Building CXX object CMakeFiles/libprotoc.dir/home/myuser/testa/cockroach-v20.1.0/src/github.com/cockroachdb/cockroach/c-deps/protobuf/src/google/protobuf/compiler/java/java_string_field.cc.o
  400. [ 38%] Building CXX object CMakeFiles/libprotoc.dir/home/myuser/testa/cockroach-v20.1.0/src/github.com/cockroachdb/cockroach/c-deps/protobuf/src/google/protobuf/compiler/java/java_string_field_lite.cc.o
  401. [ 39%] Building CXX object CMakeFiles/libprotoc.dir/home/myuser/testa/cockroach-v20.1.0/src/github.com/cockroachdb/cockroach/c-deps/protobuf/src/google/protobuf/compiler/js/js_generator.cc.o
  402. [ 39%] Building CXX object CMakeFiles/libprotoc.dir/home/myuser/testa/cockroach-v20.1.0/src/github.com/cockroachdb/cockroach/c-deps/protobuf/src/google/protobuf/compiler/js/well_known_types_embed.cc.o
  403. [ 40%] Building CXX object CMakeFiles/libprotoc.dir/home/myuser/testa/cockroach-v20.1.0/src/github.com/cockroachdb/cockroach/c-deps/protobuf/src/google/protobuf/compiler/objectivec/objectivec_enum.cc.o
  404. [ 40%] Building CXX object CMakeFiles/libprotoc.dir/home/myuser/testa/cockroach-v20.1.0/src/github.com/cockroachdb/cockroach/c-deps/protobuf/src/google/protobuf/compiler/objectivec/objectivec_enum_field.cc.o
  405. [ 42%] Building CXX object CMakeFiles/libprotoc.dir/home/myuser/testa/cockroach-v20.1.0/src/github.com/cockroachdb/cockroach/c-deps/protobuf/src/google/protobuf/compiler/objectivec/objectivec_extension.cc.o
  406. [ 42%] Building CXX object CMakeFiles/libprotoc.dir/home/myuser/testa/cockroach-v20.1.0/src/github.com/cockroachdb/cockroach/c-deps/protobuf/src/google/protobuf/compiler/objectivec/objectivec_field.cc.o
  407. [ 43%] Building CXX object CMakeFiles/libprotoc.dir/home/myuser/testa/cockroach-v20.1.0/src/github.com/cockroachdb/cockroach/c-deps/protobuf/src/google/protobuf/compiler/objectivec/objectivec_file.cc.o
  408. [ 43%] Building CXX object CMakeFiles/libprotoc.dir/home/myuser/testa/cockroach-v20.1.0/src/github.com/cockroachdb/cockroach/c-deps/protobuf/src/google/protobuf/compiler/objectivec/objectivec_generator.cc.o
  409. [ 44%] Building CXX object CMakeFiles/libprotoc.dir/home/myuser/testa/cockroach-v20.1.0/src/github.com/cockroachdb/cockroach/c-deps/protobuf/src/google/protobuf/compiler/objectivec/objectivec_helpers.cc.o
  410. [ 44%] Building CXX object CMakeFiles/libprotoc.dir/home/myuser/testa/cockroach-v20.1.0/src/github.com/cockroachdb/cockroach/c-deps/protobuf/src/google/protobuf/compiler/objectivec/objectivec_map_field.cc.o
  411. [ 45%] Building CXX object CMakeFiles/libprotoc.dir/home/myuser/testa/cockroach-v20.1.0/src/github.com/cockroachdb/cockroach/c-deps/protobuf/src/google/protobuf/compiler/objectivec/objectivec_message.cc.o
  412. [ 45%] Building CXX object CMakeFiles/libprotoc.dir/home/myuser/testa/cockroach-v20.1.0/src/github.com/cockroachdb/cockroach/c-deps/protobuf/src/google/protobuf/compiler/objectivec/objectivec_message_field.cc.o
  413. [ 46%] Building CXX object CMakeFiles/libprotoc.dir/home/myuser/testa/cockroach-v20.1.0/src/github.com/cockroachdb/cockroach/c-deps/protobuf/src/google/protobuf/compiler/objectivec/objectivec_oneof.cc.o
  414. [ 46%] Building CXX object CMakeFiles/libprotoc.dir/home/myuser/testa/cockroach-v20.1.0/src/github.com/cockroachdb/cockroach/c-deps/protobuf/src/google/protobuf/compiler/objectivec/objectivec_primitive_field.cc.o
  415. [ 47%] Building CXX object CMakeFiles/libprotoc.dir/home/myuser/testa/cockroach-v20.1.0/src/github.com/cockroachdb/cockroach/c-deps/protobuf/src/google/protobuf/compiler/php/php_generator.cc.o
  416. [ 47%] Building CXX object CMakeFiles/libprotoc.dir/home/myuser/testa/cockroach-v20.1.0/src/github.com/cockroachdb/cockroach/c-deps/protobuf/src/google/protobuf/compiler/plugin.cc.o
  417. [ 48%] Building CXX object CMakeFiles/libprotoc.dir/home/myuser/testa/cockroach-v20.1.0/src/github.com/cockroachdb/cockroach/c-deps/protobuf/src/google/protobuf/compiler/plugin.pb.cc.o
  418. [ 48%] Building CXX object CMakeFiles/libprotoc.dir/home/myuser/testa/cockroach-v20.1.0/src/github.com/cockroachdb/cockroach/c-deps/protobuf/src/google/protobuf/compiler/python/python_generator.cc.o
  419. [ 50%] Building CXX object CMakeFiles/libprotoc.dir/home/myuser/testa/cockroach-v20.1.0/src/github.com/cockroachdb/cockroach/c-deps/protobuf/src/google/protobuf/compiler/ruby/ruby_generator.cc.o
  420. [ 50%] Building CXX object CMakeFiles/libprotoc.dir/home/myuser/testa/cockroach-v20.1.0/src/github.com/cockroachdb/cockroach/c-deps/protobuf/src/google/protobuf/compiler/subprocess.cc.o
  421. [ 51%] Building CXX object CMakeFiles/libprotoc.dir/home/myuser/testa/cockroach-v20.1.0/src/github.com/cockroachdb/cockroach/c-deps/protobuf/src/google/protobuf/compiler/zip_writer.cc.o
  422. [ 51%] Linking CXX static library libprotoc.a
  423. Scanning dependencies of target protoc
  424. [ 52%] Building CXX object CMakeFiles/protoc.dir/home/myuser/testa/cockroach-v20.1.0/src/github.com/cockroachdb/cockroach/c-deps/protobuf/src/google/protobuf/compiler/main.cc.o
  425. [ 53%] Linking CXX executable protoc
  426. go install -v protoc-gen-gogoroach
  427. bin/prereqs ./pkg/cmd/protoc-gen-gogoroach > bin/protoc-gen-gogoroach.d.tmp
  428. mv -f bin/protoc-gen-gogoroach.d.tmp bin/protoc-gen-gogoroach.d
  429. github.com/cockroachdb/cockroach/vendor/github.com/gogo/protobuf/protoc-gen-gogo/generator/internal/remap
  430. github.com/cockroachdb/cockroach/vendor/github.com/gogo/protobuf/proto
  431. github.com/cockroachdb/cockroach/vendor/github.com/gogo/protobuf/protoc-gen-gogo/descriptor
  432. github.com/cockroachdb/cockroach/vendor/github.com/gogo/protobuf/protoc-gen-gogo/plugin
  433. github.com/cockroachdb/cockroach/vendor/github.com/gogo/protobuf/gogoproto
  434. github.com/cockroachdb/cockroach/vendor/github.com/gogo/protobuf/vanity
  435. github.com/cockroachdb/cockroach/vendor/github.com/gogo/protobuf/protoc-gen-gogo/generator
  436. github.com/cockroachdb/cockroach/vendor/github.com/gogo/protobuf/plugin/defaultcheck
  437. github.com/cockroachdb/cockroach/vendor/github.com/gogo/protobuf/plugin/enumstringer
  438. github.com/cockroachdb/cockroach/vendor/github.com/gogo/protobuf/plugin/embedcheck
  439. github.com/cockroachdb/cockroach/vendor/github.com/gogo/protobuf/plugin/testgen
  440. github.com/cockroachdb/cockroach/vendor/github.com/gogo/protobuf/plugin/marshalto
  441. github.com/cockroachdb/cockroach/vendor/github.com/gogo/protobuf/plugin/oneofcheck
  442. github.com/cockroachdb/cockroach/vendor/github.com/gogo/protobuf/plugin/populate
  443. github.com/cockroachdb/cockroach/vendor/github.com/gogo/protobuf/plugin/unmarshal
  444. github.com/cockroachdb/cockroach/vendor/github.com/gogo/protobuf/plugin/compare
  445. github.com/cockroachdb/cockroach/vendor/github.com/gogo/protobuf/plugin/description
  446. github.com/cockroachdb/cockroach/vendor/github.com/gogo/protobuf/plugin/equal
  447. github.com/cockroachdb/cockroach/vendor/github.com/gogo/protobuf/plugin/face
  448. github.com/cockroachdb/cockroach/vendor/github.com/gogo/protobuf/plugin/size
  449. github.com/cockroachdb/cockroach/vendor/github.com/gogo/protobuf/plugin/gostring
  450. github.com/cockroachdb/cockroach/vendor/github.com/gogo/protobuf/plugin/stringer
  451. github.com/cockroachdb/cockroach/vendor/github.com/gogo/protobuf/plugin/union
  452. github.com/cockroachdb/cockroach/vendor/github.com/gogo/protobuf/protoc-gen-gogo/grpc
  453. github.com/cockroachdb/cockroach/vendor/github.com/gogo/protobuf/vanity/command
  454. github.com/cockroachdb/cockroach/pkg/cmd/protoc-gen-gogoroach
  455. find ./pkg -name node_modules -prune -o -type f -name '*.pb.go' -exec rm {} +
  456. set -e; for dir in ./pkg/acceptance/cluster/ ./pkg/blobs/blobspb/ ./pkg/build/ ./pkg/ccl/backupccl/ ./pkg/ccl/baseccl/ ./pkg/ccl/storageccl/engineccl/enginepbccl/ ./pkg/ccl/utilccl/licenseccl/ ./pkg/cli/systembench/systembenchpb/ ./pkg/clusterversion/ ./pkg/config/ ./pkg/config/zonepb/ ./pkg/gossip/ ./pkg/jobs/jobspb/ ./pkg/kv/kvnemesis/ ./pkg/kv/kvserver/ ./pkg/kv/kvserver/closedts/ctpb/ ./pkg/kv/kvserver/concurrency/lock/ ./pkg/kv/kvserver/protectedts/ptpb/ ./pkg/kv/kvserver/protectedts/ptstorage/ ./pkg/kv/kvserver/storagepb/ ./pkg/roachpb/ ./pkg/rpc/ ./pkg/server/diagnosticspb/ ./pkg/server/serverpb/ ./pkg/server/status/statuspb/ ./pkg/sql/colexec/execpb/ ./pkg/sql/execinfrapb/ ./pkg/sql/flowinfra/ ./pkg/sql/pgwire/pgerror/ ./pkg/sql/rowexec/ ./pkg/sql/rowflow/ ./pkg/sql/sqlbase/ ./pkg/sql/stats/ ./pkg/sql/types/ ./pkg/sqlmigrations/leasemanager/ ./pkg/storage/enginepb/ ./pkg/ts/catalog/ ./pkg/ts/tspb/ ./pkg/util/ ./pkg/util/hlc/ ./pkg/util/log/ ./pkg/util/metric/ ./pkg/util/protoutil/ ./pkg/util/tracing/; do \
  457.   build/werror.sh /home/myuser/testa/cockroach-v20.1.0/native//protobuf/protoc -Ipkg:./vendor/github.com:./vendor/github.com/gogo/protobuf:./vendor/github.com/gogo/protobuf/protobuf:./vendor/go.etcd.io:./vendor/github.com/grpc-ecosystem/grpc-gateway/third_party/googleapis:./vendor/github.com/cockroachdb/errors --gogoroach_out=Mgoogle/api/annotations.proto=github.com/grpc-ecosystem/grpc-gateway/third_party/googleapis/google/api,Mgoogle/protobuf/timestamp.proto=github.com/gogo/protobuf/types,Mgoogle/protobuf/any.proto=github.com/gogo/protobuf/types,,plugins=grpc,import_prefix=github.com/cockroachdb/cockroach/pkg/:./pkg $dir/*.proto; \
  458. done
  459. sed -i -E \
  460.     -e '/import _ /d' \
  461.     -e 's!import (fmt|math) "github.com/cockroachdb/cockroach/pkg/(fmt|math)"! !g' \
  462.     -e 's!github\.com/cockroachdb/cockroach/pkg/(etcd)!go.etcd.io/\1!g' \
  463.     -e 's!github.com/cockroachdb/cockroach/pkg/((bytes|encoding/binary|errors|fmt|io|math|github\.com|(google\.)?golang\.org)([^a-z]|$))!\1!g' \
  464.         -e 's!github.com/cockroachdb/cockroach/pkg/errorspb!github.com/cockroachdb/errors/errorspb!g' \
  465.     -e 's!golang.org/x/net/context!context!g' \
  466.     ./pkg/acceptance/cluster/testconfig.pb.go ./pkg/blobs/blobspb/blobs.pb.go ./pkg/build/info.pb.go ./pkg/ccl/backupccl/backup.pb.go ./pkg/ccl/baseccl/encryption_options.pb.go ./pkg/ccl/storageccl/engineccl/enginepbccl/key_registry.pb.go ./pkg/ccl/storageccl/engineccl/enginepbccl/stats.pb.go ./pkg/ccl/utilccl/licenseccl/license.pb.go ./pkg/cli/systembench/systembenchpb/ping.pb.go ./pkg/clusterversion/cluster_version.pb.go ./pkg/config/system.pb.go ./pkg/config/zonepb/zone.pb.go ./pkg/gossip/gossip.pb.go ./pkg/jobs/jobspb/jobs.pb.go ./pkg/kv/kvnemesis/operations.pb.go ./pkg/kv/kvserver/api.pb.go ./pkg/kv/kvserver/closedts/ctpb/entry.pb.go ./pkg/kv/kvserver/closedts/ctpb/service.pb.go ./pkg/kv/kvserver/concurrency/lock/locking.pb.go ./pkg/kv/kvserver/protectedts/ptpb/protectedts.pb.go ./pkg/kv/kvserver/protectedts/ptstorage/storage.pb.go ./pkg/kv/kvserver/raft.pb.go ./pkg/kv/kvserver/storage_services.pb.go ./pkg/kv/kvserver/storagepb/lease_status.pb.go ./pkg/kv/kvserver/storagepb/liveness.pb.go ./pkg/kv/kvserver/storagepb/log.pb.go ./pkg/kv/kvserver/storagepb/proposer_kv.pb.go ./pkg/kv/kvserver/storagepb/state.pb.go ./pkg/roachpb/api.pb.go ./pkg/roachpb/app_stats.pb.go ./pkg/roachpb/data.pb.go ./pkg/roachpb/errors.pb.go ./pkg/roachpb/internal.pb.go ./pkg/roachpb/internal_raft.pb.go ./pkg/roachpb/io-formats.pb.go ./pkg/roachpb/metadata.pb.go ./pkg/rpc/heartbeat.pb.go ./pkg/server/diagnosticspb/diagnostics.pb.go ./pkg/server/serverpb/admin.pb.go ./pkg/server/serverpb/authentication.pb.go ./pkg/server/serverpb/init.pb.go ./pkg/server/serverpb/status.pb.go ./pkg/server/status/statuspb/status.pb.go ./pkg/sql/colexec/execpb/stats.pb.go ./pkg/sql/execinfrapb/api.pb.go ./pkg/sql/execinfrapb/data.pb.go ./pkg/sql/execinfrapb/processors.pb.go ./pkg/sql/execinfrapb/processors_base.pb.go ./pkg/sql/execinfrapb/processors_bulk_io.pb.go ./pkg/sql/execinfrapb/processors_changefeeds.pb.go ./pkg/sql/execinfrapb/processors_sql.pb.go ./pkg/sql/execinfrapb/processors_table_stats.pb.go ./pkg/sql/flowinfra/stats.pb.go ./pkg/sql/pgwire/pgerror/errors.pb.go ./pkg/sql/rowexec/stats.pb.go ./pkg/sql/rowflow/stats.pb.go ./pkg/sql/sqlbase/encoded_datum.pb.go ./pkg/sql/sqlbase/join_type.pb.go ./pkg/sql/sqlbase/locking.pb.go ./pkg/sql/sqlbase/privilege.pb.go ./pkg/sql/sqlbase/structured.pb.go ./pkg/sql/stats/histogram.pb.go ./pkg/sql/stats/table_statistic.pb.go ./pkg/sql/types/types.pb.go ./pkg/sqlmigrations/leasemanager/lease.pb.go ./pkg/storage/enginepb/engine.pb.go ./pkg/storage/enginepb/file_registry.pb.go ./pkg/storage/enginepb/mvcc.pb.go ./pkg/storage/enginepb/mvcc3.pb.go ./pkg/storage/enginepb/rocksdb.pb.go ./pkg/ts/catalog/chart_catalog.pb.go ./pkg/ts/tspb/timeseries.pb.go ./pkg/util/hlc/legacy_timestamp.pb.go ./pkg/util/hlc/timestamp.pb.go ./pkg/util/log/log.pb.go ./pkg/util/metric/metric.pb.go ./pkg/util/protoutil/clone.pb.go ./pkg/util/tracing/recorded_span.pb.go ./pkg/util/unresolved_addr.pb.go
  467. gofmt -s -w ./pkg/acceptance/cluster/testconfig.pb.go ./pkg/blobs/blobspb/blobs.pb.go ./pkg/build/info.pb.go ./pkg/ccl/backupccl/backup.pb.go ./pkg/ccl/baseccl/encryption_options.pb.go ./pkg/ccl/storageccl/engineccl/enginepbccl/key_registry.pb.go ./pkg/ccl/storageccl/engineccl/enginepbccl/stats.pb.go ./pkg/ccl/utilccl/licenseccl/license.pb.go ./pkg/cli/systembench/systembenchpb/ping.pb.go ./pkg/clusterversion/cluster_version.pb.go ./pkg/config/system.pb.go ./pkg/config/zonepb/zone.pb.go ./pkg/gossip/gossip.pb.go ./pkg/jobs/jobspb/jobs.pb.go ./pkg/kv/kvnemesis/operations.pb.go ./pkg/kv/kvserver/api.pb.go ./pkg/kv/kvserver/closedts/ctpb/entry.pb.go ./pkg/kv/kvserver/closedts/ctpb/service.pb.go ./pkg/kv/kvserver/concurrency/lock/locking.pb.go ./pkg/kv/kvserver/protectedts/ptpb/protectedts.pb.go ./pkg/kv/kvserver/protectedts/ptstorage/storage.pb.go ./pkg/kv/kvserver/raft.pb.go ./pkg/kv/kvserver/storage_services.pb.go ./pkg/kv/kvserver/storagepb/lease_status.pb.go ./pkg/kv/kvserver/storagepb/liveness.pb.go ./pkg/kv/kvserver/storagepb/log.pb.go ./pkg/kv/kvserver/storagepb/proposer_kv.pb.go ./pkg/kv/kvserver/storagepb/state.pb.go ./pkg/roachpb/api.pb.go ./pkg/roachpb/app_stats.pb.go ./pkg/roachpb/data.pb.go ./pkg/roachpb/errors.pb.go ./pkg/roachpb/internal.pb.go ./pkg/roachpb/internal_raft.pb.go ./pkg/roachpb/io-formats.pb.go ./pkg/roachpb/metadata.pb.go ./pkg/rpc/heartbeat.pb.go ./pkg/server/diagnosticspb/diagnostics.pb.go ./pkg/server/serverpb/admin.pb.go ./pkg/server/serverpb/authentication.pb.go ./pkg/server/serverpb/init.pb.go ./pkg/server/serverpb/status.pb.go ./pkg/server/status/statuspb/status.pb.go ./pkg/sql/colexec/execpb/stats.pb.go ./pkg/sql/execinfrapb/api.pb.go ./pkg/sql/execinfrapb/data.pb.go ./pkg/sql/execinfrapb/processors.pb.go ./pkg/sql/execinfrapb/processors_base.pb.go ./pkg/sql/execinfrapb/processors_bulk_io.pb.go ./pkg/sql/execinfrapb/processors_changefeeds.pb.go ./pkg/sql/execinfrapb/processors_sql.pb.go ./pkg/sql/execinfrapb/processors_table_stats.pb.go ./pkg/sql/flowinfra/stats.pb.go ./pkg/sql/pgwire/pgerror/errors.pb.go ./pkg/sql/rowexec/stats.pb.go ./pkg/sql/rowflow/stats.pb.go ./pkg/sql/sqlbase/encoded_datum.pb.go ./pkg/sql/sqlbase/join_type.pb.go ./pkg/sql/sqlbase/locking.pb.go ./pkg/sql/sqlbase/privilege.pb.go ./pkg/sql/sqlbase/structured.pb.go ./pkg/sql/stats/histogram.pb.go ./pkg/sql/stats/table_statistic.pb.go ./pkg/sql/types/types.pb.go ./pkg/sqlmigrations/leasemanager/lease.pb.go ./pkg/storage/enginepb/engine.pb.go ./pkg/storage/enginepb/file_registry.pb.go ./pkg/storage/enginepb/mvcc.pb.go ./pkg/storage/enginepb/mvcc3.pb.go ./pkg/storage/enginepb/rocksdb.pb.go ./pkg/ts/catalog/chart_catalog.pb.go ./pkg/ts/tspb/timeseries.pb.go ./pkg/util/hlc/legacy_timestamp.pb.go ./pkg/util/hlc/timestamp.pb.go ./pkg/util/log/log.pb.go ./pkg/util/metric/metric.pb.go ./pkg/util/protoutil/clone.pb.go ./pkg/util/tracing/recorded_span.pb.go ./pkg/util/unresolved_addr.pb.go
  468. touch bin/.go_protobuf_sources
  469. find ./pkg -name node_modules -prune -o -type f -name '*.pb.gw.go' -exec rm {} +
  470. build/werror.sh /home/myuser/testa/cockroach-v20.1.0/native//protobuf/protoc -Ipkg:./vendor/github.com:./vendor/github.com/gogo/protobuf:./vendor/github.com/gogo/protobuf/protobuf:./vendor/github.com/cockroachdb/errors:./vendor/go.etcd.io:./vendor/github.com/grpc-ecosystem/grpc-gateway/third_party/googleapis --grpc-gateway_out=logtostderr=true,request_context=true:./pkg ./pkg/server/serverpb/admin.proto ./pkg/server/serverpb/status.proto ./pkg/server/serverpb/authentication.proto
  471. build/werror.sh /home/myuser/testa/cockroach-v20.1.0/native//protobuf/protoc -Ipkg:./vendor/github.com:./vendor/github.com/gogo/protobuf:./vendor/github.com/gogo/protobuf/protobuf:./vendor/github.com/cockroachdb/errors:./vendor/go.etcd.io:./vendor/github.com/grpc-ecosystem/grpc-gateway/third_party/googleapis --grpc-gateway_out=logtostderr=true,request_context=true:./pkg ./pkg/ts/tspb/timeseries.proto
  472. sed -i -E 's!golang.org/x/net/context!context!g' ./pkg/server/serverpb/admin.pb.gw.go ./pkg/server/serverpb/status.pb.gw.go ./pkg/server/serverpb/authentication.pb.gw.go ./pkg/ts/tspb/timeseries.pb.gw.go
  473. gofmt -s -w ./pkg/server/serverpb/admin.pb.gw.go ./pkg/server/serverpb/status.pb.gw.go ./pkg/server/serverpb/authentication.pb.gw.go ./pkg/ts/tspb/timeseries.pb.gw.go
  474. goimports -w ./pkg/server/serverpb/admin.pb.gw.go ./pkg/server/serverpb/status.pb.gw.go ./pkg/server/serverpb/authentication.pb.gw.go ./pkg/ts/tspb/timeseries.pb.gw.go
  475. touch bin/.gw_protobuf_sources
  476. rm -rf /home/myuser/testa/cockroach-v20.1.0/src/github.com/cockroachdb/cockroach/c-deps/libroach/protos
  477. mkdir -p /home/myuser/testa/cockroach-v20.1.0/src/github.com/cockroachdb/cockroach/c-deps/libroach/protos
  478. build/werror.sh /home/myuser/testa/cockroach-v20.1.0/native//protobuf/protoc -Ipkg:./vendor/github.com/gogo/protobuf:./vendor/github.com/gogo/protobuf/protobuf --cpp_out=lite:/home/myuser/testa/cockroach-v20.1.0/src/github.com/cockroachdb/cockroach/c-deps/libroach/protos ./pkg/kv/kvserver/concurrency/lock/locking.proto ./pkg/roachpb/api.proto ./pkg/roachpb/data.proto ./pkg/roachpb/errors.proto ./pkg/roachpb/internal.proto ./pkg/roachpb/metadata.proto ./pkg/storage/enginepb/file_registry.proto ./pkg/storage/enginepb/mvcc.proto ./pkg/storage/enginepb/mvcc3.proto ./pkg/storage/enginepb/rocksdb.proto ./pkg/util/hlc/legacy_timestamp.proto ./pkg/util/hlc/timestamp.proto ./pkg/util/log/log.proto ./pkg/util/tracing/recorded_span.proto ./pkg/util/unresolved_addr.proto
  479. sed -i -E '/gogoproto/d' /home/myuser/testa/cockroach-v20.1.0/src/github.com/cockroachdb/cockroach/c-deps/libroach/protos/kv/kvserver/concurrency/lock/locking.pb.h /home/myuser/testa/cockroach-v20.1.0/src/github.com/cockroachdb/cockroach/c-deps/libroach/protos/roachpb/api.pb.h /home/myuser/testa/cockroach-v20.1.0/src/github.com/cockroachdb/cockroach/c-deps/libroach/protos/roachpb/data.pb.h /home/myuser/testa/cockroach-v20.1.0/src/github.com/cockroachdb/cockroach/c-deps/libroach/protos/roachpb/errors.pb.h /home/myuser/testa/cockroach-v20.1.0/src/github.com/cockroachdb/cockroach/c-deps/libroach/protos/roachpb/internal.pb.h /home/myuser/testa/cockroach-v20.1.0/src/github.com/cockroachdb/cockroach/c-deps/libroach/protos/roachpb/metadata.pb.h /home/myuser/testa/cockroach-v20.1.0/src/github.com/cockroachdb/cockroach/c-deps/libroach/protos/storage/enginepb/file_registry.pb.h /home/myuser/testa/cockroach-v20.1.0/src/github.com/cockroachdb/cockroach/c-deps/libroach/protos/storage/enginepb/mvcc.pb.h /home/myuser/testa/cockroach-v20.1.0/src/github.com/cockroachdb/cockroach/c-deps/libroach/protos/storage/enginepb/mvcc3.pb.h /home/myuser/testa/cockroach-v20.1.0/src/github.com/cockroachdb/cockroach/c-deps/libroach/protos/storage/enginepb/rocksdb.pb.h /home/myuser/testa/cockroach-v20.1.0/src/github.com/cockroachdb/cockroach/c-deps/libroach/protos/util/hlc/legacy_timestamp.pb.h /home/myuser/testa/cockroach-v20.1.0/src/github.com/cockroachdb/cockroach/c-deps/libroach/protos/util/hlc/timestamp.pb.h /home/myuser/testa/cockroach-v20.1.0/src/github.com/cockroachdb/cockroach/c-deps/libroach/protos/util/log/log.pb.h /home/myuser/testa/cockroach-v20.1.0/src/github.com/cockroachdb/cockroach/c-deps/libroach/protos/util/tracing/recorded_span.pb.h /home/myuser/testa/cockroach-v20.1.0/src/github.com/cockroachdb/cockroach/c-deps/libroach/protos/util/unresolved_addr.pb.h /home/myuser/testa/cockroach-v20.1.0/src/github.com/cockroachdb/cockroach/c-deps/libroach/protos/kv/kvserver/concurrency/lock/locking.pb.cc /home/myuser/testa/cockroach-v20.1.0/src/github.com/cockroachdb/cockroach/c-deps/libroach/protos/roachpb/api.pb.cc /home/myuser/testa/cockroach-v20.1.0/src/github.com/cockroachdb/cockroach/c-deps/libroach/protos/roachpb/data.pb.cc /home/myuser/testa/cockroach-v20.1.0/src/github.com/cockroachdb/cockroach/c-deps/libroach/protos/roachpb/errors.pb.cc /home/myuser/testa/cockroach-v20.1.0/src/github.com/cockroachdb/cockroach/c-deps/libroach/protos/roachpb/internal.pb.cc /home/myuser/testa/cockroach-v20.1.0/src/github.com/cockroachdb/cockroach/c-deps/libroach/protos/roachpb/metadata.pb.cc /home/myuser/testa/cockroach-v20.1.0/src/github.com/cockroachdb/cockroach/c-deps/libroach/protos/storage/enginepb/file_registry.pb.cc /home/myuser/testa/cockroach-v20.1.0/src/github.com/cockroachdb/cockroach/c-deps/libroach/protos/storage/enginepb/mvcc.pb.cc /home/myuser/testa/cockroach-v20.1.0/src/github.com/cockroachdb/cockroach/c-deps/libroach/protos/storage/enginepb/mvcc3.pb.cc /home/myuser/testa/cockroach-v20.1.0/src/github.com/cockroachdb/cockroach/c-deps/libroach/protos/storage/enginepb/rocksdb.pb.cc /home/myuser/testa/cockroach-v20.1.0/src/github.com/cockroachdb/cockroach/c-deps/libroach/protos/util/hlc/legacy_timestamp.pb.cc /home/myuser/testa/cockroach-v20.1.0/src/github.com/cockroachdb/cockroach/c-deps/libroach/protos/util/hlc/timestamp.pb.cc /home/myuser/testa/cockroach-v20.1.0/src/github.com/cockroachdb/cockroach/c-deps/libroach/protos/util/log/log.pb.cc /home/myuser/testa/cockroach-v20.1.0/src/github.com/cockroachdb/cockroach/c-deps/libroach/protos/util/tracing/recorded_span.pb.cc /home/myuser/testa/cockroach-v20.1.0/src/github.com/cockroachdb/cockroach/c-deps/libroach/protos/util/unresolved_addr.pb.cc
  480. touch bin/.cpp_protobuf_sources
  481. rm -rf /home/myuser/testa/cockroach-v20.1.0/src/github.com/cockroachdb/cockroach/c-deps/libroach/protosccl
  482. mkdir -p /home/myuser/testa/cockroach-v20.1.0/src/github.com/cockroachdb/cockroach/c-deps/libroach/protosccl
  483. build/werror.sh /home/myuser/testa/cockroach-v20.1.0/native//protobuf/protoc -Ipkg:./vendor/github.com/gogo/protobuf:./vendor/github.com/gogo/protobuf/protobuf --cpp_out=lite:/home/myuser/testa/cockroach-v20.1.0/src/github.com/cockroachdb/cockroach/c-deps/libroach/protosccl ./pkg/ccl/baseccl/encryption_options.proto ./pkg/ccl/storageccl/engineccl/enginepbccl/key_registry.proto ./pkg/ccl/storageccl/engineccl/enginepbccl/stats.proto
  484. sed -i -E '/gogoproto/d' /home/myuser/testa/cockroach-v20.1.0/src/github.com/cockroachdb/cockroach/c-deps/libroach/protosccl/ccl/baseccl/encryption_options.pb.h /home/myuser/testa/cockroach-v20.1.0/src/github.com/cockroachdb/cockroach/c-deps/libroach/protosccl/ccl/storageccl/engineccl/enginepbccl/key_registry.pb.h /home/myuser/testa/cockroach-v20.1.0/src/github.com/cockroachdb/cockroach/c-deps/libroach/protosccl/ccl/storageccl/engineccl/enginepbccl/stats.pb.h /home/myuser/testa/cockroach-v20.1.0/src/github.com/cockroachdb/cockroach/c-deps/libroach/protosccl/ccl/baseccl/encryption_options.pb.cc /home/myuser/testa/cockroach-v20.1.0/src/github.com/cockroachdb/cockroach/c-deps/libroach/protosccl/ccl/storageccl/engineccl/enginepbccl/key_registry.pb.cc /home/myuser/testa/cockroach-v20.1.0/src/github.com/cockroachdb/cockroach/c-deps/libroach/protosccl/ccl/storageccl/engineccl/enginepbccl/stats.pb.cc
  485. touch bin/.cpp_ccl_protobuf_sources
  486. go install -v execgen
  487. bin/prereqs ./pkg/sql/colexec/execgen/cmd/execgen > bin/execgen.d.tmp
  488. mv -f bin/execgen.d.tmp bin/execgen.d
  489. github.com/cockroachdb/cockroach/pkg/sql/pgwire/pgcode
  490. github.com/cockroachdb/cockroach/vendor/github.com/cockroachdb/errors/stdstrings
  491. github.com/cockroachdb/cockroach/vendor/github.com/lib/pq/oid
  492. github.com/cockroachdb/cockroach/pkg/util/arith
  493. github.com/cockroachdb/cockroach/vendor/github.com/cockroachdb/apd
  494. github.com/cockroachdb/cockroach/vendor/github.com/certifi/gocertifi
  495. github.com/cockroachdb/cockroach/vendor/github.com/gogo/protobuf/sortkeys
  496. github.com/cockroachdb/cockroach/vendor/github.com/getsentry/raven-go
  497. github.com/cockroachdb/cockroach/vendor/github.com/cockroachdb/logtags
  498. github.com/cockroachdb/cockroach/vendor/github.com/gogo/protobuf/types
  499. github.com/cockroachdb/cockroach/vendor/github.com/lib/pq/scram
  500. github.com/cockroachdb/cockroach/vendor/github.com/lib/pq
  501. github.com/cockroachdb/cockroach/pkg/util/causer
  502. github.com/cockroachdb/cockroach/vendor/github.com/dustin/go-humanize
  503. github.com/cockroachdb/cockroach/pkg/util/stacktrace
  504. github.com/cockroachdb/cockroach/pkg/util/syncutil
  505. github.com/cockroachdb/cockroach/pkg/util/version
  506. github.com/cockroachdb/cockroach/pkg/util/humanizeutil
  507. github.com/cockroachdb/cockroach/pkg/util/envutil
  508. github.com/cockroachdb/cockroach/vendor/github.com/kr/text
  509. github.com/cockroachdb/cockroach/pkg/cli/cliflags
  510. github.com/cockroachdb/cockroach/pkg/build
  511. github.com/cockroachdb/cockroach/vendor/github.com/aws/aws-sdk-go/aws/awserr
  512. github.com/cockroachdb/cockroach/vendor/github.com/aws/aws-sdk-go/internal/ini
  513. github.com/cockroachdb/cockroach/vendor/github.com/aws/aws-sdk-go/internal/shareddefaults
  514. github.com/cockroachdb/cockroach/vendor/github.com/aws/aws-sdk-go/aws/credentials
  515. github.com/cockroachdb/cockroach/vendor/github.com/aws/aws-sdk-go/aws/endpoints
  516. github.com/cockroachdb/cockroach/vendor/github.com/aws/aws-sdk-go/internal/sdkio
  517. github.com/cockroachdb/cockroach/pkg/kv/kvserver/concurrency/lock
  518. github.com/cockroachdb/cockroach/pkg/util/randutil
  519. github.com/cockroachdb/cockroach/vendor/golang.org/x/tools/container/intsets
  520. github.com/cockroachdb/cockroach/pkg/util
  521. github.com/cockroachdb/cockroach/vendor/github.com/cockroachdb/errors/errorspb
  522. github.com/cockroachdb/cockroach/pkg/util/caller
  523. github.com/cockroachdb/cockroach/vendor/golang.org/x/sys/unix
  524. github.com/cockroachdb/cockroach/pkg/util/log/logflags
  525. github.com/cockroachdb/cockroach/vendor/github.com/golang/protobuf/ptypes/timestamp
  526. github.com/cockroachdb/cockroach/vendor/golang.org/x/net/context
  527. github.com/cockroachdb/cockroach/vendor/github.com/cockroachdb/errors/errbase
  528. github.com/cockroachdb/cockroach/vendor/golang.org/x/net/internal/timeseries
  529. github.com/cockroachdb/cockroach/vendor/golang.org/x/net/trace
  530. github.com/cockroachdb/cockroach/vendor/github.com/cockroachdb/errors/markers
  531. github.com/cockroachdb/cockroach/vendor/github.com/cockroachdb/errors/assert
  532. github.com/cockroachdb/cockroach/vendor/github.com/cockroachdb/errors/barriers
  533. github.com/cockroachdb/cockroach/vendor/github.com/cockroachdb/errors/withstack
  534. github.com/cockroachdb/cockroach/vendor/github.com/cockroachdb/errors/safedetails
  535. github.com/cockroachdb/cockroach/vendor/github.com/cockroachdb/errors/domains
  536. github.com/cockroachdb/cockroach/vendor/github.com/cockroachdb/errors/hintdetail
  537. github.com/cockroachdb/cockroach/vendor/github.com/cockroachdb/errors/issuelink
  538. github.com/cockroachdb/cockroach/vendor/github.com/cockroachdb/errors/contexttags
  539. github.com/cockroachdb/cockroach/vendor/github.com/cockroachdb/errors/errutil
  540. github.com/cockroachdb/cockroach/vendor/github.com/cockroachdb/errors/report
  541. github.com/cockroachdb/cockroach/vendor/github.com/cockroachdb/errors/secondary
  542. github.com/cockroachdb/cockroach/vendor/github.com/cockroachdb/errors/telemetrykeys
  543. github.com/cockroachdb/cockroach/pkg/util/sysutil
  544. github.com/cockroachdb/cockroach/vendor/google.golang.org/grpc/grpclog
  545. github.com/cockroachdb/cockroach/vendor/github.com/cockroachdb/errors
  546. github.com/cockroachdb/cockroach/pkg/util/fileutil
  547. github.com/cockroachdb/cockroach/vendor/google.golang.org/grpc/connectivity
  548. github.com/cockroachdb/cockroach/vendor/google.golang.org/grpc/credentials/internal
  549. github.com/cockroachdb/cockroach/vendor/google.golang.org/grpc/internal
  550. github.com/cockroachdb/cockroach/vendor/google.golang.org/grpc/metadata
  551. github.com/cockroachdb/cockroach/pkg/sql/pgwire/pgerror
  552. github.com/cockroachdb/cockroach/pkg/settings
  553. github.com/cockroachdb/cockroach/pkg/util/timeutil
  554. github.com/cockroachdb/cockroach/vendor/google.golang.org/grpc/credentials
  555. github.com/cockroachdb/cockroach/vendor/google.golang.org/grpc/resolver
  556. github.com/cockroachdb/cockroach/vendor/google.golang.org/grpc/balancer
  557. github.com/cockroachdb/cockroach/pkg/util/duration
  558. github.com/cockroachdb/cockroach/pkg/sql/colexec/execerror
  559. github.com/cockroachdb/cockroach/vendor/google.golang.org/grpc/balancer/base
  560. github.com/cockroachdb/cockroach/vendor/google.golang.org/grpc/internal/grpcrand
  561. github.com/cockroachdb/cockroach/vendor/google.golang.org/grpc/codes
  562. github.com/cockroachdb/cockroach/vendor/google.golang.org/grpc/balancer/roundrobin
  563. github.com/cockroachdb/cockroach/pkg/col/coltypes
  564. github.com/cockroachdb/cockroach/vendor/google.golang.org/grpc/encoding
  565. github.com/cockroachdb/cockroach/vendor/google.golang.org/grpc/internal/backoff
  566. github.com/cockroachdb/cockroach/vendor/google.golang.org/grpc/encoding/proto
  567. github.com/cockroachdb/cockroach/vendor/google.golang.org/grpc/internal/balancerload
  568. github.com/cockroachdb/cockroach/vendor/github.com/golang/protobuf/ptypes/any
  569. github.com/cockroachdb/cockroach/vendor/github.com/golang/protobuf/ptypes/duration
  570. github.com/cockroachdb/cockroach/vendor/google.golang.org/genproto/googleapis/rpc/status
  571. github.com/cockroachdb/cockroach/vendor/github.com/golang/protobuf/ptypes
  572. github.com/cockroachdb/cockroach/vendor/google.golang.org/grpc/binarylog/grpc_binarylog_v1
  573. github.com/cockroachdb/cockroach/vendor/google.golang.org/grpc/internal/channelz
  574. github.com/cockroachdb/cockroach/vendor/google.golang.org/grpc/status
  575. github.com/cockroachdb/cockroach/vendor/google.golang.org/grpc/internal/envconfig
  576. github.com/cockroachdb/cockroach/vendor/google.golang.org/grpc/internal/binarylog
  577. github.com/cockroachdb/cockroach/vendor/google.golang.org/grpc/internal/grpcsync
  578. github.com/cockroachdb/cockroach/vendor/golang.org/x/text/transform
  579. github.com/cockroachdb/cockroach/vendor/golang.org/x/text/unicode/bidi
  580. github.com/cockroachdb/cockroach/vendor/golang.org/x/text/unicode/norm
  581. github.com/cockroachdb/cockroach/vendor/golang.org/x/net/http2/hpack
  582. github.com/cockroachdb/cockroach/vendor/golang.org/x/text/secure/bidirule
  583. github.com/cockroachdb/cockroach/vendor/google.golang.org/grpc/internal/syscall
  584. github.com/cockroachdb/cockroach/vendor/google.golang.org/grpc/keepalive
  585. github.com/cockroachdb/cockroach/vendor/google.golang.org/grpc/peer
  586. github.com/cockroachdb/cockroach/vendor/google.golang.org/grpc/stats
  587. github.com/cockroachdb/cockroach/vendor/google.golang.org/grpc/tap
  588. github.com/cockroachdb/cockroach/vendor/github.com/aws/aws-sdk-go/aws
  589. github.com/cockroachdb/cockroach/vendor/google.golang.org/grpc/naming
  590. github.com/cockroachdb/cockroach/vendor/google.golang.org/grpc/resolver/dns
  591. github.com/cockroachdb/cockroach/vendor/google.golang.org/grpc/resolver/passthrough
  592. github.com/cockroachdb/cockroach/vendor/github.com/lightstep/lightstep-tracer-go/lightstep/rand
  593. github.com/cockroachdb/cockroach/vendor/github.com/lightstep/lightstep-tracer-go/thrift_0_9_2/lib/go/thrift
  594. github.com/cockroachdb/cockroach/vendor/github.com/lightstep/lightstep-tracer-go/lightsteppb
  595. github.com/cockroachdb/cockroach/vendor/github.com/opentracing/opentracing-go/log
  596. github.com/cockroachdb/cockroach/vendor/golang.org/x/net/idna
  597. github.com/cockroachdb/cockroach/vendor/github.com/DataDog/zstd
  598. github.com/cockroachdb/cockroach/vendor/github.com/opentracing/opentracing-go
  599. github.com/cockroachdb/cockroach/vendor/github.com/davecgh/go-spew/spew
  600. github.com/cockroachdb/cockroach/vendor/golang.org/x/net/http/httpguts
  601. github.com/cockroachdb/cockroach/vendor/golang.org/x/net/http2
  602. github.com/cockroachdb/cockroach/vendor/github.com/eapache/go-resiliency/breaker
  603. github.com/cockroachdb/cockroach/vendor/github.com/golang/snappy
  604. github.com/cockroachdb/cockroach/vendor/github.com/eapache/go-xerial-snappy
  605. github.com/cockroachdb/cockroach/vendor/github.com/eapache/queue
  606. github.com/cockroachdb/cockroach/vendor/github.com/pierrec/lz4/internal/xxh32
  607. github.com/cockroachdb/cockroach/vendor/github.com/pierrec/lz4
  608. github.com/cockroachdb/cockroach/vendor/github.com/rcrowley/go-metrics
  609. github.com/cockroachdb/cockroach/vendor/github.com/lightstep/lightstep-tracer-go/lightstep_thrift
  610. github.com/cockroachdb/cockroach/vendor/github.com/apache/thrift/lib/go/thrift
  611. github.com/cockroachdb/cockroach/vendor/google.golang.org/grpc/internal/transport
  612. github.com/cockroachdb/cockroach/vendor/github.com/go-logfmt/logfmt
  613. github.com/cockroachdb/cockroach/vendor/github.com/opentracing-contrib/go-observer
  614. github.com/cockroachdb/cockroach/vendor/github.com/opentracing/opentracing-go/ext
  615. github.com/cockroachdb/cockroach/vendor/github.com/openzipkin-contrib/zipkin-go-opentracing/flag
  616. github.com/cockroachdb/cockroach/vendor/github.com/openzipkin-contrib/zipkin-go-opentracing/types
  617. github.com/cockroachdb/cockroach/vendor/github.com/openzipkin-contrib/zipkin-go-opentracing/wire
  618. github.com/cockroachdb/cockroach/vendor/github.com/petermattis/goid
  619. github.com/cockroachdb/cockroach/pkg/util/uint128
  620. github.com/cockroachdb/cockroach/pkg/util/uuid
  621. github.com/cockroachdb/cockroach/pkg/util/bitarray
  622. github.com/cockroachdb/cockroach/pkg/util/ipaddr
  623. github.com/cockroachdb/cockroach/pkg/util/timeofday
  624. github.com/cockroachdb/cockroach/pkg/util/errorutil/unimplemented
  625. github.com/cockroachdb/cockroach/vendor/google.golang.org/grpc
  626. github.com/cockroachdb/cockroach/pkg/util/timeutil/pgdate
  627. github.com/cockroachdb/cockroach/vendor/github.com/openzipkin-contrib/zipkin-go-opentracing/thrift/gen-go/scribe
  628. github.com/cockroachdb/cockroach/pkg/util/timetz
  629. github.com/cockroachdb/cockroach/vendor/github.com/openzipkin-contrib/zipkin-go-opentracing/thrift/gen-go/zipkincore
  630. github.com/cockroachdb/cockroach/pkg/util/encoding
  631. github.com/cockroachdb/cockroach/vendor/github.com/biogo/store/llrb
  632. github.com/cockroachdb/cockroach/vendor/github.com/gogo/protobuf/jsonpb
  633. github.com/cockroachdb/cockroach/vendor/github.com/grpc-ecosystem/grpc-gateway/runtime/internal
  634. github.com/cockroachdb/cockroach/vendor/github.com/grpc-ecosystem/grpc-gateway/runtime
  635. github.com/cockroachdb/cockroach/vendor/github.com/lightstep/lightstep-tracer-go/collectorpb
  636. github.com/cockroachdb/cockroach/vendor/golang.org/x/sync/syncmap
  637. github.com/cockroachdb/cockroach/vendor/go.etcd.io/etcd/raft/quorum
  638. github.com/cockroachdb/cockroach/vendor/go.etcd.io/etcd/raft/raftpb
  639. github.com/cockroachdb/cockroach/vendor/github.com/VividCortex/ewma
  640. github.com/cockroachdb/cockroach/vendor/github.com/lightstep/lightstep-tracer-go
  641. github.com/cockroachdb/cockroach/vendor/github.com/codahale/hdrhistogram
  642. github.com/cockroachdb/cockroach/vendor/github.com/beorn7/perks/quantile
  643. github.com/cockroachdb/cockroach/vendor/github.com/prometheus/client_model/go
  644. github.com/cockroachdb/cockroach/vendor/go.etcd.io/etcd/raft/tracker
  645. github.com/cockroachdb/cockroach/vendor/github.com/prometheus/client_golang/prometheus/internal
  646. github.com/cockroachdb/cockroach/vendor/github.com/matttproud/golang_protobuf_extensions/pbutil
  647. github.com/cockroachdb/cockroach/vendor/go.etcd.io/etcd/raft/confchange
  648. github.com/cockroachdb/cockroach/vendor/github.com/prometheus/common/internal/bitbucket.org/ww/goautoneg
  649. github.com/cockroachdb/cockroach/vendor/github.com/prometheus/common/model
  650. github.com/cockroachdb/cockroach/vendor/github.com/prometheus/procfs/internal/util
  651. github.com/cockroachdb/cockroach/vendor/github.com/prometheus/procfs/nfs
  652. github.com/cockroachdb/cockroach/vendor/github.com/prometheus/procfs/xfs
  653. github.com/cockroachdb/cockroach/vendor/golang.org/x/crypto/blowfish
  654. github.com/cockroachdb/cockroach/vendor/github.com/prometheus/procfs
  655. github.com/cockroachdb/cockroach/vendor/github.com/prometheus/common/expfmt
  656. github.com/cockroachdb/cockroach/vendor/golang.org/x/crypto/bcrypt
  657. github.com/cockroachdb/cockroach/vendor/golang.org/x/crypto/ssh/terminal
  658. github.com/cockroachdb/cockroach/vendor/github.com/kr/pretty
  659. github.com/cockroachdb/cockroach/vendor/github.com/cockroachdb/cmux
  660. github.com/cockroachdb/cockroach/vendor/github.com/prometheus/client_golang/prometheus
  661. github.com/cockroachdb/cockroach/pkg/util/retry
  662. github.com/cockroachdb/cockroach/pkg/sql/sessiondata
  663. github.com/cockroachdb/cockroach/pkg/util/stringencoding
  664. github.com/cockroachdb/cockroach/pkg/sql/privilege
  665. github.com/cockroachdb/cockroach/pkg/sql/lex
  666. github.com/cockroachdb/cockroach/pkg/util/unique
  667. github.com/cockroachdb/cockroach/pkg/util/json
  668. github.com/cockroachdb/cockroach/vendor/github.com/prometheus/client_golang/prometheus/graphite
  669. github.com/cockroachdb/cockroach/pkg/util/pretty
  670. github.com/cockroachdb/cockroach/pkg/util/ring
  671. github.com/cockroachdb/cockroach/vendor/golang.org/x/text/internal/tag
  672. github.com/cockroachdb/cockroach/vendor/golang.org/x/text/language
  673. github.com/cockroachdb/cockroach/vendor/golang.org/x/text/internal/colltab
  674. github.com/cockroachdb/cockroach/vendor/golang.org/x/text/collate
  675. github.com/cockroachdb/cockroach/vendor/github.com/Shopify/sarama
  676. github.com/cockroachdb/cockroach/vendor/github.com/openzipkin-contrib/zipkin-go-opentracing
  677. github.com/cockroachdb/cockroach/pkg/util/tracing
  678. github.com/cockroachdb/cockroach/pkg/util/log
  679. github.com/cockroachdb/cockroach/pkg/util/interval
  680. github.com/cockroachdb/cockroach/pkg/util/hlc
  681. github.com/cockroachdb/cockroach/pkg/util/protoutil
  682. github.com/cockroachdb/cockroach/pkg/util/metric
  683. github.com/cockroachdb/cockroach/pkg/util/quotapool
  684. github.com/cockroachdb/cockroach/pkg/util/contextutil
  685. github.com/cockroachdb/cockroach/pkg/server/telemetry
  686. github.com/cockroachdb/cockroach/pkg/sql/types
  687. github.com/cockroachdb/cockroach/pkg/util/cache
  688. github.com/cockroachdb/cockroach/pkg/sql/sqltelemetry
  689. github.com/cockroachdb/cockroach/pkg/storage/enginepb
  690. github.com/cockroachdb/cockroach/pkg/roachpb
  691. github.com/cockroachdb/cockroach/pkg/clusterversion
  692. github.com/cockroachdb/cockroach/pkg/keys
  693. github.com/cockroachdb/cockroach/pkg/util/stop
  694. github.com/cockroachdb/cockroach/pkg/util/netutil
  695. github.com/cockroachdb/cockroach/pkg/settings/cluster
  696. github.com/cockroachdb/cockroach/pkg/security
  697. github.com/cockroachdb/cockroach/pkg/util/mon
  698. github.com/cockroachdb/cockroach/pkg/sql/roleoption
  699. github.com/cockroachdb/cockroach/pkg/base
  700. github.com/cockroachdb/cockroach/pkg/kv
  701. github.com/cockroachdb/cockroach/pkg/sql/sem/tree
  702. github.com/cockroachdb/cockroach/pkg/sql/colexec/typeconv
  703. github.com/cockroachdb/cockroach/pkg/sql/colexec/execgen/cmd/execgen
  704. EXECGEN bin/execgen_out.d
  705. Running make with -j4
  706. GOPATH set to /home/myuser/testa/cockroach-v20.1.0
  707. rm -rf /home/myuser/testa/cockroach-v20.1.0/native/aarch64-linux-gnu/protobuf
  708. mkdir -p /home/myuser/testa/cockroach-v20.1.0/native/aarch64-linux-gnu/protobuf
  709. cd /home/myuser/testa/cockroach-v20.1.0/native/aarch64-linux-gnu/protobuf && cmake -DCMAKE_TARGET_MESSAGES=OFF   -Dprotobuf_BUILD_TESTS=OFF /home/myuser/testa/cockroach-v20.1.0/src/github.com/cockroachdb/cockroach/c-deps/protobuf/cmake \
  710.   -DCMAKE_BUILD_TYPE=Release
  711. -- The C compiler identification is GNU 7.5.0
  712. -- The CXX compiler identification is GNU 7.5.0
  713. -- Check for working C compiler: /usr/bin/cc
  714. -- Check for working C compiler: /usr/bin/cc -- works
  715. -- Detecting C compiler ABI info
  716. -- Detecting C compiler ABI info - done
  717. -- Detecting C compile features
  718. -- Detecting C compile features - done
  719. -- Check for working CXX compiler: /usr/bin/c++
  720. -- Check for working CXX compiler: /usr/bin/c++ -- works
  721. -- Detecting CXX compiler ABI info
  722. -- Detecting CXX compiler ABI info - done
  723. -- Detecting CXX compile features
  724. -- Detecting CXX compile features - done
  725. -- Looking for pthread.h
  726. -- Looking for pthread.h - found
  727. -- Looking for pthread_create
  728. -- Looking for pthread_create - not found
  729. -- Looking for pthread_create in pthreads
  730. -- Looking for pthread_create in pthreads - not found
  731. -- Looking for pthread_create in pthread
  732. -- Looking for pthread_create in pthread - found
  733. -- Found Threads: TRUE  
  734. -- Could NOT find ZLIB (missing: ZLIB_LIBRARY ZLIB_INCLUDE_DIR)
  735. -- Configuring done
  736. -- Generating done
  737. -- Build files have been written to: /home/myuser/testa/cockroach-v20.1.0/native/aarch64-linux-gnu/protobuf
  738. Scanning dependencies of target libprotobuf
  739. fatal: not a git repository (or any of the parent directories): .git
  740. [  2%] Building CXX object CMakeFiles/libprotobuf.dir/home/myuser/testa/cockroach-v20.1.0/src/github.com/cockroachdb/cockroach/c-deps/protobuf/src/google/protobuf/arenastring.cc.o
  741. [  2%] Building CXX object CMakeFiles/libprotobuf.dir/home/myuser/testa/cockroach-v20.1.0/src/github.com/cockroachdb/cockroach/c-deps/protobuf/src/google/protobuf/arena.cc.o
  742. [  2%] Building CXX object CMakeFiles/libprotobuf.dir/home/myuser/testa/cockroach-v20.1.0/src/github.com/cockroachdb/cockroach/c-deps/protobuf/src/google/protobuf/extension_set.cc.o
  743. [  4%] Building CXX object CMakeFiles/libprotobuf.dir/home/myuser/testa/cockroach-v20.1.0/src/github.com/cockroachdb/cockroach/c-deps/protobuf/src/google/protobuf/generated_message_table_driven_lite.cc.o
  744. [  7%] Building CXX object CMakeFiles/libprotobuf.dir/home/myuser/testa/cockroach-v20.1.0/src/github.com/cockroachdb/cockroach/c-deps/protobuf/src/google/protobuf/generated_message_util.cc.o
  745. [  7%] Building CXX object CMakeFiles/libprotobuf.dir/home/myuser/testa/cockroach-v20.1.0/src/github.com/cockroachdb/cockroach/c-deps/protobuf/src/google/protobuf/implicit_weak_message.cc.o
  746. [  7%] Building CXX object CMakeFiles/libprotobuf.dir/home/myuser/testa/cockroach-v20.1.0/src/github.com/cockroachdb/cockroach/c-deps/protobuf/src/google/protobuf/io/coded_stream.cc.o
  747. [  9%] Building CXX object CMakeFiles/libprotobuf.dir/home/myuser/testa/cockroach-v20.1.0/src/github.com/cockroachdb/cockroach/c-deps/protobuf/src/google/protobuf/io/zero_copy_stream.cc.o
  748. [  9%] Building CXX object CMakeFiles/libprotobuf.dir/home/myuser/testa/cockroach-v20.1.0/src/github.com/cockroachdb/cockroach/c-deps/protobuf/src/google/protobuf/io/zero_copy_stream_impl_lite.cc.o
  749. [  9%] Building CXX object CMakeFiles/libprotobuf.dir/home/myuser/testa/cockroach-v20.1.0/src/github.com/cockroachdb/cockroach/c-deps/protobuf/src/google/protobuf/repeated_field.cc.o
  750. [ 12%] Building CXX object CMakeFiles/libprotobuf.dir/home/myuser/testa/cockroach-v20.1.0/src/github.com/cockroachdb/cockroach/c-deps/protobuf/src/google/protobuf/message_lite.cc.o
  751. [ 14%] Building CXX object CMakeFiles/libprotobuf.dir/home/myuser/testa/cockroach-v20.1.0/src/github.com/cockroachdb/cockroach/c-deps/protobuf/src/google/protobuf/stubs/bytestream.cc.o
  752. [ 14%] Building CXX object CMakeFiles/libprotobuf.dir/home/myuser/testa/cockroach-v20.1.0/src/github.com/cockroachdb/cockroach/c-deps/protobuf/src/google/protobuf/stubs/common.cc.o
  753. [ 17%] Building CXX object CMakeFiles/libprotobuf.dir/home/myuser/testa/cockroach-v20.1.0/src/github.com/cockroachdb/cockroach/c-deps/protobuf/src/google/protobuf/stubs/int128.cc.o
  754. [ 17%] Building CXX object CMakeFiles/libprotobuf.dir/home/myuser/testa/cockroach-v20.1.0/src/github.com/cockroachdb/cockroach/c-deps/protobuf/src/google/protobuf/stubs/io_win32.cc.o
  755. [ 19%] Building CXX object CMakeFiles/libprotobuf.dir/home/myuser/testa/cockroach-v20.1.0/src/github.com/cockroachdb/cockroach/c-deps/protobuf/src/google/protobuf/stubs/status.cc.o
  756. [ 19%] Building CXX object CMakeFiles/libprotobuf.dir/home/myuser/testa/cockroach-v20.1.0/src/github.com/cockroachdb/cockroach/c-deps/protobuf/src/google/protobuf/stubs/statusor.cc.o
  757. [ 21%] Building CXX object CMakeFiles/libprotobuf.dir/home/myuser/testa/cockroach-v20.1.0/src/github.com/cockroachdb/cockroach/c-deps/protobuf/src/google/protobuf/stubs/strutil.cc.o
  758. [ 21%] Building CXX object CMakeFiles/libprotobuf.dir/home/myuser/testa/cockroach-v20.1.0/src/github.com/cockroachdb/cockroach/c-deps/protobuf/src/google/protobuf/stubs/stringprintf.cc.o
  759. [ 21%] Building CXX object CMakeFiles/libprotobuf.dir/home/myuser/testa/cockroach-v20.1.0/src/github.com/cockroachdb/cockroach/c-deps/protobuf/src/google/protobuf/stubs/stringpiece.cc.o
  760. [ 24%] Building CXX object CMakeFiles/libprotobuf.dir/home/myuser/testa/cockroach-v20.1.0/src/github.com/cockroachdb/cockroach/c-deps/protobuf/src/google/protobuf/stubs/structurally_valid.cc.o
  761. [ 29%] Building CXX object CMakeFiles/libprotobuf.dir/home/myuser/testa/cockroach-v20.1.0/src/github.com/cockroachdb/cockroach/c-deps/protobuf/src/google/protobuf/stubs/time.cc.o
  762. [ 29%] Building CXX object CMakeFiles/libprotobuf.dir/home/myuser/testa/cockroach-v20.1.0/src/github.com/cockroachdb/cockroach/c-deps/protobuf/src/google/protobuf/wire_format_lite.cc.o
  763. [ 29%] Building CXX object CMakeFiles/libprotobuf.dir/home/myuser/testa/cockroach-v20.1.0/src/github.com/cockroachdb/cockroach/c-deps/protobuf/src/google/protobuf/any.cc.o
  764. [ 34%] Building CXX object CMakeFiles/libprotobuf.dir/home/myuser/testa/cockroach-v20.1.0/src/github.com/cockroachdb/cockroach/c-deps/protobuf/src/google/protobuf/compiler/importer.cc.o
  765. [ 34%] Building CXX object CMakeFiles/libprotobuf.dir/home/myuser/testa/cockroach-v20.1.0/src/github.com/cockroachdb/cockroach/c-deps/protobuf/src/google/protobuf/any.pb.cc.o
  766. [ 34%] Building CXX object CMakeFiles/libprotobuf.dir/home/myuser/testa/cockroach-v20.1.0/src/github.com/cockroachdb/cockroach/c-deps/protobuf/src/google/protobuf/api.pb.cc.o
  767. [ 34%] Building CXX object CMakeFiles/libprotobuf.dir/home/myuser/testa/cockroach-v20.1.0/src/github.com/cockroachdb/cockroach/c-deps/protobuf/src/google/protobuf/compiler/parser.cc.o
  768. [ 36%] Building CXX object CMakeFiles/libprotobuf.dir/home/myuser/testa/cockroach-v20.1.0/src/github.com/cockroachdb/cockroach/c-deps/protobuf/src/google/protobuf/descriptor.cc.o
  769. [ 36%] Building CXX object CMakeFiles/libprotobuf.dir/home/myuser/testa/cockroach-v20.1.0/src/github.com/cockroachdb/cockroach/c-deps/protobuf/src/google/protobuf/descriptor.pb.cc.o
  770. [ 39%] Building CXX object CMakeFiles/libprotobuf.dir/home/myuser/testa/cockroach-v20.1.0/src/github.com/cockroachdb/cockroach/c-deps/protobuf/src/google/protobuf/descriptor_database.cc.o
  771. [ 39%] Building CXX object CMakeFiles/libprotobuf.dir/home/myuser/testa/cockroach-v20.1.0/src/github.com/cockroachdb/cockroach/c-deps/protobuf/src/google/protobuf/duration.pb.cc.o
  772. [ 41%] Building CXX object CMakeFiles/libprotobuf.dir/home/myuser/testa/cockroach-v20.1.0/src/github.com/cockroachdb/cockroach/c-deps/protobuf/src/google/protobuf/dynamic_message.cc.o
  773. [ 41%] Building CXX object CMakeFiles/libprotobuf.dir/home/myuser/testa/cockroach-v20.1.0/src/github.com/cockroachdb/cockroach/c-deps/protobuf/src/google/protobuf/empty.pb.cc.o
  774. [ 43%] Building CXX object CMakeFiles/libprotobuf.dir/home/myuser/testa/cockroach-v20.1.0/src/github.com/cockroachdb/cockroach/c-deps/protobuf/src/google/protobuf/extension_set_heavy.cc.o
  775. [ 43%] Building CXX object CMakeFiles/libprotobuf.dir/home/myuser/testa/cockroach-v20.1.0/src/github.com/cockroachdb/cockroach/c-deps/protobuf/src/google/protobuf/field_mask.pb.cc.o
  776. [ 46%] Building CXX object CMakeFiles/libprotobuf.dir/home/myuser/testa/cockroach-v20.1.0/src/github.com/cockroachdb/cockroach/c-deps/protobuf/src/google/protobuf/generated_message_reflection.cc.o
  777. [ 46%] Building CXX object CMakeFiles/libprotobuf.dir/home/myuser/testa/cockroach-v20.1.0/src/github.com/cockroachdb/cockroach/c-deps/protobuf/src/google/protobuf/generated_message_table_driven.cc.o
  778. [ 48%] Building CXX object CMakeFiles/libprotobuf.dir/home/myuser/testa/cockroach-v20.1.0/src/github.com/cockroachdb/cockroach/c-deps/protobuf/src/google/protobuf/io/gzip_stream.cc.o
  779. [ 48%] Building CXX object CMakeFiles/libprotobuf.dir/home/myuser/testa/cockroach-v20.1.0/src/github.com/cockroachdb/cockroach/c-deps/protobuf/src/google/protobuf/io/printer.cc.o
  780. [ 51%] Building CXX object CMakeFiles/libprotobuf.dir/home/myuser/testa/cockroach-v20.1.0/src/github.com/cockroachdb/cockroach/c-deps/protobuf/src/google/protobuf/io/strtod.cc.o
  781. [ 51%] Building CXX object CMakeFiles/libprotobuf.dir/home/myuser/testa/cockroach-v20.1.0/src/github.com/cockroachdb/cockroach/c-deps/protobuf/src/google/protobuf/io/tokenizer.cc.o
  782. [ 53%] Building CXX object CMakeFiles/libprotobuf.dir/home/myuser/testa/cockroach-v20.1.0/src/github.com/cockroachdb/cockroach/c-deps/protobuf/src/google/protobuf/io/zero_copy_stream_impl.cc.o
  783. [ 53%] Building CXX object CMakeFiles/libprotobuf.dir/home/myuser/testa/cockroach-v20.1.0/src/github.com/cockroachdb/cockroach/c-deps/protobuf/src/google/protobuf/map_field.cc.o
  784. [ 56%] Building CXX object CMakeFiles/libprotobuf.dir/home/myuser/testa/cockroach-v20.1.0/src/github.com/cockroachdb/cockroach/c-deps/protobuf/src/google/protobuf/message.cc.o
  785. [ 58%] Building CXX object CMakeFiles/libprotobuf.dir/home/myuser/testa/cockroach-v20.1.0/src/github.com/cockroachdb/cockroach/c-deps/protobuf/src/google/protobuf/service.cc.o
  786. [ 58%] Building CXX object CMakeFiles/libprotobuf.dir/home/myuser/testa/cockroach-v20.1.0/src/github.com/cockroachdb/cockroach/c-deps/protobuf/src/google/protobuf/reflection_ops.cc.o
  787. [ 60%] Building CXX object CMakeFiles/libprotobuf.dir/home/myuser/testa/cockroach-v20.1.0/src/github.com/cockroachdb/cockroach/c-deps/protobuf/src/google/protobuf/source_context.pb.cc.o
  788. [ 63%] Building CXX object CMakeFiles/libprotobuf.dir/home/myuser/testa/cockroach-v20.1.0/src/github.com/cockroachdb/cockroach/c-deps/protobuf/src/google/protobuf/struct.pb.cc.o
  789. [ 63%] Building CXX object CMakeFiles/libprotobuf.dir/home/myuser/testa/cockroach-v20.1.0/src/github.com/cockroachdb/cockroach/c-deps/protobuf/src/google/protobuf/stubs/mathlimits.cc.o
  790. [ 63%] Building CXX object CMakeFiles/libprotobuf.dir/home/myuser/testa/cockroach-v20.1.0/src/github.com/cockroachdb/cockroach/c-deps/protobuf/src/google/protobuf/stubs/substitute.cc.o
  791. [ 65%] Building CXX object CMakeFiles/libprotobuf.dir/home/myuser/testa/cockroach-v20.1.0/src/github.com/cockroachdb/cockroach/c-deps/protobuf/src/google/protobuf/text_format.cc.o
  792. [ 65%] Building CXX object CMakeFiles/libprotobuf.dir/home/myuser/testa/cockroach-v20.1.0/src/github.com/cockroachdb/cockroach/c-deps/protobuf/src/google/protobuf/timestamp.pb.cc.o
  793. [ 68%] Building CXX object CMakeFiles/libprotobuf.dir/home/myuser/testa/cockroach-v20.1.0/src/github.com/cockroachdb/cockroach/c-deps/protobuf/src/google/protobuf/type.pb.cc.o
  794. [ 68%] Building CXX object CMakeFiles/libprotobuf.dir/home/myuser/testa/cockroach-v20.1.0/src/github.com/cockroachdb/cockroach/c-deps/protobuf/src/google/protobuf/unknown_field_set.cc.o
  795. [ 70%] Building CXX object CMakeFiles/libprotobuf.dir/home/myuser/testa/cockroach-v20.1.0/src/github.com/cockroachdb/cockroach/c-deps/protobuf/src/google/protobuf/util/field_comparator.cc.o
  796. [ 70%] Building CXX object CMakeFiles/libprotobuf.dir/home/myuser/testa/cockroach-v20.1.0/src/github.com/cockroachdb/cockroach/c-deps/protobuf/src/google/protobuf/util/delimited_message_util.cc.o
  797. [ 73%] Building CXX object CMakeFiles/libprotobuf.dir/home/myuser/testa/cockroach-v20.1.0/src/github.com/cockroachdb/cockroach/c-deps/protobuf/src/google/protobuf/util/field_mask_util.cc.o
  798. [ 73%] Building CXX object CMakeFiles/libprotobuf.dir/home/myuser/testa/cockroach-v20.1.0/src/github.com/cockroachdb/cockroach/c-deps/protobuf/src/google/protobuf/util/internal/datapiece.cc.o
  799. [ 75%] Building CXX object CMakeFiles/libprotobuf.dir/home/myuser/testa/cockroach-v20.1.0/src/github.com/cockroachdb/cockroach/c-deps/protobuf/src/google/protobuf/util/internal/default_value_objectwriter.cc.o
  800. [ 75%] Building CXX object CMakeFiles/libprotobuf.dir/home/myuser/testa/cockroach-v20.1.0/src/github.com/cockroachdb/cockroach/c-deps/protobuf/src/google/protobuf/util/internal/error_listener.cc.o
  801. [ 78%] Building CXX object CMakeFiles/libprotobuf.dir/home/myuser/testa/cockroach-v20.1.0/src/github.com/cockroachdb/cockroach/c-deps/protobuf/src/google/protobuf/util/internal/field_mask_utility.cc.o
  802. [ 78%] Building CXX object CMakeFiles/libprotobuf.dir/home/myuser/testa/cockroach-v20.1.0/src/github.com/cockroachdb/cockroach/c-deps/protobuf/src/google/protobuf/util/internal/json_escaping.cc.o
  803. [ 80%] Building CXX object CMakeFiles/libprotobuf.dir/home/myuser/testa/cockroach-v20.1.0/src/github.com/cockroachdb/cockroach/c-deps/protobuf/src/google/protobuf/util/internal/json_objectwriter.cc.o
  804. [ 80%] Building CXX object CMakeFiles/libprotobuf.dir/home/myuser/testa/cockroach-v20.1.0/src/github.com/cockroachdb/cockroach/c-deps/protobuf/src/google/protobuf/util/internal/json_stream_parser.cc.o
  805. [ 82%] Building CXX object CMakeFiles/libprotobuf.dir/home/myuser/testa/cockroach-v20.1.0/src/github.com/cockroachdb/cockroach/c-deps/protobuf/src/google/protobuf/util/internal/object_writer.cc.o
  806. [ 82%] Building CXX object CMakeFiles/libprotobuf.dir/home/myuser/testa/cockroach-v20.1.0/src/github.com/cockroachdb/cockroach/c-deps/protobuf/src/google/protobuf/util/internal/proto_writer.cc.o
  807. [ 85%] Building CXX object CMakeFiles/libprotobuf.dir/home/myuser/testa/cockroach-v20.1.0/src/github.com/cockroachdb/cockroach/c-deps/protobuf/src/google/protobuf/util/internal/protostream_objectsource.cc.o
  808. /home/myuser/testa/cockroach-v20.1.0/src/github.com/cockroachdb/cockroach/c-deps/protobuf/src/google/protobuf/util/internal/protostream_objectsource.cc: In static member function 'static google::protobuf::util::Status google::protobuf::util::converter::ProtoStreamObjectSource::RenderDuration(const google::protobuf::util::converter::ProtoStreamObjectSource*, const google::protobuf::Type&, google::protobuf::StringPiece, google::protobuf::util::converter::ObjectWriter*)':
  809. /home/myuser/testa/cockroach-v20.1.0/src/github.com/cockroachdb/cockroach/c-deps/protobuf/src/google/protobuf/util/internal/protostream_objectsource.cc:388:19: warning: format '%lld' expects argument of type 'long long int', but argument 3 has type 'google::protobuf::int64 {aka long int}' [-Wformat=]
  810.            .c_str());
  811.                    ^
  812. [ 85%] Building CXX object CMakeFiles/libprotobuf.dir/home/myuser/testa/cockroach-v20.1.0/src/github.com/cockroachdb/cockroach/c-deps/protobuf/src/google/protobuf/util/internal/protostream_objectwriter.cc.o
  813. [ 87%] Building CXX object CMakeFiles/libprotobuf.dir/home/myuser/testa/cockroach-v20.1.0/src/github.com/cockroachdb/cockroach/c-deps/protobuf/src/google/protobuf/util/internal/type_info.cc.o
  814. [ 90%] Building CXX object CMakeFiles/libprotobuf.dir/home/myuser/testa/cockroach-v20.1.0/src/github.com/cockroachdb/cockroach/c-deps/protobuf/src/google/protobuf/util/internal/type_info_test_helper.cc.o
  815. [ 90%] Building CXX object CMakeFiles/libprotobuf.dir/home/myuser/testa/cockroach-v20.1.0/src/github.com/cockroachdb/cockroach/c-deps/protobuf/src/google/protobuf/util/internal/utility.cc.o
  816. [ 92%] Building CXX object CMakeFiles/libprotobuf.dir/home/myuser/testa/cockroach-v20.1.0/src/github.com/cockroachdb/cockroach/c-deps/protobuf/src/google/protobuf/util/message_differencer.cc.o
  817. [ 92%] Building CXX object CMakeFiles/libprotobuf.dir/home/myuser/testa/cockroach-v20.1.0/src/github.com/cockroachdb/cockroach/c-deps/protobuf/src/google/protobuf/util/json_util.cc.o
  818. [ 95%] Building CXX object CMakeFiles/libprotobuf.dir/home/myuser/testa/cockroach-v20.1.0/src/github.com/cockroachdb/cockroach/c-deps/protobuf/src/google/protobuf/util/time_util.cc.o
  819. [ 97%] Building CXX object CMakeFiles/libprotobuf.dir/home/myuser/testa/cockroach-v20.1.0/src/github.com/cockroachdb/cockroach/c-deps/protobuf/src/google/protobuf/util/type_resolver_util.cc.o
  820. [ 97%] Building CXX object CMakeFiles/libprotobuf.dir/home/myuser/testa/cockroach-v20.1.0/src/github.com/cockroachdb/cockroach/c-deps/protobuf/src/google/protobuf/wire_format.cc.o
  821. [ 97%] Building CXX object CMakeFiles/libprotobuf.dir/home/myuser/testa/cockroach-v20.1.0/src/github.com/cockroachdb/cockroach/c-deps/protobuf/src/google/protobuf/wrappers.pb.cc.o
  822. [100%] Linking CXX static library libprotobuf.a
  823. Scanning dependencies of target js_embed
  824. [  0%] Building CXX object CMakeFiles/js_embed.dir/home/myuser/testa/cockroach-v20.1.0/src/github.com/cockroachdb/cockroach/c-deps/protobuf/src/google/protobuf/compiler/js/embed.cc.o
  825. [  1%] Linking CXX executable js_embed
  826. [  2%] Generating /home/myuser/testa/cockroach-v20.1.0/src/github.com/cockroachdb/cockroach/c-deps/protobuf/src/google/protobuf/compiler/js/well_known_types_embed.cc
  827. Scanning dependencies of target libprotoc
  828. [  2%] Building CXX object CMakeFiles/libprotoc.dir/home/myuser/testa/cockroach-v20.1.0/src/github.com/cockroachdb/cockroach/c-deps/protobuf/src/google/protobuf/compiler/code_generator.cc.o
  829. [  3%] Building CXX object CMakeFiles/libprotoc.dir/home/myuser/testa/cockroach-v20.1.0/src/github.com/cockroachdb/cockroach/c-deps/protobuf/src/google/protobuf/compiler/command_line_interface.cc.o
  830. [  3%] Building CXX object CMakeFiles/libprotoc.dir/home/myuser/testa/cockroach-v20.1.0/src/github.com/cockroachdb/cockroach/c-deps/protobuf/src/google/protobuf/compiler/cpp/cpp_enum.cc.o
  831. [  4%] Building CXX object CMakeFiles/libprotoc.dir/home/myuser/testa/cockroach-v20.1.0/src/github.com/cockroachdb/cockroach/c-deps/protobuf/src/google/protobuf/compiler/cpp/cpp_enum_field.cc.o
  832. [  4%] Building CXX object CMakeFiles/libprotoc.dir/home/myuser/testa/cockroach-v20.1.0/src/github.com/cockroachdb/cockroach/c-deps/protobuf/src/google/protobuf/compiler/cpp/cpp_extension.cc.o
  833. [  5%] Building CXX object CMakeFiles/libprotoc.dir/home/myuser/testa/cockroach-v20.1.0/src/github.com/cockroachdb/cockroach/c-deps/protobuf/src/google/protobuf/compiler/cpp/cpp_field.cc.o
  834. [  5%] Building CXX object CMakeFiles/libprotoc.dir/home/myuser/testa/cockroach-v20.1.0/src/github.com/cockroachdb/cockroach/c-deps/protobuf/src/google/protobuf/compiler/cpp/cpp_file.cc.o
  835. [  6%] Building CXX object CMakeFiles/libprotoc.dir/home/myuser/testa/cockroach-v20.1.0/src/github.com/cockroachdb/cockroach/c-deps/protobuf/src/google/protobuf/compiler/cpp/cpp_generator.cc.o
  836. [  6%] Building CXX object CMakeFiles/libprotoc.dir/home/myuser/testa/cockroach-v20.1.0/src/github.com/cockroachdb/cockroach/c-deps/protobuf/src/google/protobuf/compiler/cpp/cpp_helpers.cc.o
  837. [  7%] Building CXX object CMakeFiles/libprotoc.dir/home/myuser/testa/cockroach-v20.1.0/src/github.com/cockroachdb/cockroach/c-deps/protobuf/src/google/protobuf/compiler/cpp/cpp_map_field.cc.o
  838. [  7%] Building CXX object CMakeFiles/libprotoc.dir/home/myuser/testa/cockroach-v20.1.0/src/github.com/cockroachdb/cockroach/c-deps/protobuf/src/google/protobuf/compiler/cpp/cpp_message.cc.o
  839. [  9%] Building CXX object CMakeFiles/libprotoc.dir/home/myuser/testa/cockroach-v20.1.0/src/github.com/cockroachdb/cockroach/c-deps/protobuf/src/google/protobuf/compiler/cpp/cpp_message_field.cc.o
  840. [  9%] Building CXX object CMakeFiles/libprotoc.dir/home/myuser/testa/cockroach-v20.1.0/src/github.com/cockroachdb/cockroach/c-deps/protobuf/src/google/protobuf/compiler/cpp/cpp_padding_optimizer.cc.o
  841. [ 10%] Building CXX object CMakeFiles/libprotoc.dir/home/myuser/testa/cockroach-v20.1.0/src/github.com/cockroachdb/cockroach/c-deps/protobuf/src/google/protobuf/compiler/cpp/cpp_primitive_field.cc.o
  842. [ 11%] Building CXX object CMakeFiles/libprotoc.dir/home/myuser/testa/cockroach-v20.1.0/src/github.com/cockroachdb/cockroach/c-deps/protobuf/src/google/protobuf/compiler/cpp/cpp_service.cc.o
  843. [ 11%] Building CXX object CMakeFiles/libprotoc.dir/home/myuser/testa/cockroach-v20.1.0/src/github.com/cockroachdb/cockroach/c-deps/protobuf/src/google/protobuf/compiler/cpp/cpp_string_field.cc.o
  844. [ 12%] Building CXX object CMakeFiles/libprotoc.dir/home/myuser/testa/cockroach-v20.1.0/src/github.com/cockroachdb/cockroach/c-deps/protobuf/src/google/protobuf/compiler/csharp/csharp_doc_comment.cc.o
  845. [ 12%] Building CXX object CMakeFiles/libprotoc.dir/home/myuser/testa/cockroach-v20.1.0/src/github.com/cockroachdb/cockroach/c-deps/protobuf/src/google/protobuf/compiler/csharp/csharp_enum.cc.o
  846. [ 13%] Building CXX object CMakeFiles/libprotoc.dir/home/myuser/testa/cockroach-v20.1.0/src/github.com/cockroachdb/cockroach/c-deps/protobuf/src/google/protobuf/compiler/csharp/csharp_enum_field.cc.o
  847. [ 13%] Building CXX object CMakeFiles/libprotoc.dir/home/myuser/testa/cockroach-v20.1.0/src/github.com/cockroachdb/cockroach/c-deps/protobuf/src/google/protobuf/compiler/csharp/csharp_field_base.cc.o
  848. [ 14%] Building CXX object CMakeFiles/libprotoc.dir/home/myuser/testa/cockroach-v20.1.0/src/github.com/cockroachdb/cockroach/c-deps/protobuf/src/google/protobuf/compiler/csharp/csharp_generator.cc.o
  849. [ 14%] Building CXX object CMakeFiles/libprotoc.dir/home/myuser/testa/cockroach-v20.1.0/src/github.com/cockroachdb/cockroach/c-deps/protobuf/src/google/protobuf/compiler/csharp/csharp_helpers.cc.o
  850. [ 15%] Building CXX object CMakeFiles/libprotoc.dir/home/myuser/testa/cockroach-v20.1.0/src/github.com/cockroachdb/cockroach/c-deps/protobuf/src/google/protobuf/compiler/csharp/csharp_map_field.cc.o
  851. [ 15%] Building CXX object CMakeFiles/libprotoc.dir/home/myuser/testa/cockroach-v20.1.0/src/github.com/cockroachdb/cockroach/c-deps/protobuf/src/google/protobuf/compiler/csharp/csharp_message.cc.o
  852. [ 17%] Building CXX object CMakeFiles/libprotoc.dir/home/myuser/testa/cockroach-v20.1.0/src/github.com/cockroachdb/cockroach/c-deps/protobuf/src/google/protobuf/compiler/csharp/csharp_message_field.cc.o
  853. [ 17%] Building CXX object CMakeFiles/libprotoc.dir/home/myuser/testa/cockroach-v20.1.0/src/github.com/cockroachdb/cockroach/c-deps/protobuf/src/google/protobuf/compiler/csharp/csharp_primitive_field.cc.o
  854. [ 18%] Building CXX object CMakeFiles/libprotoc.dir/home/myuser/testa/cockroach-v20.1.0/src/github.com/cockroachdb/cockroach/c-deps/protobuf/src/google/protobuf/compiler/csharp/csharp_reflection_class.cc.o
  855. [ 18%] Building CXX object CMakeFiles/libprotoc.dir/home/myuser/testa/cockroach-v20.1.0/src/github.com/cockroachdb/cockroach/c-deps/protobuf/src/google/protobuf/compiler/csharp/csharp_repeated_enum_field.cc.o
  856. [ 19%] Building CXX object CMakeFiles/libprotoc.dir/home/myuser/testa/cockroach-v20.1.0/src/github.com/cockroachdb/cockroach/c-deps/protobuf/src/google/protobuf/compiler/csharp/csharp_repeated_message_field.cc.o
  857. [ 20%] Building CXX object CMakeFiles/libprotoc.dir/home/myuser/testa/cockroach-v20.1.0/src/github.com/cockroachdb/cockroach/c-deps/protobuf/src/google/protobuf/compiler/csharp/csharp_repeated_primitive_field.cc.o
  858. [ 20%] Building CXX object CMakeFiles/libprotoc.dir/home/myuser/testa/cockroach-v20.1.0/src/github.com/cockroachdb/cockroach/c-deps/protobuf/src/google/protobuf/compiler/csharp/csharp_source_generator_base.cc.o
  859. [ 21%] Building CXX object CMakeFiles/libprotoc.dir/home/myuser/testa/cockroach-v20.1.0/src/github.com/cockroachdb/cockroach/c-deps/protobuf/src/google/protobuf/compiler/csharp/csharp_wrapper_field.cc.o
  860. [ 21%] Building CXX object CMakeFiles/libprotoc.dir/home/myuser/testa/cockroach-v20.1.0/src/github.com/cockroachdb/cockroach/c-deps/protobuf/src/google/protobuf/compiler/java/java_context.cc.o
  861. [ 22%] Building CXX object CMakeFiles/libprotoc.dir/home/myuser/testa/cockroach-v20.1.0/src/github.com/cockroachdb/cockroach/c-deps/protobuf/src/google/protobuf/compiler/java/java_doc_comment.cc.o
  862. [ 22%] Building CXX object CMakeFiles/libprotoc.dir/home/myuser/testa/cockroach-v20.1.0/src/github.com/cockroachdb/cockroach/c-deps/protobuf/src/google/protobuf/compiler/java/java_enum.cc.o
  863. [ 22%] Building CXX object CMakeFiles/libprotoc.dir/home/myuser/testa/cockroach-v20.1.0/src/github.com/cockroachdb/cockroach/c-deps/protobuf/src/google/protobuf/compiler/java/java_enum_field.cc.o
  864. [ 23%] Building CXX object CMakeFiles/libprotoc.dir/home/myuser/testa/cockroach-v20.1.0/src/github.com/cockroachdb/cockroach/c-deps/protobuf/src/google/protobuf/compiler/java/java_enum_field_lite.cc.o
  865. [ 25%] Building CXX object CMakeFiles/libprotoc.dir/home/myuser/testa/cockroach-v20.1.0/src/github.com/cockroachdb/cockroach/c-deps/protobuf/src/google/protobuf/compiler/java/java_enum_lite.cc.o
  866. [ 26%] Building CXX object CMakeFiles/libprotoc.dir/home/myuser/testa/cockroach-v20.1.0/src/github.com/cockroachdb/cockroach/c-deps/protobuf/src/google/protobuf/compiler/java/java_extension.cc.o
  867. [ 26%] Building CXX object CMakeFiles/libprotoc.dir/home/myuser/testa/cockroach-v20.1.0/src/github.com/cockroachdb/cockroach/c-deps/protobuf/src/google/protobuf/compiler/java/java_extension_lite.cc.o
  868. [ 27%] Building CXX object CMakeFiles/libprotoc.dir/home/myuser/testa/cockroach-v20.1.0/src/github.com/cockroachdb/cockroach/c-deps/protobuf/src/google/protobuf/compiler/java/java_field.cc.o
  869. [ 27%] Building CXX object CMakeFiles/libprotoc.dir/home/myuser/testa/cockroach-v20.1.0/src/github.com/cockroachdb/cockroach/c-deps/protobuf/src/google/protobuf/compiler/java/java_file.cc.o
  870. [ 28%] Building CXX object CMakeFiles/libprotoc.dir/home/myuser/testa/cockroach-v20.1.0/src/github.com/cockroachdb/cockroach/c-deps/protobuf/src/google/protobuf/compiler/java/java_generator_factory.cc.o
  871. [ 28%] Building CXX object CMakeFiles/libprotoc.dir/home/myuser/testa/cockroach-v20.1.0/src/github.com/cockroachdb/cockroach/c-deps/protobuf/src/google/protobuf/compiler/java/java_generator.cc.o
  872. [ 28%] Building CXX object CMakeFiles/libprotoc.dir/home/myuser/testa/cockroach-v20.1.0/src/github.com/cockroachdb/cockroach/c-deps/protobuf/src/google/protobuf/compiler/java/java_helpers.cc.o
  873. [ 29%] Building CXX object CMakeFiles/libprotoc.dir/home/myuser/testa/cockroach-v20.1.0/src/github.com/cockroachdb/cockroach/c-deps/protobuf/src/google/protobuf/compiler/java/java_lazy_message_field.cc.o
  874. [ 29%] Building CXX object CMakeFiles/libprotoc.dir/home/myuser/testa/cockroach-v20.1.0/src/github.com/cockroachdb/cockroach/c-deps/protobuf/src/google/protobuf/compiler/java/java_lazy_message_field_lite.cc.o
  875. [ 30%] Building CXX object CMakeFiles/libprotoc.dir/home/myuser/testa/cockroach-v20.1.0/src/github.com/cockroachdb/cockroach/c-deps/protobuf/src/google/protobuf/compiler/java/java_map_field.cc.o
  876. [ 30%] Building CXX object CMakeFiles/libprotoc.dir/home/myuser/testa/cockroach-v20.1.0/src/github.com/cockroachdb/cockroach/c-deps/protobuf/src/google/protobuf/compiler/java/java_map_field_lite.cc.o
  877. [ 31%] Building CXX object CMakeFiles/libprotoc.dir/home/myuser/testa/cockroach-v20.1.0/src/github.com/cockroachdb/cockroach/c-deps/protobuf/src/google/protobuf/compiler/java/java_message.cc.o
  878. [ 31%] Building CXX object CMakeFiles/libprotoc.dir/home/myuser/testa/cockroach-v20.1.0/src/github.com/cockroachdb/cockroach/c-deps/protobuf/src/google/protobuf/compiler/java/java_message_builder.cc.o
  879. [ 32%] Building CXX object CMakeFiles/libprotoc.dir/home/myuser/testa/cockroach-v20.1.0/src/github.com/cockroachdb/cockroach/c-deps/protobuf/src/google/protobuf/compiler/java/java_message_builder_lite.cc.o
  880. [ 34%] Building CXX object CMakeFiles/libprotoc.dir/home/myuser/testa/cockroach-v20.1.0/src/github.com/cockroachdb/cockroach/c-deps/protobuf/src/google/protobuf/compiler/java/java_message_field.cc.o
  881. [ 34%] Building CXX object CMakeFiles/libprotoc.dir/home/myuser/testa/cockroach-v20.1.0/src/github.com/cockroachdb/cockroach/c-deps/protobuf/src/google/protobuf/compiler/java/java_message_field_lite.cc.o
  882. [ 35%] Building CXX object CMakeFiles/libprotoc.dir/home/myuser/testa/cockroach-v20.1.0/src/github.com/cockroachdb/cockroach/c-deps/protobuf/src/google/protobuf/compiler/java/java_message_lite.cc.o
  883. [ 35%] Building CXX object CMakeFiles/libprotoc.dir/home/myuser/testa/cockroach-v20.1.0/src/github.com/cockroachdb/cockroach/c-deps/protobuf/src/google/protobuf/compiler/java/java_name_resolver.cc.o
  884. [ 35%] Building CXX object CMakeFiles/libprotoc.dir/home/myuser/testa/cockroach-v20.1.0/src/github.com/cockroachdb/cockroach/c-deps/protobuf/src/google/protobuf/compiler/java/java_primitive_field.cc.o
  885. [ 36%] Building CXX object CMakeFiles/libprotoc.dir/home/myuser/testa/cockroach-v20.1.0/src/github.com/cockroachdb/cockroach/c-deps/protobuf/src/google/protobuf/compiler/java/java_primitive_field_lite.cc.o
  886. [ 36%] Building CXX object CMakeFiles/libprotoc.dir/home/myuser/testa/cockroach-v20.1.0/src/github.com/cockroachdb/cockroach/c-deps/protobuf/src/google/protobuf/compiler/java/java_service.cc.o
  887. [ 37%] Building CXX object CMakeFiles/libprotoc.dir/home/myuser/testa/cockroach-v20.1.0/src/github.com/cockroachdb/cockroach/c-deps/protobuf/src/google/protobuf/compiler/java/java_shared_code_generator.cc.o
  888. [ 38%] Building CXX object CMakeFiles/libprotoc.dir/home/myuser/testa/cockroach-v20.1.0/src/github.com/cockroachdb/cockroach/c-deps/protobuf/src/google/protobuf/compiler/java/java_string_field.cc.o
  889. [ 38%] Building CXX object CMakeFiles/libprotoc.dir/home/myuser/testa/cockroach-v20.1.0/src/github.com/cockroachdb/cockroach/c-deps/protobuf/src/google/protobuf/compiler/java/java_string_field_lite.cc.o
  890. [ 39%] Building CXX object CMakeFiles/libprotoc.dir/home/myuser/testa/cockroach-v20.1.0/src/github.com/cockroachdb/cockroach/c-deps/protobuf/src/google/protobuf/compiler/js/well_known_types_embed.cc.o
  891. [ 39%] Building CXX object CMakeFiles/libprotoc.dir/home/myuser/testa/cockroach-v20.1.0/src/github.com/cockroachdb/cockroach/c-deps/protobuf/src/google/protobuf/compiler/js/js_generator.cc.o
  892. [ 40%] Building CXX object CMakeFiles/libprotoc.dir/home/myuser/testa/cockroach-v20.1.0/src/github.com/cockroachdb/cockroach/c-deps/protobuf/src/google/protobuf/compiler/objectivec/objectivec_enum.cc.o
  893. [ 40%] Building CXX object CMakeFiles/libprotoc.dir/home/myuser/testa/cockroach-v20.1.0/src/github.com/cockroachdb/cockroach/c-deps/protobuf/src/google/protobuf/compiler/objectivec/objectivec_enum_field.cc.o
  894. [ 42%] Building CXX object CMakeFiles/libprotoc.dir/home/myuser/testa/cockroach-v20.1.0/src/github.com/cockroachdb/cockroach/c-deps/protobuf/src/google/protobuf/compiler/objectivec/objectivec_extension.cc.o
  895. [ 43%] Building CXX object CMakeFiles/libprotoc.dir/home/myuser/testa/cockroach-v20.1.0/src/github.com/cockroachdb/cockroach/c-deps/protobuf/src/google/protobuf/compiler/objectivec/objectivec_field.cc.o
  896. [ 43%] Building CXX object CMakeFiles/libprotoc.dir/home/myuser/testa/cockroach-v20.1.0/src/github.com/cockroachdb/cockroach/c-deps/protobuf/src/google/protobuf/compiler/objectivec/objectivec_file.cc.o
  897. [ 43%] Building CXX object CMakeFiles/libprotoc.dir/home/myuser/testa/cockroach-v20.1.0/src/github.com/cockroachdb/cockroach/c-deps/protobuf/src/google/protobuf/compiler/objectivec/objectivec_generator.cc.o
  898. [ 44%] Building CXX object CMakeFiles/libprotoc.dir/home/myuser/testa/cockroach-v20.1.0/src/github.com/cockroachdb/cockroach/c-deps/protobuf/src/google/protobuf/compiler/objectivec/objectivec_helpers.cc.o
  899. [ 44%] Building CXX object CMakeFiles/libprotoc.dir/home/myuser/testa/cockroach-v20.1.0/src/github.com/cockroachdb/cockroach/c-deps/protobuf/src/google/protobuf/compiler/objectivec/objectivec_map_field.cc.o
  900. [ 45%] Building CXX object CMakeFiles/libprotoc.dir/home/myuser/testa/cockroach-v20.1.0/src/github.com/cockroachdb/cockroach/c-deps/protobuf/src/google/protobuf/compiler/objectivec/objectivec_message.cc.o
  901. [ 45%] Building CXX object CMakeFiles/libprotoc.dir/home/myuser/testa/cockroach-v20.1.0/src/github.com/cockroachdb/cockroach/c-deps/protobuf/src/google/protobuf/compiler/objectivec/objectivec_message_field.cc.o
  902. [ 46%] Building CXX object CMakeFiles/libprotoc.dir/home/myuser/testa/cockroach-v20.1.0/src/github.com/cockroachdb/cockroach/c-deps/protobuf/src/google/protobuf/compiler/objectivec/objectivec_oneof.cc.o
  903. [ 46%] Building CXX object CMakeFiles/libprotoc.dir/home/myuser/testa/cockroach-v20.1.0/src/github.com/cockroachdb/cockroach/c-deps/protobuf/src/google/protobuf/compiler/objectivec/objectivec_primitive_field.cc.o
  904. [ 47%] Building CXX object CMakeFiles/libprotoc.dir/home/myuser/testa/cockroach-v20.1.0/src/github.com/cockroachdb/cockroach/c-deps/protobuf/src/google/protobuf/compiler/php/php_generator.cc.o
  905. [ 47%] Building CXX object CMakeFiles/libprotoc.dir/home/myuser/testa/cockroach-v20.1.0/src/github.com/cockroachdb/cockroach/c-deps/protobuf/src/google/protobuf/compiler/plugin.cc.o
  906. [ 48%] Building CXX object CMakeFiles/libprotoc.dir/home/myuser/testa/cockroach-v20.1.0/src/github.com/cockroachdb/cockroach/c-deps/protobuf/src/google/protobuf/compiler/plugin.pb.cc.o
  907. [ 48%] Building CXX object CMakeFiles/libprotoc.dir/home/myuser/testa/cockroach-v20.1.0/src/github.com/cockroachdb/cockroach/c-deps/protobuf/src/google/protobuf/compiler/python/python_generator.cc.o
  908. [ 50%] Building CXX object CMakeFiles/libprotoc.dir/home/myuser/testa/cockroach-v20.1.0/src/github.com/cockroachdb/cockroach/c-deps/protobuf/src/google/protobuf/compiler/ruby/ruby_generator.cc.o
  909. [ 50%] Building CXX object CMakeFiles/libprotoc.dir/home/myuser/testa/cockroach-v20.1.0/src/github.com/cockroachdb/cockroach/c-deps/protobuf/src/google/protobuf/compiler/subprocess.cc.o
  910. [ 51%] Building CXX object CMakeFiles/libprotoc.dir/home/myuser/testa/cockroach-v20.1.0/src/github.com/cockroachdb/cockroach/c-deps/protobuf/src/google/protobuf/compiler/zip_writer.cc.o
  911. [ 51%] Linking CXX static library libprotoc.a
  912. Scanning dependencies of target protoc
  913. [ 52%] Building CXX object CMakeFiles/protoc.dir/home/myuser/testa/cockroach-v20.1.0/src/github.com/cockroachdb/cockroach/c-deps/protobuf/src/google/protobuf/compiler/main.cc.o
  914. [ 53%] Linking CXX executable protoc
  915. find ./pkg -name node_modules -prune -o -type f -name '*.pb.go' -exec rm {} +
  916. find ./pkg -name node_modules -prune -o -type f -name '*.pb.gw.go' -exec rm {} +
  917. rm -rf /home/myuser/testa/cockroach-v20.1.0/src/github.com/cockroachdb/cockroach/c-deps/libroach/protos
  918. rm -rf /home/myuser/testa/cockroach-v20.1.0/src/github.com/cockroachdb/cockroach/c-deps/libroach/protosccl
  919. mkdir -p /home/myuser/testa/cockroach-v20.1.0/src/github.com/cockroachdb/cockroach/c-deps/libroach/protosccl
  920. mkdir -p /home/myuser/testa/cockroach-v20.1.0/src/github.com/cockroachdb/cockroach/c-deps/libroach/protos
  921. build/werror.sh /home/myuser/testa/cockroach-v20.1.0/native/aarch64-linux-gnu/protobuf/protoc -Ipkg:./vendor/github.com/gogo/protobuf:./vendor/github.com/gogo/protobuf/protobuf --cpp_out=lite:/home/myuser/testa/cockroach-v20.1.0/src/github.com/cockroachdb/cockroach/c-deps/libroach/protos ./pkg/kv/kvserver/concurrency/lock/locking.proto ./pkg/roachpb/api.proto ./pkg/roachpb/data.proto ./pkg/roachpb/errors.proto ./pkg/roachpb/internal.proto ./pkg/roachpb/metadata.proto ./pkg/storage/enginepb/file_registry.proto ./pkg/storage/enginepb/mvcc.proto ./pkg/storage/enginepb/mvcc3.proto ./pkg/storage/enginepb/rocksdb.proto ./pkg/util/hlc/legacy_timestamp.proto ./pkg/util/hlc/timestamp.proto ./pkg/util/log/log.proto ./pkg/util/tracing/recorded_span.proto ./pkg/util/unresolved_addr.proto
  922. build/werror.sh /home/myuser/testa/cockroach-v20.1.0/native/aarch64-linux-gnu/protobuf/protoc -Ipkg:./vendor/github.com/gogo/protobuf:./vendor/github.com/gogo/protobuf/protobuf --cpp_out=lite:/home/myuser/testa/cockroach-v20.1.0/src/github.com/cockroachdb/cockroach/c-deps/libroach/protosccl ./pkg/ccl/baseccl/encryption_options.proto ./pkg/ccl/storageccl/engineccl/enginepbccl/key_registry.proto ./pkg/ccl/storageccl/engineccl/enginepbccl/stats.proto
  923. sed -i -E '/gogoproto/d' /home/myuser/testa/cockroach-v20.1.0/src/github.com/cockroachdb/cockroach/c-deps/libroach/protosccl/ccl/baseccl/encryption_options.pb.h /home/myuser/testa/cockroach-v20.1.0/src/github.com/cockroachdb/cockroach/c-deps/libroach/protosccl/ccl/storageccl/engineccl/enginepbccl/key_registry.pb.h /home/myuser/testa/cockroach-v20.1.0/src/github.com/cockroachdb/cockroach/c-deps/libroach/protosccl/ccl/storageccl/engineccl/enginepbccl/stats.pb.h /home/myuser/testa/cockroach-v20.1.0/src/github.com/cockroachdb/cockroach/c-deps/libroach/protosccl/ccl/baseccl/encryption_options.pb.cc /home/myuser/testa/cockroach-v20.1.0/src/github.com/cockroachdb/cockroach/c-deps/libroach/protosccl/ccl/storageccl/engineccl/enginepbccl/key_registry.pb.cc /home/myuser/testa/cockroach-v20.1.0/src/github.com/cockroachdb/cockroach/c-deps/libroach/protosccl/ccl/storageccl/engineccl/enginepbccl/stats.pb.cc
  924. touch bin/.cpp_ccl_protobuf_sources
  925. build/werror.sh /home/myuser/testa/cockroach-v20.1.0/native/aarch64-linux-gnu/protobuf/protoc -Ipkg:./vendor/github.com:./vendor/github.com/gogo/protobuf:./vendor/github.com/gogo/protobuf/protobuf:./vendor/github.com/cockroachdb/errors:./vendor/go.etcd.io:./vendor/github.com/grpc-ecosystem/grpc-gateway/third_party/googleapis --grpc-gateway_out=logtostderr=true,request_context=true:./pkg ./pkg/server/serverpb/admin.proto ./pkg/server/serverpb/status.proto ./pkg/server/serverpb/authentication.proto
  926. set -e; for dir in ./pkg/acceptance/cluster/ ./pkg/blobs/blobspb/ ./pkg/build/ ./pkg/ccl/backupccl/ ./pkg/ccl/baseccl/ ./pkg/ccl/storageccl/engineccl/enginepbccl/ ./pkg/ccl/utilccl/licenseccl/ ./pkg/cli/systembench/systembenchpb/ ./pkg/clusterversion/ ./pkg/config/ ./pkg/config/zonepb/ ./pkg/gossip/ ./pkg/jobs/jobspb/ ./pkg/kv/kvnemesis/ ./pkg/kv/kvserver/ ./pkg/kv/kvserver/closedts/ctpb/ ./pkg/kv/kvserver/concurrency/lock/ ./pkg/kv/kvserver/protectedts/ptpb/ ./pkg/kv/kvserver/protectedts/ptstorage/ ./pkg/kv/kvserver/storagepb/ ./pkg/roachpb/ ./pkg/rpc/ ./pkg/server/diagnosticspb/ ./pkg/server/serverpb/ ./pkg/server/status/statuspb/ ./pkg/sql/colexec/execpb/ ./pkg/sql/execinfrapb/ ./pkg/sql/flowinfra/ ./pkg/sql/pgwire/pgerror/ ./pkg/sql/rowexec/ ./pkg/sql/rowflow/ ./pkg/sql/sqlbase/ ./pkg/sql/stats/ ./pkg/sql/types/ ./pkg/sqlmigrations/leasemanager/ ./pkg/storage/enginepb/ ./pkg/ts/catalog/ ./pkg/ts/tspb/ ./pkg/util/ ./pkg/util/hlc/ ./pkg/util/log/ ./pkg/util/metric/ ./pkg/util/protoutil/ ./pkg/util/tracing/; do \
  927.   build/werror.sh /home/myuser/testa/cockroach-v20.1.0/native/aarch64-linux-gnu/protobuf/protoc -Ipkg:./vendor/github.com:./vendor/github.com/gogo/protobuf:./vendor/github.com/gogo/protobuf/protobuf:./vendor/go.etcd.io:./vendor/github.com/grpc-ecosystem/grpc-gateway/third_party/googleapis:./vendor/github.com/cockroachdb/errors --gogoroach_out=Mgoogle/api/annotations.proto=github.com/grpc-ecosystem/grpc-gateway/third_party/googleapis/google/api,Mgoogle/protobuf/timestamp.proto=github.com/gogo/protobuf/types,Mgoogle/protobuf/any.proto=github.com/gogo/protobuf/types,,plugins=grpc,import_prefix=github.com/cockroachdb/cockroach/pkg/:./pkg $dir/*.proto; \
  928. done
  929. sed -i -E '/gogoproto/d' /home/myuser/testa/cockroach-v20.1.0/src/github.com/cockroachdb/cockroach/c-deps/libroach/protos/kv/kvserver/concurrency/lock/locking.pb.h /home/myuser/testa/cockroach-v20.1.0/src/github.com/cockroachdb/cockroach/c-deps/libroach/protos/roachpb/api.pb.h /home/myuser/testa/cockroach-v20.1.0/src/github.com/cockroachdb/cockroach/c-deps/libroach/protos/roachpb/data.pb.h /home/myuser/testa/cockroach-v20.1.0/src/github.com/cockroachdb/cockroach/c-deps/libroach/protos/roachpb/errors.pb.h /home/myuser/testa/cockroach-v20.1.0/src/github.com/cockroachdb/cockroach/c-deps/libroach/protos/roachpb/internal.pb.h /home/myuser/testa/cockroach-v20.1.0/src/github.com/cockroachdb/cockroach/c-deps/libroach/protos/roachpb/metadata.pb.h /home/myuser/testa/cockroach-v20.1.0/src/github.com/cockroachdb/cockroach/c-deps/libroach/protos/storage/enginepb/file_registry.pb.h /home/myuser/testa/cockroach-v20.1.0/src/github.com/cockroachdb/cockroach/c-deps/libroach/protos/storage/enginepb/mvcc.pb.h /home/myuser/testa/cockroach-v20.1.0/src/github.com/cockroachdb/cockroach/c-deps/libroach/protos/storage/enginepb/mvcc3.pb.h /home/myuser/testa/cockroach-v20.1.0/src/github.com/cockroachdb/cockroach/c-deps/libroach/protos/storage/enginepb/rocksdb.pb.h /home/myuser/testa/cockroach-v20.1.0/src/github.com/cockroachdb/cockroach/c-deps/libroach/protos/util/hlc/legacy_timestamp.pb.h /home/myuser/testa/cockroach-v20.1.0/src/github.com/cockroachdb/cockroach/c-deps/libroach/protos/util/hlc/timestamp.pb.h /home/myuser/testa/cockroach-v20.1.0/src/github.com/cockroachdb/cockroach/c-deps/libroach/protos/util/log/log.pb.h /home/myuser/testa/cockroach-v20.1.0/src/github.com/cockroachdb/cockroach/c-deps/libroach/protos/util/tracing/recorded_span.pb.h /home/myuser/testa/cockroach-v20.1.0/src/github.com/cockroachdb/cockroach/c-deps/libroach/protos/util/unresolved_addr.pb.h /home/myuser/testa/cockroach-v20.1.0/src/github.com/cockroachdb/cockroach/c-deps/libroach/protos/kv/kvserver/concurrency/lock/locking.pb.cc /home/myuser/testa/cockroach-v20.1.0/src/github.com/cockroachdb/cockroach/c-deps/libroach/protos/roachpb/api.pb.cc /home/myuser/testa/cockroach-v20.1.0/src/github.com/cockroachdb/cockroach/c-deps/libroach/protos/roachpb/data.pb.cc /home/myuser/testa/cockroach-v20.1.0/src/github.com/cockroachdb/cockroach/c-deps/libroach/protos/roachpb/errors.pb.cc /home/myuser/testa/cockroach-v20.1.0/src/github.com/cockroachdb/cockroach/c-deps/libroach/protos/roachpb/internal.pb.cc /home/myuser/testa/cockroach-v20.1.0/src/github.com/cockroachdb/cockroach/c-deps/libroach/protos/roachpb/metadata.pb.cc /home/myuser/testa/cockroach-v20.1.0/src/github.com/cockroachdb/cockroach/c-deps/libroach/protos/storage/enginepb/file_registry.pb.cc /home/myuser/testa/cockroach-v20.1.0/src/github.com/cockroachdb/cockroach/c-deps/libroach/protos/storage/enginepb/mvcc.pb.cc /home/myuser/testa/cockroach-v20.1.0/src/github.com/cockroachdb/cockroach/c-deps/libroach/protos/storage/enginepb/mvcc3.pb.cc /home/myuser/testa/cockroach-v20.1.0/src/github.com/cockroachdb/cockroach/c-deps/libroach/protos/storage/enginepb/rocksdb.pb.cc /home/myuser/testa/cockroach-v20.1.0/src/github.com/cockroachdb/cockroach/c-deps/libroach/protos/util/hlc/legacy_timestamp.pb.cc /home/myuser/testa/cockroach-v20.1.0/src/github.com/cockroachdb/cockroach/c-deps/libroach/protos/util/hlc/timestamp.pb.cc /home/myuser/testa/cockroach-v20.1.0/src/github.com/cockroachdb/cockroach/c-deps/libroach/protos/util/log/log.pb.cc /home/myuser/testa/cockroach-v20.1.0/src/github.com/cockroachdb/cockroach/c-deps/libroach/protos/util/tracing/recorded_span.pb.cc /home/myuser/testa/cockroach-v20.1.0/src/github.com/cockroachdb/cockroach/c-deps/libroach/protos/util/unresolved_addr.pb.cc
  930. touch bin/.cpp_protobuf_sources
  931. build/werror.sh /home/myuser/testa/cockroach-v20.1.0/native/aarch64-linux-gnu/protobuf/protoc -Ipkg:./vendor/github.com:./vendor/github.com/gogo/protobuf:./vendor/github.com/gogo/protobuf/protobuf:./vendor/github.com/cockroachdb/errors:./vendor/go.etcd.io:./vendor/github.com/grpc-ecosystem/grpc-gateway/third_party/googleapis --grpc-gateway_out=logtostderr=true,request_context=true:./pkg ./pkg/ts/tspb/timeseries.proto
  932. sed -i -E 's!golang.org/x/net/context!context!g' ./pkg/server/serverpb/admin.pb.gw.go ./pkg/server/serverpb/status.pb.gw.go ./pkg/server/serverpb/authentication.pb.gw.go ./pkg/ts/tspb/timeseries.pb.gw.go
  933. gofmt -s -w ./pkg/server/serverpb/admin.pb.gw.go ./pkg/server/serverpb/status.pb.gw.go ./pkg/server/serverpb/authentication.pb.gw.go ./pkg/ts/tspb/timeseries.pb.gw.go
  934. goimports -w ./pkg/server/serverpb/admin.pb.gw.go ./pkg/server/serverpb/status.pb.gw.go ./pkg/server/serverpb/authentication.pb.gw.go ./pkg/ts/tspb/timeseries.pb.gw.go
  935. touch bin/.gw_protobuf_sources
  936. sed -i -E \
  937.     -e '/import _ /d' \
  938.     -e 's!import (fmt|math) "github.com/cockroachdb/cockroach/pkg/(fmt|math)"! !g' \
  939.     -e 's!github\.com/cockroachdb/cockroach/pkg/(etcd)!go.etcd.io/\1!g' \
  940.     -e 's!github.com/cockroachdb/cockroach/pkg/((bytes|encoding/binary|errors|fmt|io|math|github\.com|(google\.)?golang\.org)([^a-z]|$))!\1!g' \
  941.         -e 's!github.com/cockroachdb/cockroach/pkg/errorspb!github.com/cockroachdb/errors/errorspb!g' \
  942.     -e 's!golang.org/x/net/context!context!g' \
  943.     ./pkg/acceptance/cluster/testconfig.pb.go ./pkg/blobs/blobspb/blobs.pb.go ./pkg/build/info.pb.go ./pkg/ccl/backupccl/backup.pb.go ./pkg/ccl/baseccl/encryption_options.pb.go ./pkg/ccl/storageccl/engineccl/enginepbccl/key_registry.pb.go ./pkg/ccl/storageccl/engineccl/enginepbccl/stats.pb.go ./pkg/ccl/utilccl/licenseccl/license.pb.go ./pkg/cli/systembench/systembenchpb/ping.pb.go ./pkg/clusterversion/cluster_version.pb.go ./pkg/config/system.pb.go ./pkg/config/zonepb/zone.pb.go ./pkg/gossip/gossip.pb.go ./pkg/jobs/jobspb/jobs.pb.go ./pkg/kv/kvnemesis/operations.pb.go ./pkg/kv/kvserver/api.pb.go ./pkg/kv/kvserver/closedts/ctpb/entry.pb.go ./pkg/kv/kvserver/closedts/ctpb/service.pb.go ./pkg/kv/kvserver/concurrency/lock/locking.pb.go ./pkg/kv/kvserver/protectedts/ptpb/protectedts.pb.go ./pkg/kv/kvserver/protectedts/ptstorage/storage.pb.go ./pkg/kv/kvserver/raft.pb.go ./pkg/kv/kvserver/storage_services.pb.go ./pkg/kv/kvserver/storagepb/lease_status.pb.go ./pkg/kv/kvserver/storagepb/liveness.pb.go ./pkg/kv/kvserver/storagepb/log.pb.go ./pkg/kv/kvserver/storagepb/proposer_kv.pb.go ./pkg/kv/kvserver/storagepb/state.pb.go ./pkg/roachpb/api.pb.go ./pkg/roachpb/app_stats.pb.go ./pkg/roachpb/data.pb.go ./pkg/roachpb/errors.pb.go ./pkg/roachpb/internal.pb.go ./pkg/roachpb/internal_raft.pb.go ./pkg/roachpb/io-formats.pb.go ./pkg/roachpb/metadata.pb.go ./pkg/rpc/heartbeat.pb.go ./pkg/server/diagnosticspb/diagnostics.pb.go ./pkg/server/serverpb/admin.pb.go ./pkg/server/serverpb/authentication.pb.go ./pkg/server/serverpb/init.pb.go ./pkg/server/serverpb/status.pb.go ./pkg/server/status/statuspb/status.pb.go ./pkg/sql/colexec/execpb/stats.pb.go ./pkg/sql/execinfrapb/api.pb.go ./pkg/sql/execinfrapb/data.pb.go ./pkg/sql/execinfrapb/processors.pb.go ./pkg/sql/execinfrapb/processors_base.pb.go ./pkg/sql/execinfrapb/processors_bulk_io.pb.go ./pkg/sql/execinfrapb/processors_changefeeds.pb.go ./pkg/sql/execinfrapb/processors_sql.pb.go ./pkg/sql/execinfrapb/processors_table_stats.pb.go ./pkg/sql/flowinfra/stats.pb.go ./pkg/sql/pgwire/pgerror/errors.pb.go ./pkg/sql/rowexec/stats.pb.go ./pkg/sql/rowflow/stats.pb.go ./pkg/sql/sqlbase/encoded_datum.pb.go ./pkg/sql/sqlbase/join_type.pb.go ./pkg/sql/sqlbase/locking.pb.go ./pkg/sql/sqlbase/privilege.pb.go ./pkg/sql/sqlbase/structured.pb.go ./pkg/sql/stats/histogram.pb.go ./pkg/sql/stats/table_statistic.pb.go ./pkg/sql/types/types.pb.go ./pkg/sqlmigrations/leasemanager/lease.pb.go ./pkg/storage/enginepb/engine.pb.go ./pkg/storage/enginepb/file_registry.pb.go ./pkg/storage/enginepb/mvcc.pb.go ./pkg/storage/enginepb/mvcc3.pb.go ./pkg/storage/enginepb/rocksdb.pb.go ./pkg/ts/catalog/chart_catalog.pb.go ./pkg/ts/tspb/timeseries.pb.go ./pkg/util/hlc/legacy_timestamp.pb.go ./pkg/util/hlc/timestamp.pb.go ./pkg/util/log/log.pb.go ./pkg/util/metric/metric.pb.go ./pkg/util/protoutil/clone.pb.go ./pkg/util/tracing/recorded_span.pb.go ./pkg/util/unresolved_addr.pb.go
  944. gofmt -s -w ./pkg/acceptance/cluster/testconfig.pb.go ./pkg/blobs/blobspb/blobs.pb.go ./pkg/build/info.pb.go ./pkg/ccl/backupccl/backup.pb.go ./pkg/ccl/baseccl/encryption_options.pb.go ./pkg/ccl/storageccl/engineccl/enginepbccl/key_registry.pb.go ./pkg/ccl/storageccl/engineccl/enginepbccl/stats.pb.go ./pkg/ccl/utilccl/licenseccl/license.pb.go ./pkg/cli/systembench/systembenchpb/ping.pb.go ./pkg/clusterversion/cluster_version.pb.go ./pkg/config/system.pb.go ./pkg/config/zonepb/zone.pb.go ./pkg/gossip/gossip.pb.go ./pkg/jobs/jobspb/jobs.pb.go ./pkg/kv/kvnemesis/operations.pb.go ./pkg/kv/kvserver/api.pb.go ./pkg/kv/kvserver/closedts/ctpb/entry.pb.go ./pkg/kv/kvserver/closedts/ctpb/service.pb.go ./pkg/kv/kvserver/concurrency/lock/locking.pb.go ./pkg/kv/kvserver/protectedts/ptpb/protectedts.pb.go ./pkg/kv/kvserver/protectedts/ptstorage/storage.pb.go ./pkg/kv/kvserver/raft.pb.go ./pkg/kv/kvserver/storage_services.pb.go ./pkg/kv/kvserver/storagepb/lease_status.pb.go ./pkg/kv/kvserver/storagepb/liveness.pb.go ./pkg/kv/kvserver/storagepb/log.pb.go ./pkg/kv/kvserver/storagepb/proposer_kv.pb.go ./pkg/kv/kvserver/storagepb/state.pb.go ./pkg/roachpb/api.pb.go ./pkg/roachpb/app_stats.pb.go ./pkg/roachpb/data.pb.go ./pkg/roachpb/errors.pb.go ./pkg/roachpb/internal.pb.go ./pkg/roachpb/internal_raft.pb.go ./pkg/roachpb/io-formats.pb.go ./pkg/roachpb/metadata.pb.go ./pkg/rpc/heartbeat.pb.go ./pkg/server/diagnosticspb/diagnostics.pb.go ./pkg/server/serverpb/admin.pb.go ./pkg/server/serverpb/authentication.pb.go ./pkg/server/serverpb/init.pb.go ./pkg/server/serverpb/status.pb.go ./pkg/server/status/statuspb/status.pb.go ./pkg/sql/colexec/execpb/stats.pb.go ./pkg/sql/execinfrapb/api.pb.go ./pkg/sql/execinfrapb/data.pb.go ./pkg/sql/execinfrapb/processors.pb.go ./pkg/sql/execinfrapb/processors_base.pb.go ./pkg/sql/execinfrapb/processors_bulk_io.pb.go ./pkg/sql/execinfrapb/processors_changefeeds.pb.go ./pkg/sql/execinfrapb/processors_sql.pb.go ./pkg/sql/execinfrapb/processors_table_stats.pb.go ./pkg/sql/flowinfra/stats.pb.go ./pkg/sql/pgwire/pgerror/errors.pb.go ./pkg/sql/rowexec/stats.pb.go ./pkg/sql/rowflow/stats.pb.go ./pkg/sql/sqlbase/encoded_datum.pb.go ./pkg/sql/sqlbase/join_type.pb.go ./pkg/sql/sqlbase/locking.pb.go ./pkg/sql/sqlbase/privilege.pb.go ./pkg/sql/sqlbase/structured.pb.go ./pkg/sql/stats/histogram.pb.go ./pkg/sql/stats/table_statistic.pb.go ./pkg/sql/types/types.pb.go ./pkg/sqlmigrations/leasemanager/lease.pb.go ./pkg/storage/enginepb/engine.pb.go ./pkg/storage/enginepb/file_registry.pb.go ./pkg/storage/enginepb/mvcc.pb.go ./pkg/storage/enginepb/mvcc3.pb.go ./pkg/storage/enginepb/rocksdb.pb.go ./pkg/ts/catalog/chart_catalog.pb.go ./pkg/ts/tspb/timeseries.pb.go ./pkg/util/hlc/legacy_timestamp.pb.go ./pkg/util/hlc/timestamp.pb.go ./pkg/util/log/log.pb.go ./pkg/util/metric/metric.pb.go ./pkg/util/protoutil/clone.pb.go ./pkg/util/tracing/recorded_span.pb.go ./pkg/util/unresolved_addr.pb.go
  945. touch bin/.go_protobuf_sources
  946. go install -v execgen
  947. bin/prereqs ./pkg/sql/colexec/execgen/cmd/execgen > bin/execgen.d.tmp
  948. mv -f bin/execgen.d.tmp bin/execgen.d
  949. EXECGEN bin/execgen_out.d
  950. Running make with -j4
  951. GOPATH set to /home/myuser/testa/cockroach-v20.1.0
  952. fatal: not a git repository (or any of the parent directories): .git
  953. rm -rf /home/myuser/testa/cockroach-v20.1.0/native/aarch64-linux-gnu/jemalloc
  954. rm -rf /home/myuser/testa/cockroach-v20.1.0/native/aarch64-linux-gnu/libedit
  955. mkdir -p /home/myuser/testa/cockroach-v20.1.0/native/aarch64-linux-gnu/jemalloc
  956. rm -rf /home/myuser/testa/cockroach-v20.1.0/native/aarch64-linux-gnu/snappy
  957. mkdir -p /home/myuser/testa/cockroach-v20.1.0/native/aarch64-linux-gnu/libedit
  958. rm -rf /home/myuser/testa/cockroach-v20.1.0/native/aarch64-linux-gnu/cryptopp
  959. mkdir -p /home/myuser/testa/cockroach-v20.1.0/native/aarch64-linux-gnu/snappy
  960. mkdir -p /home/myuser/testa/cockroach-v20.1.0/native/aarch64-linux-gnu/cryptopp
  961. cd /home/myuser/testa/cockroach-v20.1.0/native/aarch64-linux-gnu/libedit && /home/myuser/testa/cockroach-v20.1.0/src/github.com/cockroachdb/cockroach/c-deps/libedit/configure   --disable-examples --disable-shared
  962. cd /home/myuser/testa/cockroach-v20.1.0/native/aarch64-linux-gnu/snappy && cmake -DCMAKE_TARGET_MESSAGES=OFF   /home/myuser/testa/cockroach-v20.1.0/src/github.com/cockroachdb/cockroach/c-deps/snappy \
  963.   -DCMAKE_BUILD_TYPE=Release
  964. cd /home/myuser/testa/cockroach-v20.1.0/native/aarch64-linux-gnu/cryptopp && CFLAGS+=" " && CXXFLAGS+=" " cmake -DCMAKE_TARGET_MESSAGES=OFF   /home/myuser/testa/cockroach-v20.1.0/src/github.com/cockroachdb/cockroach/c-deps/cryptopp \
  965.   -DCMAKE_BUILD_TYPE=Release
  966. cd /home/myuser/testa/cockroach-v20.1.0/native/aarch64-linux-gnu/jemalloc && /home/myuser/testa/cockroach-v20.1.0/src/github.com/cockroachdb/cockroach/c-deps/jemalloc/configure   --enable-prof
  967. checking for gcc... gcc
  968. checking for xsltproc... false
  969. checking for gcc... gcc
  970. checking whether the C compiler works... checking whether the C compiler works... yes
  971. checking for C compiler default output file name... a.out
  972. checking for suffix of executables... -- The C compiler identification is GNU 7.5.0
  973. -- The C compiler identification is GNU 7.5.0
  974. yes
  975. checking for C compiler default output file name... a.out
  976. checking for suffix of executables...
  977. checking whether we are cross compiling...
  978. checking whether we are cross compiling... no
  979. no
  980. checking for suffix of object files... checking for suffix of object files... o
  981. o
  982. checking whether we are using the GNU C compiler... checking whether we are using the GNU C compiler... yes
  983. checking whether gcc accepts -g... yes
  984. checking whether gcc accepts -g... yes
  985. checking for gcc option to accept ISO C89... yes
  986. checking for gcc option to accept ISO C89... -- The CXX compiler identification is GNU 7.5.0
  987. none needed
  988. checking whether compiler is cray... -- Check for working C compiler: /usr/bin/cc
  989. -- The CXX compiler identification is GNU 7.5.0
  990. -- Check for working C compiler: /usr/bin/cc
  991. none needed
  992. checking whether gcc understands -c and -o together... no
  993. checking whether compiler supports -std=gnu11... yes
  994. checking whether compiler supports -Wall... yes
  995. checking how to run the C preprocessor... yes
  996. checking whether compiler supports -Werror=declaration-after-statement... gcc -E
  997. yes
  998. checking whether compiler supports -Wshorten-64-to-32... -- Check for working C compiler: /usr/bin/cc -- works
  999. -- Detecting C compiler ABI info
  1000. no
  1001. checking whether compiler supports -Wsign-compare... checking for grep that handles long lines and -e... -- Check for working C compiler: /usr/bin/cc -- works
  1002. /bin/grep
  1003. checking for egrep... -- Detecting C compiler ABI info
  1004. /bin/grep -E
  1005. checking for ANSI C header files... yes
  1006. checking whether compiler supports -pipe... yes
  1007. checking whether compiler supports -g3... yes
  1008. checking how to run the C preprocessor... gcc -E
  1009. -- Detecting C compiler ABI info - done
  1010. -- Detecting C compiler ABI info - done
  1011. checking for grep that handles long lines and -e... /bin/grep
  1012. checking for egrep... /bin/grep -E
  1013. checking for ANSI C header files... yes
  1014. -- Detecting C compile features
  1015. checking for sys/types.h... -- Detecting C compile features
  1016. yes
  1017. checking for sys/stat.h... yes
  1018. checking for stdlib.h... yes
  1019. checking for sys/types.h... yes
  1020. checking for string.h... yes
  1021. checking for sys/stat.h... yes
  1022. checking for memory.h... yes
  1023. checking for stdlib.h... yes
  1024. yes
  1025. checking for strings.h... checking for string.h... yes
  1026. yes
  1027. checking for inttypes.h... checking for memory.h... yes
  1028. yes
  1029. checking for stdint.h... checking for strings.h... -- Detecting C compile features - done
  1030. -- Check for working CXX compiler: /usr/bin/c++
  1031. yes
  1032. yes
  1033. checking for unistd.h... checking for inttypes.h... -- Detecting C compile features - done
  1034. -- Check for working CXX compiler: /usr/bin/c++
  1035. yes
  1036. checking for stdint.h... yes
  1037. checking minix/config.h usability... yes
  1038. checking for unistd.h... no
  1039. checking minix/config.h presence... -- Check for working CXX compiler: /usr/bin/c++ -- works
  1040. -- Detecting CXX compiler ABI info
  1041. no
  1042. checking for minix/config.h... no
  1043. checking whether it is safe to define __EXTENSIONS__... -- Check for working CXX compiler: /usr/bin/c++ -- works
  1044. -- Detecting CXX compiler ABI info
  1045. yes
  1046. checking whether byte ordering is bigendian... yes
  1047. checking for a BSD-compatible install... /usr/bin/install -c
  1048. checking whether build environment is sane... yes
  1049. checking for a thread-safe mkdir -p... /bin/mkdir -p
  1050. checking for gawk... no
  1051. checking for mawk... mawk
  1052. checking whether make sets $(MAKE)... yes
  1053. checking whether make supports the include directive... yes (GNU style)
  1054. checking whether make supports nested variables... -- Detecting CXX compiler ABI info - done
  1055. yes
  1056. -- Detecting CXX compile features
  1057. checking dependency style of gcc... -- Detecting CXX compiler ABI info - done
  1058. no
  1059. checking size of void *... -- Detecting CXX compile features
  1060. gcc3
  1061. 8
  1062. checking build system type... checking size of int... 4
  1063. checking size of long... aarch64-unknown-linux-gnu
  1064. checking host system type... aarch64-unknown-linux-gnu
  1065. checking how to print strings... 8
  1066. printf
  1067. checking for a sed that does not truncate output... /bin/sed
  1068. checking for fgrep... checking size of long long... /bin/grep -F
  1069. checking for ld used by gcc... /usr/bin/ld
  1070. checking if the linker (/usr/bin/ld) is GNU ld... yes
  1071. checking for BSD- or MS-compatible name lister (nm)... /usr/bin/nm -B
  1072. checking the name lister (/usr/bin/nm -B) interface... BSD nm
  1073. checking whether ln -s works... yes
  1074. checking the maximum length of command line arguments... 1572864
  1075. 8
  1076. checking size of intmax_t... checking how to convert aarch64-unknown-linux-gnu file names to aarch64-unknown-linux-gnu format... func_convert_file_noop
  1077. checking how to convert aarch64-unknown-linux-gnu file names to toolchain format... func_convert_file_noop
  1078. checking for /usr/bin/ld option to reload object files... -r
  1079. checking for objdump... objdump
  1080. checking how to recognize dependent libraries... pass_all
  1081. checking for dlltool... no
  1082. checking how to associate runtime and link libraries... printf %s\n
  1083. checking for ar... ar
  1084. checking for archiver @FILE support... @
  1085. checking for strip... strip
  1086. checking for ranlib... ranlib
  1087. checking command to parse /usr/bin/nm -B output from gcc object... ok
  1088. checking for sysroot... no
  1089. checking for a working dd... /bin/dd
  1090. checking how to truncate binary pipes... /bin/dd bs=4096 count=1
  1091. checking for mt... mt
  1092. checking if mt is a manifest tool... no
  1093. checking for dlfcn.h... 8
  1094. checking build system type... yes
  1095. checking for objdir... .libs
  1096. aarch64-unknown-linux-gnu
  1097. checking host system type... aarch64-unknown-linux-gnu
  1098. checking for ar... ar
  1099. checking malloc.h usability... checking if gcc supports -fno-rtti -fno-exceptions... yes
  1100. checking malloc.h presence... yes
  1101. checking for malloc.h... yes
  1102. checking whether malloc_usable_size definition can use const argument... no
  1103. checking for gcc option to produce PIC... -fPIC -DPIC
  1104. checking if gcc PIC flag -fPIC -DPIC works... no
  1105. checking for library containing log... yes
  1106. checking if gcc static flag -static works... -lm
  1107. checking whether __attribute__ syntax is compilable... -- Detecting CXX compile features - done
  1108. -- Detecting CXX compile features - done
  1109. -- Check if the system is big endian
  1110. -- Searching 16 bit integer
  1111. -- Looking for sys/types.h
  1112. -- Check if the system is big endian
  1113. -- Searching 16 bit integer
  1114. -- Looking for sys/types.h
  1115. yes
  1116. checking if gcc supports -c -o file.o... yes
  1117. checking whether compiler supports -fvisibility=hidden... yes
  1118. checking whether compiler supports -Werror... yes
  1119. checking whether compiler supports -herror_on_warning... yes
  1120. checking if gcc supports -c -o file.o... (cached) yes
  1121. checking whether the gcc linker (/usr/bin/ld) supports shared libraries... yes
  1122. yes
  1123. checking whether tls_model attribute is compilable... checking dynamic linker characteristics... -- Looking for sys/types.h - found
  1124. -- Looking for stdint.h
  1125. -- Looking for sys/types.h - found
  1126. -- Looking for stdint.h
  1127. yes
  1128. checking whether compiler supports -Werror... yes
  1129. checking whether compiler supports -herror_on_warning... yes
  1130. checking whether alloc_size attribute is compilable... GNU/Linux ld.so
  1131. checking how to hardcode library paths into programs... immediate
  1132. checking whether stripping libraries is possible... yes
  1133. checking if libtool supports shared libraries... yes
  1134. checking whether to build shared libraries... no
  1135. checking whether to build static libraries... yes
  1136. checking whether make supports nested variables... (cached) yes
  1137. checking whether to enable maintainer-specific portions of Makefiles... no
  1138. checking for gcc option to accept ISO C99... -- Looking for stdint.h - found
  1139. -- Looking for stddef.h
  1140. -- Looking for stdint.h - found
  1141. -- Looking for stddef.h
  1142. yes
  1143. checking whether compiler supports -Werror... yes
  1144. none needed
  1145. checking whether ln -s works... yes
  1146. checking for gawk... (cached) mawk
  1147. checking for nroff... checking whether compiler supports -herror_on_warning... /usr/bin/nroff
  1148. yes
  1149. checking whether format(gnu_printf, ...) attribute is compilable... -- Looking for stddef.h - found
  1150. -- Check size of unsigned short
  1151. -- Looking for stddef.h - found
  1152. -- Check size of unsigned short
  1153. yes
  1154. checking whether compiler supports -Werror... yes
  1155. checking whether compiler supports -herror_on_warning... checking for tgetent in -lncurses... yes
  1156. checking whether format(printf, ...) attribute is compilable... no
  1157. checking for tgetent in -lcurses... -- Check size of unsigned short - done
  1158. -- Using unsigned short
  1159. yes
  1160. checking for a BSD-compatible install... /usr/bin/install -c
  1161. checking for ranlib... ranlib
  1162. checking for ld... /usr/bin/ld
  1163. checking for autoconf... /usr/bin/autoconf
  1164. checking for memalign... -- Check size of unsigned short - done
  1165. no
  1166. checking for tgetent in -ltermcap... -- Using unsigned short
  1167. yes
  1168. checking for valloc... yes
  1169. checking if you want wide-character code... no
  1170. configure: WARNING: --enable-widec is deprecated, wide-character/UTF-8 is always enabled
  1171. checking for dirent.h that defines DIR... -- Check if the system is big endian - little endian
  1172. -- Looking for byteswap.h
  1173. yes
  1174. checking for library containing opendir... -- Check if the system is big endian - little endian
  1175. yes
  1176. -- Performing Test COMPILER_OPT_ARCH_NATIVE_SUPPORTED
  1177. checking whether compiler supports -O3... none required
  1178. checking for ANSI C header files... (cached) yes
  1179. checking for sys/wait.h that is POSIX.1 compatible... yes
  1180. checking whether compiler supports -funroll-loops... -- Looking for byteswap.h - found
  1181. -- Looking for sys/endian.h
  1182. yes
  1183. checking unwind.h usability... yes
  1184. checking fcntl.h usability... -- Looking for sys/endian.h - not found
  1185. -- Looking for sys/mman.h
  1186. yes
  1187. checking unwind.h presence... yes
  1188. checking for unwind.h... yes
  1189. checking for _Unwind_Backtrace in -lgcc... yes
  1190. checking fcntl.h presence... -- Performing Test COMPILER_OPT_ARCH_NATIVE_SUPPORTED - Success
  1191. yes
  1192. checking for fcntl.h... yes
  1193. -- Looking for pthread.h
  1194. checking limits.h usability... yes
  1195. checking configured backtracing method... libgcc
  1196. checking for sbrk... yes
  1197. checking limits.h presence... yes
  1198. checking for limits.h... yes
  1199. checking malloc.h usability... -- Looking for sys/mman.h - found
  1200. -- Looking for sys/resource.h
  1201. yes
  1202. checking whether utrace(2) is compilable... yes
  1203. checking malloc.h presence... yes
  1204. checking for malloc.h... yes
  1205. checking for stdlib.h... (cached) yes
  1206. -- Looking for pthread.h - found
  1207. -- Looking for pthread_create
  1208. checking for string.h... (cached) yes
  1209. no
  1210. checking whether valgrind is compilable... checking sys/ioctl.h usability... no
  1211. checking whether a program using __builtin_unreachable is compilable... -- Looking for sys/resource.h - found
  1212. -- Looking for sys/time.h
  1213. yes
  1214. checking sys/ioctl.h presence... yes
  1215. checking for sys/ioctl.h... yes
  1216. checking sys/param.h usability... yes
  1217. checking whether a program using __builtin_ffsl is compilable... -- Looking for pthread_create - not found
  1218. -- Looking for pthread_create in pthreads
  1219. yes
  1220. checking sys/param.h presence... yes
  1221. checking for sys/param.h... yes
  1222. checking for unistd.h... (cached) yes
  1223. yes
  1224. checking curses.h usability... checking LG_PAGE... -- Looking for sys/time.h - found
  1225. -- Looking for sys/uio.h
  1226. no
  1227. checking curses.h presence... -- Looking for pthread_create in pthreads - not found
  1228. -- Looking for pthread_create in pthread
  1229. no
  1230. checking for curses.h... no
  1231. checking ncurses.h usability... 12
  1232. no
  1233. checking ncurses.h presence... no
  1234. checking for ncurses.h... no
  1235. checking sys/cdefs.h usability... Missing VERSION file, and unable to generate it; creating bogus VERSION
  1236. checking pthread.h usability... -- Looking for sys/uio.h - found
  1237. -- Looking for unistd.h
  1238. yes
  1239. checking sys/cdefs.h presence... yes
  1240. checking for sys/cdefs.h... yes
  1241. checking termcap.h usability... -- Looking for pthread_create in pthread - found
  1242. -- Found Threads: TRUE  
  1243. yes
  1244. checking pthread.h presence... yes
  1245. checking for pthread.h... yes
  1246. checking for pthread_create in -lpthread... no
  1247. checking termcap.h presence... no
  1248. checking for termcap.h... no
  1249. checking for ncurses.h... (cached) no
  1250. checking for curses.h... (cached) no
  1251. checking for termcap.h... (cached) no
  1252. configure: error: ncurses.h, curses.h, or termcap.h is required!
  1253. -- Looking for unistd.h - found
  1254. -- Looking for windows.h
  1255. yes
  1256. checking whether pthread_atfork(3) is compilable... Makefile:661: recipe for target '/home/myuser/testa/cockroach-v20.1.0/native/aarch64-linux-gnu/libedit/Makefile' failed
  1257. make[1]: *** [/home/myuser/testa/cockroach-v20.1.0/native/aarch64-linux-gnu/libedit/Makefile] Error 1
  1258. make[1]: *** Waiting for unfinished jobs....
  1259. -- Compiler:
  1260. -- Flags: -g1 -march=native
  1261. -- Build type: Release
  1262. -- The following OPTIONAL packages have been found:
  1263.  
  1264.  * Threads
  1265.  
  1266. -- Looking for windows.h - not found
  1267. -- Looking for zlibVersion in z
  1268. -- Configuring done
  1269. yes
  1270. checking for library containing clock_gettime... none required
  1271. checking whether clock_gettime(CLOCK_MONOTONIC_COARSE, ...) is compilable... -- Generating done
  1272. -- Looking for zlibVersion in z - not found
  1273. -- Looking for lzo1x_1_15_compress in lzo2
  1274. -- Build files have been written to: /home/myuser/testa/cockroach-v20.1.0/native/aarch64-linux-gnu/cryptopp
  1275. yes
  1276. checking whether clock_gettime(CLOCK_MONOTONIC, ...) is compilable... -- Looking for lzo1x_1_15_compress in lzo2 - not found
  1277. -- Performing Test HAVE_BUILTIN_EXPECT
  1278. yes
  1279. checking whether mach_absolute_time() is compilable... no
  1280. checking whether compiler supports -Werror... yes
  1281. checking whether syscall(2) is compilable... -- Performing Test HAVE_BUILTIN_EXPECT - Success
  1282. -- Performing Test HAVE_BUILTIN_CTZ
  1283. yes
  1284. checking for secure_getenv... yes
  1285. checking for issetugid... -- Performing Test HAVE_BUILTIN_CTZ - Success
  1286. -- Looking for mmap
  1287. no
  1288. checking for _malloc_thread_cleanup... no
  1289. checking for _pthread_mutex_init_calloc_cb... -- Looking for mmap - found
  1290. -- Looking for sysconf
  1291. no
  1292. checking for TLS... yes
  1293. checking whether C11 atomics is compilable... yes
  1294. checking whether atomic(9) is compilable... -- Looking for sysconf - found
  1295. -- Configuring done
  1296. no
  1297. checking whether Darwin OSAtomic*() is compilable... -- Generating done
  1298. -- Build files have been written to: /home/myuser/testa/cockroach-v20.1.0/native/aarch64-linux-gnu/snappy
  1299. no
  1300. checking whether madvise(2) is compilable... yes
  1301. checking whether madvise(..., MADV_FREE) is compilable... yes
  1302. checking whether madvise(..., MADV_DONTNEED) is compilable... yes
  1303. checking whether madvise(..., MADV_[NO]HUGEPAGE) is compilable... yes
  1304. checking whether to force 32-bit __sync_{add,sub}_and_fetch()... no
  1305. checking whether to force 64-bit __sync_{add,sub}_and_fetch()... no
  1306. checking for __builtin_clz... yes
  1307. checking whether Darwin os_unfair_lock_*() is compilable... no
  1308. checking whether Darwin OSSpin*() is compilable... no
  1309. checking whether glibc malloc hook is compilable... yes
  1310. checking whether glibc memalign hook is compilable... yes
  1311. checking whether pthreads adaptive mutexes is compilable... yes
  1312. checking for stdbool.h that conforms to C99... yes
  1313. checking for _Bool... yes
  1314. configure: creating ./config.status
  1315. config.status: creating Makefile
  1316. config.status: creating jemalloc.pc
  1317. config.status: creating doc/html.xsl
  1318. config.status: creating doc/manpages.xsl
  1319. config.status: creating doc/jemalloc.xml
  1320. config.status: creating include/jemalloc/jemalloc_macros.h
  1321. config.status: creating include/jemalloc/jemalloc_protos.h
  1322. config.status: creating include/jemalloc/jemalloc_typedefs.h
  1323. config.status: creating include/jemalloc/internal/jemalloc_internal.h
  1324. config.status: creating test/test.sh
  1325. config.status: creating test/include/test/jemalloc_test.h
  1326. config.status: creating config.stamp
  1327. config.status: creating bin/jemalloc-config
  1328. config.status: creating bin/jemalloc.sh
  1329. config.status: creating bin/jeprof
  1330. config.status: creating include/jemalloc/jemalloc_defs.h
  1331. config.status: creating include/jemalloc/internal/jemalloc_internal_defs.h
  1332. config.status: creating test/include/test/jemalloc_test_defs.h
  1333. config.status: executing include/jemalloc/internal/private_namespace.h commands
  1334. config.status: executing include/jemalloc/internal/private_unnamespace.h commands
  1335. config.status: executing include/jemalloc/internal/public_symbols.txt commands
  1336. config.status: executing include/jemalloc/internal/public_namespace.h commands
  1337. config.status: executing include/jemalloc/internal/public_unnamespace.h commands
  1338. config.status: executing include/jemalloc/internal/size_classes.h commands
  1339. config.status: executing include/jemalloc/jemalloc_protos_jet.h commands
  1340. config.status: executing include/jemalloc/jemalloc_rename.h commands
  1341. config.status: executing include/jemalloc/jemalloc_mangle.h commands
  1342. config.status: executing include/jemalloc/jemalloc_mangle_jet.h commands
  1343. config.status: executing include/jemalloc/jemalloc.h commands
  1344. ===============================================================================
  1345. jemalloc version   : 0.0.0-0-g0000000000000000000000000000000000000000
  1346. library revision   : 2
  1347.  
  1348. CONFIG             : --enable-prof CFLAGS=-g1 LDFLAGS=
  1349. CC                 : gcc
  1350. CONFIGURE_CFLAGS   : -std=gnu11 -Wall -Werror=declaration-after-statement -Wsign-compare -pipe -g3 -fvisibility=hidden -O3 -funroll-loops
  1351. SPECIFIED_CFLAGS   : -g1
  1352. EXTRA_CFLAGS       :
  1353. CPPFLAGS           : -D_GNU_SOURCE -D_REENTRANT
  1354. LDFLAGS            :
  1355. EXTRA_LDFLAGS      :
  1356. LIBS               : -lm  -lgcc -lm -lpthread
  1357. RPATH_EXTRA        :
  1358.  
  1359. XSLTPROC           : false
  1360. XSLROOT            :
  1361.  
  1362. PREFIX             : /usr/local
  1363. BINDIR             : /usr/local/bin
  1364. DATADIR            : /usr/local/share
  1365. INCLUDEDIR         : /usr/local/include
  1366. LIBDIR             : /usr/local/lib
  1367. MANDIR             : /usr/local/share/man
  1368.  
  1369. srcroot            : /home/myuser/testa/cockroach-v20.1.0/src/github.com/cockroachdb/cockroach/c-deps/jemalloc/
  1370. abs_srcroot        : /home/myuser/testa/cockroach-v20.1.0/src/github.com/cockroachdb/cockroach/c-deps/jemalloc/
  1371. objroot            :
  1372. abs_objroot        : /home/myuser/testa/cockroach-v20.1.0/native/aarch64-linux-gnu/jemalloc/
  1373.  
  1374. JEMALLOC_PREFIX    :
  1375. JEMALLOC_PRIVATE_NAMESPACE
  1376.                    : je_
  1377. install_suffix     :
  1378. malloc_conf        :
  1379. autogen            : 0
  1380. cc-silence         : 1
  1381. debug              : 0
  1382. code-coverage      : 0
  1383. stats              : 1
  1384. prof               : 1
  1385. prof-libunwind     : 0
  1386. prof-libgcc        : 1
  1387. prof-gcc           : 0
  1388. tcache             : 1
  1389. thp                : 1
  1390. fill               : 1
  1391. utrace             : 0
  1392. valgrind           : 0
  1393. xmalloc            : 0
  1394. munmap             : 0
  1395. lazy_lock          : 0
  1396. tls                : 1
  1397. cache-oblivious    : 1
  1398. ===============================================================================
  1399. make[1]: Leaving directory '/home/myuser/testa/cockroach-v20.1.0/src/github.com/cockroachdb/cockroach'
  1400. Makefile:6: recipe for target 'build' failed
  1401. make: *** [build] Error 2
  1402. myuser@nanopineo2:~/testa/cockroach-v20.1.0$
RAW Paste Data
We use cookies for various purposes including analytics. By continuing to use Pastebin, you agree to our use of cookies as described in the Cookies Policy. OK, I Understand
Top