Advertisement
kdaud

Untitled

Feb 2nd, 2021
788
0
Never
Not a member of Pastebin yet? Sign Up, it unlocks many cool features!
Bash 5.62 KB | None | 0 0
  1. Tests run: 16, Failures: 0, Errors: 16, Skipped: 0
  2.  
  3. [INFO] ------------------------------------------------------------------------
  4. [INFO] BUILD FAILURE
  5. [INFO] ------------------------------------------------------------------------
  6. [INFO] Total time:  30.705 s
  7. [INFO] Finished at: 2021-02-02T09:54:29+03:00
  8. [INFO] ------------------------------------------------------------------------
  9. [ERROR] Failed to execute goal org.apache.maven.plugins:maven-surefire-plugin:2.12.4:test (default-test) on project qaframework: There are test failures.
  10. [ERROR]
  11. [ERROR] Please refer to /home/opensource/qadev/openmrs-contrib-qaframework/target/surefire-reports for the individual test results.
  12. [ERROR] -> [Help 1]
  13. org.apache.maven.lifecycle.LifecycleExecutionException: Failed to execute goal org.apache.maven.plugins:maven-surefire-plugin:2.12.4:test (default-test) on project qaframework: There are test failures.
  14.  
  15. Please refer to /home/opensource/qadev/openmrs-contrib-qaframework/target/surefire-reports for the individual test results.
  16.     at org.apache.maven.lifecycle.internal.MojoExecutor.execute (MojoExecutor.java:215)
  17.     at org.apache.maven.lifecycle.internal.MojoExecutor.execute (MojoExecutor.java:156)
  18.     at org.apache.maven.lifecycle.internal.MojoExecutor.execute (MojoExecutor.java:148)
  19.     at org.apache.maven.lifecycle.internal.LifecycleModuleBuilder.buildProject (LifecycleModuleBuilder.java:117)
  20.     at org.apache.maven.lifecycle.internal.LifecycleModuleBuilder.buildProject (LifecycleModuleBuilder.java:81)
  21.     at org.apache.maven.lifecycle.internal.builder.singlethreaded.SingleThreadedBuilder.build (SingleThreadedBuilder.java:56)
  22.     at org.apache.maven.lifecycle.internal.LifecycleStarter.execute (LifecycleStarter.java:128)
  23.     at org.apache.maven.DefaultMaven.doExecute (DefaultMaven.java:305)
  24.     at org.apache.maven.DefaultMaven.doExecute (DefaultMaven.java:192)
  25.     at org.apache.maven.DefaultMaven.execute (DefaultMaven.java:105)
  26.     at org.apache.maven.cli.MavenCli.execute (MavenCli.java:957)
  27.     at org.apache.maven.cli.MavenCli.doMain (MavenCli.java:289)
  28.     at org.apache.maven.cli.MavenCli.main (MavenCli.java:193)
  29.     at sun.reflect.NativeMethodAccessorImpl.invoke0 (Native Method)
  30.     at sun.reflect.NativeMethodAccessorImpl.invoke (NativeMethodAccessorImpl.java:62)
  31.     at sun.reflect.DelegatingMethodAccessorImpl.invoke (DelegatingMethodAccessorImpl.java:43)
  32.     at java.lang.reflect.Method.invoke (Method.java:498)
  33.     at org.codehaus.plexus.classworlds.launcher.Launcher.launchEnhanced (Launcher.java:282)
  34.     at org.codehaus.plexus.classworlds.launcher.Launcher.launch (Launcher.java:225)
  35.     at org.codehaus.plexus.classworlds.launcher.Launcher.mainWithExitCode (Launcher.java:406)
  36.     at org.codehaus.plexus.classworlds.launcher.Launcher.main (Launcher.java:347)
  37. Caused by: org.apache.maven.plugin.MojoFailureException: There are test failures.
  38.  
  39. Please refer to /home/opensource/qadev/openmrs-contrib-qaframework/target/surefire-reports for the individual test results.
  40.     at org.apache.maven.plugin.surefire.SurefireHelper.reportExecution (SurefireHelper.java:83)
  41.     at org.apache.maven.plugin.surefire.SurefirePlugin.writeSummary (SurefirePlugin.java:176)
  42.     at org.apache.maven.plugin.surefire.SurefirePlugin.handleSummary (SurefirePlugin.java:150)
  43.     at org.apache.maven.plugin.surefire.AbstractSurefireMojo.executeAfterPreconditionsChecked (AbstractSurefireMojo.java:650)
  44.     at org.apache.maven.plugin.surefire.AbstractSurefireMojo.execute (AbstractSurefireMojo.java:586)
  45.     at org.apache.maven.plugin.DefaultBuildPluginManager.executeMojo (DefaultBuildPluginManager.java:137)
  46.     at org.apache.maven.lifecycle.internal.MojoExecutor.execute (MojoExecutor.java:210)
  47.     at org.apache.maven.lifecycle.internal.MojoExecutor.execute (MojoExecutor.java:156)
  48.     at org.apache.maven.lifecycle.internal.MojoExecutor.execute (MojoExecutor.java:148)
  49.     at org.apache.maven.lifecycle.internal.LifecycleModuleBuilder.buildProject (LifecycleModuleBuilder.java:117)
  50.     at org.apache.maven.lifecycle.internal.LifecycleModuleBuilder.buildProject (LifecycleModuleBuilder.java:81)
  51.     at org.apache.maven.lifecycle.internal.builder.singlethreaded.SingleThreadedBuilder.build (SingleThreadedBuilder.java:56)
  52.     at org.apache.maven.lifecycle.internal.LifecycleStarter.execute (LifecycleStarter.java:128)
  53.     at org.apache.maven.DefaultMaven.doExecute (DefaultMaven.java:305)
  54.     at org.apache.maven.DefaultMaven.doExecute (DefaultMaven.java:192)
  55.     at org.apache.maven.DefaultMaven.execute (DefaultMaven.java:105)
  56.     at org.apache.maven.cli.MavenCli.execute (MavenCli.java:957)
  57.     at org.apache.maven.cli.MavenCli.doMain (MavenCli.java:289)
  58.     at org.apache.maven.cli.MavenCli.main (MavenCli.java:193)
  59.     at sun.reflect.NativeMethodAccessorImpl.invoke0 (Native Method)
  60.     at sun.reflect.NativeMethodAccessorImpl.invoke (NativeMethodAccessorImpl.java:62)
  61.     at sun.reflect.DelegatingMethodAccessorImpl.invoke (DelegatingMethodAccessorImpl.java:43)
  62.     at java.lang.reflect.Method.invoke (Method.java:498)
  63.     at org.codehaus.plexus.classworlds.launcher.Launcher.launchEnhanced (Launcher.java:282)
  64.     at org.codehaus.plexus.classworlds.launcher.Launcher.launch (Launcher.java:225)
  65.     at org.codehaus.plexus.classworlds.launcher.Launcher.mainWithExitCode (Launcher.java:406)
  66.     at org.codehaus.plexus.classworlds.launcher.Launcher.main (Launcher.java:347)
  67. [ERROR]
  68. [ERROR]
  69. [ERROR] For more information about the errors and possible solutions, please read the following articles:
  70. [ERROR] [Help 1] http://cwiki.apache.org/confluence/display/MAVEN/MojoFailureException
  71. opensource@opensource-OptiPlex-3010:~/qadev/openmrs-contrib-qaframework$
  72.  
Advertisement
Add Comment
Please, Sign In to add comment
Advertisement