Not a member of Pastebin yet?
Sign Up,
it unlocks many cool features!
- luke@Wolf:~/StudioProjects/berty/js$ make android.release
- npx react-native run-android \
- --no-packager \
- --port="8081" \
- --variant=Release \
- warn Package @types/jest has been ignored because it contains invalid configuration. Reason: Package subpath './package.json' is not defined by "exports" in /home/luke/StudioProjects/berty/js/node_modules/@types/jest/package.json
- info Running jetifier to migrate libraries to AndroidX. You can disable it using "--no-jetifier" flag.
- Jetifier found 1673 file(s) to forward-jetify. Using 12 workers...
- adb server version (41) doesn't match this client (39); killing...
- * daemon started successfully
- info Launching emulator...
- info Successfully launched emulator.
- info Installing the app...
- 01:53:04 V/ddms: execute 'getprop' on 'emulator-5554' : EOF hit. Read: -1
- 01:53:04 V/ddms: execute: returning
- > Configure project :app
- WARNING: BuildType(releaseStaff): buildConfigField 'DEBUG_LOGS' value is being replaced: false -> true
- WARNING: BuildType(releaseYolo): buildConfigField 'DEBUG_LOGS' value is being replaced: false -> true
- > Configure project :expo-file-system
- WARNING: Configuration 'testApi' is obsolete and has been replaced with 'testImplementation'.
- It will be removed in version 5.0 of the Android Gradle plugin.
- For more information, see http://d.android.com/r/tools/update-dependency-configurations.html.
- > Configure project :expo
- Using expo modules
- - expo-application (4.0.2)
- - expo-barcode-scanner (11.2.1)
- - expo-camera (12.1.2)
- - expo-constants (13.0.2)
- - expo-error-recovery (3.0.5)
- - expo-file-system (13.1.4)
- - expo-font (10.0.5)
- - expo-image-loader (3.1.1)
- - expo-keep-awake (10.0.2)
- - expo-mail-composer (11.1.1)
- - expo-modules-core (0.6.5)
- - expo-network (4.1.1)
- - expo-web-browser (10.1.1)
- > Configure project :react-native-android-keyboard-adjust
- WARNING: Configuration 'compile' is obsolete and has been replaced with 'implementation' and 'api'.
- It will be removed in version 5.0 of the Android Gradle plugin.
- For more information, see http://d.android.com/r/tools/update-dependency-configurations.html.
- The Kotlin Gradle plugin was loaded multiple times in different subprojects, which is not supported and may break the build.
- This might happen in subprojects that apply the Kotlin plugins with the Gradle 'plugins { ... }' DSL if they specify explicit versions, even if the versions are equal.
- Please add the Kotlin plugin to the common parent project or the root project, then remove the versions in the subprojects.
- If the parent project does not need the plugin, add 'apply false' to the plugin line.
- See: https://docs.gradle.org/current/userguide/plugins.html#sec:subprojects_plugins_dsl
- The Kotlin plugin was loaded in the following projects: ':react-native-pager-view', ':shopify_flash-list'
- > Task :app:installRelease
- Installing APK 'app-armeabi-v7a-release.apk' on 'Pixel_6_API_30(AVD) - 7.1.1' for app:release
- > Task :app:installRelease FAILED
- Deprecated Gradle features were used in this build, making it incompatible with Gradle 7.0.
- Use '--warning-mode all' to show the individual deprecation warnings.
- See https://docs.gradle.org/6.7/userguide/command_line_interface.html#sec:command_line_warnings
- 704 actionable tasks: 6 executed, 698 up-to-date
- Unable to install /home/luke/StudioProjects/berty/js/android/app/build/outputs/apk/release/app-armeabi-v7a-release.apk
- com.android.ddmlib.InstallException: INSTALL_FAILED_INVALID_APK: Package couldn't be installed in /data/app/tech.berty.android-2: Package /data/app/tech.berty.android-2/base.apk code is missing
- at com.android.ddmlib.internal.DeviceImpl.installRemotePackage(DeviceImpl.java:1224)
- at com.android.ddmlib.internal.DeviceImpl.installPackage(DeviceImpl.java:1050)
- at com.android.ddmlib.internal.DeviceImpl.installPackage(DeviceImpl.java:1026)
- at com.android.ddmlib.internal.DeviceImpl.installPackage(DeviceImpl.java:1015)
- at com.android.build.gradle.internal.testing.ConnectedDevice.installPackage(ConnectedDevice.java:130)
- at com.android.build.gradle.internal.tasks.InstallVariantTask.install(InstallVariantTask.java:157)
- at com.android.build.gradle.internal.tasks.InstallVariantTask.lambda$doTaskAction$1(InstallVariantTask.java:94)
- at com.android.builder.testing.api.DeviceProvider.use(DeviceProvider.java:53)
- at com.android.build.gradle.internal.tasks.InstallVariantTask.doTaskAction(InstallVariantTask.java:89)
- at com.android.build.gradle.internal.tasks.NonIncrementalTask$taskAction$$inlined$recordTaskAction$1.invoke(AndroidVariantTask.kt:74)
- at com.android.build.gradle.internal.tasks.NonIncrementalTask$taskAction$$inlined$recordTaskAction$1.invoke(AndroidVariantTask.kt:34)
- at com.android.build.gradle.internal.tasks.Blocks.recordSpan(Blocks.java:91)
- at com.android.build.gradle.internal.tasks.NonIncrementalTask.taskAction(NonIncrementalTask.kt:57)
- at java.base/jdk.internal.reflect.NativeMethodAccessorImpl.invoke0(Native Method)
- at java.base/jdk.internal.reflect.NativeMethodAccessorImpl.invoke(NativeMethodAccessorImpl.java:62)
- at java.base/jdk.internal.reflect.DelegatingMethodAccessorImpl.invoke(DelegatingMethodAccessorImpl.java:43)
- at java.base/java.lang.reflect.Method.invoke(Method.java:566)
- at org.gradle.internal.reflect.JavaMethod.invoke(JavaMethod.java:104)
- at org.gradle.api.internal.project.taskfactory.StandardTaskAction.doExecute(StandardTaskAction.java:58)
- at org.gradle.api.internal.project.taskfactory.StandardTaskAction.execute(StandardTaskAction.java:51)
- at org.gradle.api.internal.project.taskfactory.StandardTaskAction.execute(StandardTaskAction.java:29)
- at org.gradle.api.internal.tasks.execution.ExecuteActionsTaskExecuter$3.run(ExecuteActionsTaskExecuter.java:555)
- at org.gradle.internal.operations.DefaultBuildOperationRunner$1.execute(DefaultBuildOperationRunner.java:29)
- at org.gradle.internal.operations.DefaultBuildOperationRunner$1.execute(DefaultBuildOperationRunner.java:26)
- at org.gradle.internal.operations.DefaultBuildOperationRunner$3.execute(DefaultBuildOperationRunner.java:75)
- at org.gradle.internal.operations.DefaultBuildOperationRunner$3.execute(DefaultBuildOperationRunner.java:68)
- at org.gradle.internal.operations.DefaultBuildOperationRunner.execute(DefaultBuildOperationRunner.java:153)
- at org.gradle.internal.operations.DefaultBuildOperationRunner.execute(DefaultBuildOperationRunner.java:68)
- at org.gradle.internal.operations.DefaultBuildOperationRunner.run(DefaultBuildOperationRunner.java:56)
- at org.gradle.internal.operations.DefaultBuildOperationExecutor.lambda$run$1(DefaultBuildOperationExecutor.java:71)
- at org.gradle.internal.operations.UnmanagedBuildOperationWrapper.runWithUnmanagedSupport(UnmanagedBuildOperationWrapper.java:45)
- at org.gradle.internal.operations.DefaultBuildOperationExecutor.run(DefaultBuildOperationExecutor.java:71)
- at org.gradle.api.internal.tasks.execution.ExecuteActionsTaskExecuter.executeAction(ExecuteActionsTaskExecuter.java:540)
- at org.gradle.api.internal.tasks.execution.ExecuteActionsTaskExecuter.executeActions(ExecuteActionsTaskExecuter.java:523)
- at org.gradle.api.internal.tasks.execution.ExecuteActionsTaskExecuter.access$300(ExecuteActionsTaskExecuter.java:108)
- at org.gradle.api.internal.tasks.execution.ExecuteActionsTaskExecuter$TaskExecution.executeWithPreviousOutputFiles(ExecuteActionsTaskExecuter.java:271)
- at org.gradle.api.internal.tasks.execution.ExecuteActionsTaskExecuter$TaskExecution.execute(ExecuteActionsTaskExecuter.java:260)
- at org.gradle.internal.execution.steps.ExecuteStep.lambda$execute$1(ExecuteStep.java:34)
- at java.base/java.util.Optional.orElseGet(Optional.java:369)
- at org.gradle.internal.execution.steps.ExecuteStep.execute(ExecuteStep.java:34)
- at org.gradle.internal.execution.steps.ExecuteStep.execute(ExecuteStep.java:26)
- at org.gradle.internal.execution.steps.CleanupOutputsStep.execute(CleanupOutputsStep.java:67)
- at org.gradle.internal.execution.steps.CleanupOutputsStep.execute(CleanupOutputsStep.java:36)
- at org.gradle.internal.execution.steps.ResolveInputChangesStep.execute(ResolveInputChangesStep.java:49)
- at org.gradle.internal.execution.steps.ResolveInputChangesStep.execute(ResolveInputChangesStep.java:34)
- at org.gradle.internal.execution.steps.CancelExecutionStep.execute(CancelExecutionStep.java:43)
- at org.gradle.internal.execution.steps.TimeoutStep.executeWithoutTimeout(TimeoutStep.java:73)
- at org.gradle.internal.execution.steps.TimeoutStep.execute(TimeoutStep.java:54)
- at org.gradle.internal.execution.steps.CreateOutputsStep.execute(CreateOutputsStep.java:44)
- at org.gradle.internal.execution.steps.SnapshotOutputsStep.execute(SnapshotOutputsStep.java:54)
- at org.gradle.internal.execution.steps.SnapshotOutputsStep.execute(SnapshotOutputsStep.java:38)
- at org.gradle.internal.execution.steps.BroadcastChangingOutputsStep.execute(BroadcastChangingOutputsStep.java:42)
- at org.gradle.internal.execution.steps.CacheStep.executeWithoutCache(CacheStep.java:159)
- at org.gradle.internal.execution.steps.CacheStep.execute(CacheStep.java:72)
- at org.gradle.internal.execution.steps.CacheStep.execute(CacheStep.java:43)
- at org.gradle.internal.execution.steps.StoreExecutionStateStep.execute(StoreExecutionStateStep.java:44)
- at org.gradle.internal.execution.steps.StoreExecutionStateStep.execute(StoreExecutionStateStep.java:33)
- at org.gradle.internal.execution.steps.RecordOutputsStep.execute(RecordOutputsStep.java:38)
- at org.gradle.internal.execution.steps.RecordOutputsStep.execute(RecordOutputsStep.java:24)
- at org.gradle.internal.execution.steps.SkipUpToDateStep.executeBecause(SkipUpToDateStep.java:92)
- at org.gradle.internal.execution.steps.SkipUpToDateStep.lambda$execute$0(SkipUpToDateStep.java:85)
- at java.base/java.util.Optional.map(Optional.java:265)
- at org.gradle.internal.execution.steps.SkipUpToDateStep.execute(SkipUpToDateStep.java:55)
- at org.gradle.internal.execution.steps.SkipUpToDateStep.execute(SkipUpToDateStep.java:39)
- at org.gradle.internal.execution.steps.ResolveChangesStep.execute(ResolveChangesStep.java:76)
- at org.gradle.internal.execution.steps.ResolveChangesStep.execute(ResolveChangesStep.java:37)
- at org.gradle.internal.execution.steps.legacy.MarkSnapshottingInputsFinishedStep.execute(MarkSnapshottingInputsFinishedStep.java:36)
- at org.gradle.internal.execution.steps.legacy.MarkSnapshottingInputsFinishedStep.execute(MarkSnapshottingInputsFinishedStep.java:26)
- at org.gradle.internal.execution.steps.ResolveCachingStateStep.execute(ResolveCachingStateStep.java:94)
- at org.gradle.internal.execution.steps.ResolveCachingStateStep.execute(ResolveCachingStateStep.java:49)
- at org.gradle.internal.execution.steps.CaptureStateBeforeExecutionStep.execute(CaptureStateBeforeExecutionStep.java:79)
- at org.gradle.internal.execution.steps.CaptureStateBeforeExecutionStep.execute(CaptureStateBeforeExecutionStep.java:53)
- at org.gradle.internal.execution.steps.ValidateStep.execute(ValidateStep.java:74)
- at org.gradle.internal.execution.steps.SkipEmptyWorkStep.lambda$execute$2(SkipEmptyWorkStep.java:78)
- at java.base/java.util.Optional.orElseGet(Optional.java:369)
- at org.gradle.internal.execution.steps.SkipEmptyWorkStep.execute(SkipEmptyWorkStep.java:78)
- at org.gradle.internal.execution.steps.SkipEmptyWorkStep.execute(SkipEmptyWorkStep.java:34)
- at org.gradle.internal.execution.steps.legacy.MarkSnapshottingInputsStartedStep.execute(MarkSnapshottingInputsStartedStep.java:39)
- at org.gradle.internal.execution.steps.LoadExecutionStateStep.execute(LoadExecutionStateStep.java:40)
- at org.gradle.internal.execution.steps.LoadExecutionStateStep.execute(LoadExecutionStateStep.java:28)
- at org.gradle.internal.execution.impl.DefaultWorkExecutor.execute(DefaultWorkExecutor.java:33)
- at org.gradle.api.internal.tasks.execution.ExecuteActionsTaskExecuter.executeIfValid(ExecuteActionsTaskExecuter.java:187)
- at org.gradle.api.internal.tasks.execution.ExecuteActionsTaskExecuter.execute(ExecuteActionsTaskExecuter.java:179)
- at org.gradle.api.internal.tasks.execution.CleanupStaleOutputsExecuter.execute(CleanupStaleOutputsExecuter.java:109)
- at org.gradle.api.internal.tasks.execution.FinalizePropertiesTaskExecuter.execute(FinalizePropertiesTaskExecuter.java:46)
- at org.gradle.api.internal.tasks.execution.ResolveTaskExecutionModeExecuter.execute(ResolveTaskExecutionModeExecuter.java:62)
- at org.gradle.api.internal.tasks.execution.SkipTaskWithNoActionsExecuter.execute(SkipTaskWithNoActionsExecuter.java:57)
- at org.gradle.api.internal.tasks.execution.SkipOnlyIfTaskExecuter.execute(SkipOnlyIfTaskExecuter.java:56)
- at org.gradle.api.internal.tasks.execution.CatchExceptionTaskExecuter.execute(CatchExceptionTaskExecuter.java:36)
- at org.gradle.api.internal.tasks.execution.EventFiringTaskExecuter$1.executeTask(EventFiringTaskExecuter.java:77)
- at org.gradle.api.internal.tasks.execution.EventFiringTaskExecuter$1.call(EventFiringTaskExecuter.java:55)
- at org.gradle.api.internal.tasks.execution.EventFiringTaskExecuter$1.call(EventFiringTaskExecuter.java:52)
- at org.gradle.internal.operations.DefaultBuildOperationRunner$CallableBuildOperationWorker.execute(DefaultBuildOperationRunner.java:200)
- at org.gradle.internal.operations.DefaultBuildOperationRunner$CallableBuildOperationWorker.execute(DefaultBuildOperationRunner.java:195)
- at org.gradle.internal.operations.DefaultBuildOperationRunner$3.execute(DefaultBuildOperationRunner.java:75)
- at org.gradle.internal.operations.DefaultBuildOperationRunner$3.execute(DefaultBuildOperationRunner.java:68)
- at org.gradle.internal.operations.DefaultBuildOperationRunner.execute(DefaultBuildOperationRunner.java:153)
- at org.gradle.internal.operations.DefaultBuildOperationRunner.execute(DefaultBuildOperationRunner.java:68)
- at org.gradle.internal.operations.DefaultBuildOperationRunner.call(DefaultBuildOperationRunner.java:62)
- at org.gradle.internal.operations.DefaultBuildOperationExecutor.lambda$call$2(DefaultBuildOperationExecutor.java:76)
- at org.gradle.internal.operations.UnmanagedBuildOperationWrapper.callWithUnmanagedSupport(UnmanagedBuildOperationWrapper.java:54)
- at org.gradle.internal.operations.DefaultBuildOperationExecutor.call(DefaultBuildOperationExecutor.java:76)
- at org.gradle.api.internal.tasks.execution.EventFiringTaskExecuter.execute(EventFiringTaskExecuter.java:52)
- at org.gradle.execution.plan.LocalTaskNodeExecutor.execute(LocalTaskNodeExecutor.java:41)
- at org.gradle.execution.taskgraph.DefaultTaskExecutionGraph$InvokeNodeExecutorsAction.execute(DefaultTaskExecutionGraph.java:372)
- at org.gradle.execution.taskgraph.DefaultTaskExecutionGraph$InvokeNodeExecutorsAction.execute(DefaultTaskExecutionGraph.java:359)
- at org.gradle.execution.taskgraph.DefaultTaskExecutionGraph$BuildOperationAwareExecutionAction.execute(DefaultTaskExecutionGraph.java:352)
- at org.gradle.execution.taskgraph.DefaultTaskExecutionGraph$BuildOperationAwareExecutionAction.execute(DefaultTaskExecutionGraph.java:338)
- at org.gradle.execution.plan.DefaultPlanExecutor$ExecutorWorker.lambda$run$0(DefaultPlanExecutor.java:127)
- at org.gradle.execution.plan.DefaultPlanExecutor$ExecutorWorker.execute(DefaultPlanExecutor.java:191)
- at org.gradle.execution.plan.DefaultPlanExecutor$ExecutorWorker.executeNextNode(DefaultPlanExecutor.java:182)
- at org.gradle.execution.plan.DefaultPlanExecutor$ExecutorWorker.run(DefaultPlanExecutor.java:124)
- at org.gradle.internal.concurrent.ExecutorPolicy$CatchAndRecordFailures.onExecute(ExecutorPolicy.java:64)
- at org.gradle.internal.concurrent.ManagedExecutorImpl$1.run(ManagedExecutorImpl.java:48)
- at java.base/java.util.concurrent.ThreadPoolExecutor.runWorker(ThreadPoolExecutor.java:1128)
- at java.base/java.util.concurrent.ThreadPoolExecutor$Worker.run(ThreadPoolExecutor.java:628)
- at org.gradle.internal.concurrent.ThreadFactoryImpl$ManagedThreadRunnable.run(ThreadFactoryImpl.java:56)
- at java.base/java.lang.Thread.run(Thread.java:829)
- FAILURE: Build failed with an exception.
- * What went wrong:
- Execution failed for task ':app:installRelease'.
- > java.util.concurrent.ExecutionException: com.android.builder.testing.api.DeviceException: com.android.ddmlib.InstallException: INSTALL_FAILED_INVALID_APK: Package couldn't be installed in /data/app/tech.berty.android-2: Package /data/app/tech.berty.android-2/base.apk code is missing
- * Try:
- Run with --stacktrace option to get the stack trace. Run with --info or --debug option to get more log output. Run with --scan to get full insights.
- * Get more help at https://help.gradle.org
- BUILD FAILED in 4m 8s
- error Failed to install the app. Make sure you have the Android development environment set up: https://reactnative.dev/docs/environment-setup.
- Error: Command failed: ./gradlew app:installRelease -PreactNativeDevServerPort=8081
- Unable to install /home/luke/StudioProjects/berty/js/android/app/build/outputs/apk/release/app-armeabi-v7a-release.apk
- com.android.ddmlib.InstallException: INSTALL_FAILED_INVALID_APK: Package couldn't be installed in /data/app/tech.berty.android-2: Package /data/app/tech.berty.android-2/base.apk code is missing
- at com.android.ddmlib.internal.DeviceImpl.installRemotePackage(DeviceImpl.java:1224)
- at com.android.ddmlib.internal.DeviceImpl.installPackage(DeviceImpl.java:1050)
- at com.android.ddmlib.internal.DeviceImpl.installPackage(DeviceImpl.java:1026)
- at com.android.ddmlib.internal.DeviceImpl.installPackage(DeviceImpl.java:1015)
- at com.android.build.gradle.internal.testing.ConnectedDevice.installPackage(ConnectedDevice.java:130)
- at com.android.build.gradle.internal.tasks.InstallVariantTask.install(InstallVariantTask.java:157)
- at com.android.build.gradle.internal.tasks.InstallVariantTask.lambda$doTaskAction$1(InstallVariantTask.java:94)
- at com.android.builder.testing.api.DeviceProvider.use(DeviceProvider.java:53)
- at com.android.build.gradle.internal.tasks.InstallVariantTask.doTaskAction(InstallVariantTask.java:89)
- at com.android.build.gradle.internal.tasks.NonIncrementalTask$taskAction$$inlined$recordTaskAction$1.invoke(AndroidVariantTask.kt:74)
- at com.android.build.gradle.internal.tasks.NonIncrementalTask$taskAction$$inlined$recordTaskAction$1.invoke(AndroidVariantTask.kt:34)
- at com.android.build.gradle.internal.tasks.Blocks.recordSpan(Blocks.java:91)
- at com.android.build.gradle.internal.tasks.NonIncrementalTask.taskAction(NonIncrementalTask.kt:57)
- at java.base/jdk.internal.reflect.NativeMethodAccessorImpl.invoke0(Native Method)
- at java.base/jdk.internal.reflect.NativeMethodAccessorImpl.invoke(NativeMethodAccessorImpl.java:62)
- at java.base/jdk.internal.reflect.DelegatingMethodAccessorImpl.invoke(DelegatingMethodAccessorImpl.java:43)
- at java.base/java.lang.reflect.Method.invoke(Method.java:566)
- at org.gradle.internal.reflect.JavaMethod.invoke(JavaMethod.java:104)
- at org.gradle.api.internal.project.taskfactory.StandardTaskAction.doExecute(StandardTaskAction.java:58)
- at org.gradle.api.internal.project.taskfactory.StandardTaskAction.execute(StandardTaskAction.java:51)
- at org.gradle.api.internal.project.taskfactory.StandardTaskAction.execute(StandardTaskAction.java:29)
- at org.gradle.api.internal.tasks.execution.ExecuteActionsTaskExecuter$3.run(ExecuteActionsTaskExecuter.java:555)
- at org.gradle.internal.operations.DefaultBuildOperationRunner$1.execute(DefaultBuildOperationRunner.java:29)
- at org.gradle.internal.operations.DefaultBuildOperationRunner$1.execute(DefaultBuildOperationRunner.java:26)
- at org.gradle.internal.operations.DefaultBuildOperationRunner$3.execute(DefaultBuildOperationRunner.java:75)
- at org.gradle.internal.operations.DefaultBuildOperationRunner$3.execute(DefaultBuildOperationRunner.java:68)
- at org.gradle.internal.operations.DefaultBuildOperationRunner.execute(DefaultBuildOperationRunner.java:153)
- at org.gradle.internal.operations.DefaultBuildOperationRunner.execute(DefaultBuildOperationRunner.java:68)
- at org.gradle.internal.operations.DefaultBuildOperationRunner.run(DefaultBuildOperationRunner.java:56)
- at org.gradle.internal.operations.DefaultBuildOperationExecutor.lambda$run$1(DefaultBuildOperationExecutor.java:71)
- at org.gradle.internal.operations.UnmanagedBuildOperationWrapper.runWithUnmanagedSupport(UnmanagedBuildOperationWrapper.java:45)
- at org.gradle.internal.operations.DefaultBuildOperationExecutor.run(DefaultBuildOperationExecutor.java:71)
- at org.gradle.api.internal.tasks.execution.ExecuteActionsTaskExecuter.executeAction(ExecuteActionsTaskExecuter.java:540)
- at org.gradle.api.internal.tasks.execution.ExecuteActionsTaskExecuter.executeActions(ExecuteActionsTaskExecuter.java:523)
- at org.gradle.api.internal.tasks.execution.ExecuteActionsTaskExecuter.access$300(ExecuteActionsTaskExecuter.java:108)
- at org.gradle.api.internal.tasks.execution.ExecuteActionsTaskExecuter$TaskExecution.executeWithPreviousOutputFiles(ExecuteActionsTaskExecuter.java:271)
- at org.gradle.api.internal.tasks.execution.ExecuteActionsTaskExecuter$TaskExecution.execute(ExecuteActionsTaskExecuter.java:260)
- at org.gradle.internal.execution.steps.ExecuteStep.lambda$execute$1(ExecuteStep.java:34)
- at java.base/java.util.Optional.orElseGet(Optional.java:369)
- at org.gradle.internal.execution.steps.ExecuteStep.execute(ExecuteStep.java:34)
- at org.gradle.internal.execution.steps.ExecuteStep.execute(ExecuteStep.java:26)
- at org.gradle.internal.execution.steps.CleanupOutputsStep.execute(CleanupOutputsStep.java:67)
- at org.gradle.internal.execution.steps.CleanupOutputsStep.execute(CleanupOutputsStep.java:36)
- at org.gradle.internal.execution.steps.ResolveInputChangesStep.execute(ResolveInputChangesStep.java:49)
- at org.gradle.internal.execution.steps.ResolveInputChangesStep.execute(ResolveInputChangesStep.java:34)
- at org.gradle.internal.execution.steps.CancelExecutionStep.execute(CancelExecutionStep.java:43)
- at org.gradle.internal.execution.steps.TimeoutStep.executeWithoutTimeout(TimeoutStep.java:73)
- at org.gradle.internal.execution.steps.TimeoutStep.execute(TimeoutStep.java:54)
- at org.gradle.internal.execution.steps.CreateOutputsStep.execute(CreateOutputsStep.java:44)
- at org.gradle.internal.execution.steps.SnapshotOutputsStep.execute(SnapshotOutputsStep.java:54)
- at org.gradle.internal.execution.steps.SnapshotOutputsStep.execute(SnapshotOutputsStep.java:38)
- at org.gradle.internal.execution.steps.BroadcastChangingOutputsStep.execute(BroadcastChangingOutputsStep.java:42)
- at org.gradle.internal.execution.steps.CacheStep.executeWithoutCache(CacheStep.java:159)
- at org.gradle.internal.execution.steps.CacheStep.execute(CacheStep.java:72)
- at org.gradle.internal.execution.steps.CacheStep.execute(CacheStep.java:43)
- at org.gradle.internal.execution.steps.StoreExecutionStateStep.execute(StoreExecutionStateStep.java:44)
- at org.gradle.internal.execution.steps.StoreExecutionStateStep.execute(StoreExecutionStateStep.java:33)
- at org.gradle.internal.execution.steps.RecordOutputsStep.execute(RecordOutputsStep.java:38)
- at org.gradle.internal.execution.steps.RecordOutputsStep.execute(RecordOutputsStep.java:24)
- at org.gradle.internal.execution.steps.SkipUpToDateStep.executeBecause(SkipUpToDateStep.java:92)
- at org.gradle.internal.execution.steps.SkipUpToDateStep.lambda$execute$0(SkipUpToDateStep.java:85)
- at java.base/java.util.Optional.map(Optional.java:265)
- at org.gradle.internal.execution.steps.SkipUpToDateStep.execute(SkipUpToDateStep.java:55)
- at org.gradle.internal.execution.steps.SkipUpToDateStep.execute(SkipUpToDateStep.java:39)
- at org.gradle.internal.execution.steps.ResolveChangesStep.execute(ResolveChangesStep.java:76)
- at org.gradle.internal.execution.steps.ResolveChangesStep.execute(ResolveChangesStep.java:37)
- at org.gradle.internal.execution.steps.legacy.MarkSnapshottingInputsFinishedStep.execute(MarkSnapshottingInputsFinishedStep.java:36)
- at org.gradle.internal.execution.steps.legacy.MarkSnapshottingInputsFinishedStep.execute(MarkSnapshottingInputsFinishedStep.java:26)
- at org.gradle.internal.execution.steps.ResolveCachingStateStep.execute(ResolveCachingStateStep.java:94)
- at org.gradle.internal.execution.steps.ResolveCachingStateStep.execute(ResolveCachingStateStep.java:49)
- at org.gradle.internal.execution.steps.CaptureStateBeforeExecutionStep.execute(CaptureStateBeforeExecutionStep.java:79)
- at org.gradle.internal.execution.steps.CaptureStateBeforeExecutionStep.execute(CaptureStateBeforeExecutionStep.java:53)
- at org.gradle.internal.execution.steps.ValidateStep.execute(ValidateStep.java:74)
- at org.gradle.internal.execution.steps.SkipEmptyWorkStep.lambda$execute$2(SkipEmptyWorkStep.java:78)
- at java.base/java.util.Optional.orElseGet(Optional.java:369)
- at org.gradle.internal.execution.steps.SkipEmptyWorkStep.execute(SkipEmptyWorkStep.java:78)
- at org.gradle.internal.execution.steps.SkipEmptyWorkStep.execute(SkipEmptyWorkStep.java:34)
- at org.gradle.internal.execution.steps.legacy.MarkSnapshottingInputsStartedStep.execute(MarkSnapshottingInputsStartedStep.java:39)
- at org.gradle.internal.execution.steps.LoadExecutionStateStep.execute(LoadExecutionStateStep.java:40)
- at org.gradle.internal.execution.steps.LoadExecutionStateStep.execute(LoadExecutionStateStep.java:28)
- at org.gradle.internal.execution.impl.DefaultWorkExecutor.execute(DefaultWorkExecutor.java:33)
- at org.gradle.api.internal.tasks.execution.ExecuteActionsTaskExecuter.executeIfValid(ExecuteActionsTaskExecuter.java:187)
- at org.gradle.api.internal.tasks.execution.ExecuteActionsTaskExecuter.execute(ExecuteActionsTaskExecuter.java:179)
- at org.gradle.api.internal.tasks.execution.CleanupStaleOutputsExecuter.execute(CleanupStaleOutputsExecuter.java:109)
- at org.gradle.api.internal.tasks.execution.FinalizePropertiesTaskExecuter.execute(FinalizePropertiesTaskExecuter.java:46)
- at org.gradle.api.internal.tasks.execution.ResolveTaskExecutionModeExecuter.execute(ResolveTaskExecutionModeExecuter.java:62)
- at org.gradle.api.internal.tasks.execution.SkipTaskWithNoActionsExecuter.execute(SkipTaskWithNoActionsExecuter.java:57)
- at org.gradle.api.internal.tasks.execution.SkipOnlyIfTaskExecuter.execute(SkipOnlyIfTaskExecuter.java:56)
- at org.gradle.api.internal.tasks.execution.CatchExceptionTaskExecuter.execute(CatchExceptionTaskExecuter.java:36)
- at org.gradle.api.internal.tasks.execution.EventFiringTaskExecuter$1.executeTask(EventFiringTaskExecuter.java:77)
- at org.gradle.api.internal.tasks.execution.EventFiringTaskExecuter$1.call(EventFiringTaskExecuter.java:55)
- at org.gradle.api.internal.tasks.execution.EventFiringTaskExecuter$1.call(EventFiringTaskExecuter.java:52)
- at org.gradle.internal.operations.DefaultBuildOperationRunner$CallableBuildOperationWorker.execute(DefaultBuildOperationRunner.java:200)
- at org.gradle.internal.operations.DefaultBuildOperationRunner$CallableBuildOperationWorker.execute(DefaultBuildOperationRunner.java:195)
- at org.gradle.internal.operations.DefaultBuildOperationRunner$3.execute(DefaultBuildOperationRunner.java:75)
- at org.gradle.internal.operations.DefaultBuildOperationRunner$3.execute(DefaultBuildOperationRunner.java:68)
- at org.gradle.internal.operations.DefaultBuildOperationRunner.execute(DefaultBuildOperationRunner.java:153)
- at org.gradle.internal.operations.DefaultBuildOperationRunner.execute(DefaultBuildOperationRunner.java:68)
- at org.gradle.internal.operations.DefaultBuildOperationRunner.call(DefaultBuildOperationRunner.java:62)
- at org.gradle.internal.operations.DefaultBuildOperationExecutor.lambda$call$2(DefaultBuildOperationExecutor.java:76)
- at org.gradle.internal.operations.UnmanagedBuildOperationWrapper.callWithUnmanagedSupport(UnmanagedBuildOperationWrapper.java:54)
- at org.gradle.internal.operations.DefaultBuildOperationExecutor.call(DefaultBuildOperationExecutor.java:76)
- at org.gradle.api.internal.tasks.execution.EventFiringTaskExecuter.execute(EventFiringTaskExecuter.java:52)
- at org.gradle.execution.plan.LocalTaskNodeExecutor.execute(LocalTaskNodeExecutor.java:41)
- at org.gradle.execution.taskgraph.DefaultTaskExecutionGraph$InvokeNodeExecutorsAction.execute(DefaultTaskExecutionGraph.java:372)
- at org.gradle.execution.taskgraph.DefaultTaskExecutionGraph$InvokeNodeExecutorsAction.execute(DefaultTaskExecutionGraph.java:359)
- at org.gradle.execution.taskgraph.DefaultTaskExecutionGraph$BuildOperationAwareExecutionAction.execute(DefaultTaskExecutionGraph.java:352)
- at org.gradle.execution.taskgraph.DefaultTaskExecutionGraph$BuildOperationAwareExecutionAction.execute(DefaultTaskExecutionGraph.java:338)
- at org.gradle.execution.plan.DefaultPlanExecutor$ExecutorWorker.lambda$run$0(DefaultPlanExecutor.java:127)
- at org.gradle.execution.plan.DefaultPlanExecutor$ExecutorWorker.execute(DefaultPlanExecutor.java:191)
- at org.gradle.execution.plan.DefaultPlanExecutor$ExecutorWorker.executeNextNode(DefaultPlanExecutor.java:182)
- at org.gradle.execution.plan.DefaultPlanExecutor$ExecutorWorker.run(DefaultPlanExecutor.java:124)
- at org.gradle.internal.concurrent.ExecutorPolicy$CatchAndRecordFailures.onExecute(ExecutorPolicy.java:64)
- at org.gradle.internal.concurrent.ManagedExecutorImpl$1.run(ManagedExecutorImpl.java:48)
- at java.base/java.util.concurrent.ThreadPoolExecutor.runWorker(ThreadPoolExecutor.java:1128)
- at java.base/java.util.concurrent.ThreadPoolExecutor$Worker.run(ThreadPoolExecutor.java:628)
- at org.gradle.internal.concurrent.ThreadFactoryImpl$ManagedThreadRunnable.run(ThreadFactoryImpl.java:56)
- at java.base/java.lang.Thread.run(Thread.java:829)
- FAILURE: Build failed with an exception.
- * What went wrong:
- Execution failed for task ':app:installRelease'.
- > java.util.concurrent.ExecutionException: com.android.builder.testing.api.DeviceException: com.android.ddmlib.InstallException: INSTALL_FAILED_INVALID_APK: Package couldn't be installed in /data/app/tech.berty.android-2: Package /data/app/tech.berty.android-2/base.apk code is missing
- * Try:
- Run with --stacktrace option to get the stack trace. Run with --info or --debug option to get more log output. Run with --scan to get full insights.
- * Get more help at https://help.gradle.org
- BUILD FAILED in 4m 8s
- at makeError (/home/luke/StudioProjects/berty/js/node_modules/execa/index.js:174:9)
- at /home/luke/StudioProjects/berty/js/node_modules/execa/index.js:278:16
- at processTicksAndRejections (node:internal/process/task_queues:96:5)
- at async runOnAllDevices (/home/luke/StudioProjects/berty/js/node_modules/@react-native-community/cli-platform-android/build/commands/runAndroid/runOnAllDevices.js:94:5)
- at async Command.handleAction (/home/luke/StudioProjects/berty/js/node_modules/@react-native-community/cli/build/index.js:186:9)
- info Run CLI with --verbose flag for more details.
- make: *** [Makefile:274: android.release] Error 1
Advertisement
Add Comment
Please, Sign In to add comment