SHARE
TWEET

Untitled

a guest May 22nd, 2017 535 Never
Not a member of Pastebin yet? Sign Up, it unlocks many cool features!
  1. This file contains any messages produced by compilers while
  2. running configure, to aid debugging if configure makes a mistake.
  3.  
  4. It was created by etui configure 0.0.4, which was
  5. generated by GNU Autoconf 2.69.  Invocation command line was
  6.  
  7.   $ ./configure --prefix=/usr --enable-gpl --with-mupdf-static-libs=-Wl,/usr/lib/libmupdf.a -Wl,/usr/lib/libmupdfthird.a --with-mupdf-shared-libs=-ljbig2dec
  8.  
  9. ## --------- ##
  10. ## Platform. ##
  11. ## --------- ##
  12.  
  13. hostname = testland
  14. uname -m = i686
  15. uname -r = 4.10.13-1-ARCH
  16. uname -s = Linux
  17. uname -v = #1 SMP PREEMPT Thu Apr 27 12:35:30 CEST 2017
  18.  
  19. /usr/bin/uname -p = unknown
  20. /bin/uname -X     = unknown
  21.  
  22. /bin/arch              = unknown
  23. /usr/bin/arch -k       = unknown
  24. /usr/convex/getsysinfo = unknown
  25. /usr/bin/hostinfo      = unknown
  26. /bin/machine           = unknown
  27. /usr/bin/oslevel       = unknown
  28. /bin/universe          = unknown
  29.  
  30. PATH: /home/toliz/Applications/.bin
  31. PATH: /usr/bin
  32. PATH: /usr/local/sbin
  33. PATH: /usr/local/bin
  34. PATH: /usr/bin
  35. PATH: /usr/bin/site_perl
  36. PATH: /usr/bin/vendor_perl
  37. PATH: /usr/bin/core_perl
  38.  
  39.  
  40. ## ----------- ##
  41. ## Core tests. ##
  42. ## ----------- ##
  43.  
  44. configure:2307: checking for a BSD-compatible install
  45. configure:2375: result: /usr/bin/install -c
  46. configure:2386: checking whether build environment is sane
  47. configure:2441: result: yes
  48. configure:2592: checking for a thread-safe mkdir -p
  49. configure:2631: result: /usr/bin/mkdir -p
  50. configure:2638: checking for gawk
  51. configure:2654: found /usr/bin/gawk
  52. configure:2665: result: gawk
  53. configure:2676: checking whether make sets $(MAKE)
  54. configure:2698: result: yes
  55. configure:2727: checking whether make supports nested variables
  56. configure:2744: result: yes
  57. configure:2881: checking whether make supports nested variables
  58. configure:2898: result: yes
  59. configure:2922: checking for style of include used by make
  60. configure:2950: result: GNU
  61. configure:3021: checking for gcc
  62. configure:3037: found /usr/bin/gcc
  63. configure:3048: result: gcc
  64. configure:3277: checking for C compiler version
  65. configure:3286: gcc --version >&5
  66. gcc (GCC) 6.3.1 20170306
  67. Copyright (C) 2016 Free Software Foundation, Inc.
  68. This is free software; see the source for copying conditions.  There is NO
  69. warranty; not even for MERCHANTABILITY or FITNESS FOR A PARTICULAR PURPOSE.
  70.  
  71. configure:3297: $? = 0
  72. configure:3286: gcc -v >&5
  73. Using built-in specs.
  74. COLLECT_GCC=gcc
  75. COLLECT_LTO_WRAPPER=/usr/lib/gcc/i686-pc-linux-gnu/6.3.1/lto-wrapper
  76. Target: i686-pc-linux-gnu
  77. Configured with: /build/gcc/src/gcc/configure --prefix=/usr --libdir=/usr/lib --libexecdir=/usr/lib --mandir=/usr/share/man --infodir=/usr/share/info --with-bugurl=https://bugs.archlinux.org/ --enable-languages=c,c++,ada,fortran,go,lto,objc,obj-c++ --enable-shared --enable-threads=posix --enable-libmpx --with-system-zlib --with-isl --enable-__cxa_atexit --disable-libunwind-exceptions --enable-clocale=gnu --disable-libstdcxx-pch --disable-libssp --enable-gnu-unique-object --enable-linker-build-id --enable-lto --enable-plugin --enable-install-libiberty --with-linker-hash-style=gnu --enable-gnu-indirect-function --disable-multilib --disable-werror --enable-checking=release
  78. Thread model: posix
  79. gcc version 6.3.1 20170306 (GCC)
  80. configure:3297: $? = 0
  81. configure:3286: gcc -V >&5
  82. gcc: error: unrecognized command line option '-V'
  83. gcc: fatal error: no input files
  84. compilation terminated.
  85. configure:3297: $? = 1
  86. configure:3286: gcc -qversion >&5
  87. gcc: error: unrecognized command line option '-qversion'; did you mean '--version'?
  88. gcc: fatal error: no input files
  89. compilation terminated.
  90. configure:3297: $? = 1
  91. configure:3317: checking whether the C compiler works
  92. configure:3339: gcc -march=i686 -mtune=generic -O0 -pipe -fstack-protector-strong -g3 -ggdb -fvar-tracking-assignments -fvisibility=hidden -I/usr/include/ghostscript -D_FORTIFY_SOURCE=2 -Wl,-O1,--sort-common,--as-needed,-z,relro conftest.c  >&5
  93. configure:3343: $? = 0
  94. configure:3391: result: yes
  95. configure:3394: checking for C compiler default output file name
  96. configure:3396: result: a.out
  97. configure:3402: checking for suffix of executables
  98. configure:3409: gcc -o conftest -march=i686 -mtune=generic -O0 -pipe -fstack-protector-strong -g3 -ggdb -fvar-tracking-assignments -fvisibility=hidden -I/usr/include/ghostscript -D_FORTIFY_SOURCE=2 -Wl,-O1,--sort-common,--as-needed,-z,relro conftest.c  >&5
  99. configure:3413: $? = 0
  100. configure:3435: result:
  101. configure:3457: checking whether we are cross compiling
  102. configure:3465: gcc -o conftest -march=i686 -mtune=generic -O0 -pipe -fstack-protector-strong -g3 -ggdb -fvar-tracking-assignments -fvisibility=hidden -I/usr/include/ghostscript -D_FORTIFY_SOURCE=2 -Wl,-O1,--sort-common,--as-needed,-z,relro conftest.c  >&5
  103. In file included from /usr/include/bits/libc-header-start.h:33:0,
  104.                  from /usr/include/stdio.h:28,
  105.                  from conftest.c:11:
  106. /usr/include/features.h:373:4: warning: #warning _FORTIFY_SOURCE requires compiling with optimization (-O) [-Wcpp]
  107.  #  warning _FORTIFY_SOURCE requires compiling with optimization (-O)
  108.     ^~~~~~~
  109. configure:3469: $? = 0
  110. configure:3476: ./conftest
  111. configure:3480: $? = 0
  112. configure:3495: result: no
  113. configure:3500: checking for suffix of object files
  114. configure:3522: gcc -c -march=i686 -mtune=generic -O0 -pipe -fstack-protector-strong -g3 -ggdb -fvar-tracking-assignments -fvisibility=hidden -I/usr/include/ghostscript -D_FORTIFY_SOURCE=2 conftest.c >&5
  115. configure:3526: $? = 0
  116. configure:3547: result: o
  117. configure:3551: checking whether we are using the GNU C compiler
  118. configure:3570: gcc -c -march=i686 -mtune=generic -O0 -pipe -fstack-protector-strong -g3 -ggdb -fvar-tracking-assignments -fvisibility=hidden -I/usr/include/ghostscript -D_FORTIFY_SOURCE=2 conftest.c >&5
  119. configure:3570: $? = 0
  120. configure:3579: result: yes
  121. configure:3588: checking whether gcc accepts -g
  122. configure:3608: gcc -c -g -D_FORTIFY_SOURCE=2 conftest.c >&5
  123. configure:3608: $? = 0
  124. configure:3649: result: yes
  125. configure:3666: checking for gcc option to accept ISO C89
  126. configure:3729: gcc  -c -march=i686 -mtune=generic -O0 -pipe -fstack-protector-strong -g3 -ggdb -fvar-tracking-assignments -fvisibility=hidden -I/usr/include/ghostscript -D_FORTIFY_SOURCE=2 conftest.c >&5
  127. In file included from /usr/include/bits/libc-header-start.h:33:0,
  128.                  from /usr/include/stdio.h:28,
  129.                  from conftest.c:12:
  130. /usr/include/features.h:373:4: warning: #warning _FORTIFY_SOURCE requires compiling with optimization (-O) [-Wcpp]
  131.  #  warning _FORTIFY_SOURCE requires compiling with optimization (-O)
  132.     ^~~~~~~
  133. configure:3729: $? = 0
  134. configure:3742: result: none needed
  135. configure:3767: checking whether gcc understands -c and -o together
  136. configure:3789: gcc -c conftest.c -o conftest2.o
  137. configure:3792: $? = 0
  138. configure:3789: gcc -c conftest.c -o conftest2.o
  139. configure:3792: $? = 0
  140. configure:3804: result: yes
  141. configure:3823: checking dependency style of gcc
  142. configure:3934: result: gcc3
  143. configure:3999: checking for ar
  144. configure:4015: found /usr/bin/ar
  145. configure:4026: result: ar
  146. configure:4052: checking the archiver (ar) interface
  147. configure:4068: gcc -c -march=i686 -mtune=generic -O0 -pipe -fstack-protector-strong -g3 -ggdb -fvar-tracking-assignments -fvisibility=hidden -I/usr/include/ghostscript -D_FORTIFY_SOURCE=2 conftest.c >&5
  148. configure:4068: $? = 0
  149. configure:4070: ar cru libconftest.a conftest.o >&5
  150. ar: `u' modifier ignored since `D' is the default (see `U')
  151. configure:4073: $? = 0
  152. configure:4101: result: ar
  153. configure:4150: checking build system type
  154. configure:4164: result: i686-pc-linux-gnu
  155. configure:4184: checking host system type
  156. configure:4197: result: i686-pc-linux-gnu
  157. configure:4238: checking how to print strings
  158. configure:4265: result: printf
  159. configure:4286: checking for a sed that does not truncate output
  160. configure:4350: result: /usr/bin/sed
  161. configure:4368: checking for grep that handles long lines and -e
  162. configure:4426: result: /usr/bin/grep
  163. configure:4431: checking for egrep
  164. configure:4493: result: /usr/bin/grep -E
  165. configure:4498: checking for fgrep
  166. configure:4560: result: /usr/bin/grep -F
  167. configure:4595: checking for ld used by gcc
  168. configure:4662: result: /usr/bin/ld
  169. configure:4669: checking if the linker (/usr/bin/ld) is GNU ld
  170. configure:4684: result: yes
  171. configure:4696: checking for BSD- or MS-compatible name lister (nm)
  172. configure:4750: result: /usr/bin/nm -B
  173. configure:4880: checking the name lister (/usr/bin/nm -B) interface
  174. configure:4887: gcc -c -march=i686 -mtune=generic -O0 -pipe -fstack-protector-strong -g3 -ggdb -fvar-tracking-assignments -fvisibility=hidden -I/usr/include/ghostscript -D_FORTIFY_SOURCE=2 conftest.c >&5
  175. configure:4890: /usr/bin/nm -B "conftest.o"
  176. configure:4893: output
  177. 00000000 B some_variable
  178. 00000000 n wm4.0.f05b246c3f73b27002570acda153b833
  179. 00000000 n wm4.stdcpredef.h.19.bf2bf6c5fb087dfb5ef2d2297c2795de
  180. configure:4900: result: BSD nm
  181. configure:4903: checking whether ln -s works
  182. configure:4907: result: yes
  183. configure:4915: checking the maximum length of command line arguments
  184. configure:5046: result: 1572864
  185. configure:5094: checking how to convert i686-pc-linux-gnu file names to i686-pc-linux-gnu format
  186. configure:5134: result: func_convert_file_noop
  187. configure:5141: checking how to convert i686-pc-linux-gnu file names to toolchain format
  188. configure:5161: result: func_convert_file_noop
  189. configure:5168: checking for /usr/bin/ld option to reload object files
  190. configure:5175: result: -r
  191. configure:5249: checking for objdump
  192. configure:5265: found /usr/bin/objdump
  193. configure:5276: result: objdump
  194. configure:5305: checking how to recognize dependent libraries
  195. configure:5505: result: pass_all
  196. configure:5590: checking for dlltool
  197. configure:5620: result: no
  198. configure:5647: checking how to associate runtime and link libraries
  199. configure:5674: result: printf %s\n
  200. configure:5798: checking for archiver @FILE support
  201. configure:5815: gcc -c -march=i686 -mtune=generic -O0 -pipe -fstack-protector-strong -g3 -ggdb -fvar-tracking-assignments -fvisibility=hidden -I/usr/include/ghostscript -D_FORTIFY_SOURCE=2 conftest.c >&5
  202. configure:5815: $? = 0
  203. configure:5818: ar cru libconftest.a @conftest.lst >&5
  204. ar: `u' modifier ignored since `D' is the default (see `U')
  205. configure:5821: $? = 0
  206. configure:5826: ar cru libconftest.a @conftest.lst >&5
  207. ar: `u' modifier ignored since `D' is the default (see `U')
  208. ar: conftest.o: No such file or directory
  209. configure:5829: $? = 1
  210. configure:5841: result: @
  211. configure:5899: checking for strip
  212. configure:5915: found /usr/bin/strip
  213. configure:5926: result: strip
  214. configure:5998: checking for ranlib
  215. configure:6014: found /usr/bin/ranlib
  216. configure:6025: result: ranlib
  217. configure:6127: checking command to parse /usr/bin/nm -B output from gcc object
  218. configure:6280: gcc -c -march=i686 -mtune=generic -O0 -pipe -fstack-protector-strong -g3 -ggdb -fvar-tracking-assignments -fvisibility=hidden -I/usr/include/ghostscript -D_FORTIFY_SOURCE=2 conftest.c >&5
  219. configure:6283: $? = 0
  220. configure:6287: /usr/bin/nm -B conftest.o \| sed -n -e 's/^.*[ ]\([ABCDGIRSTW][ABCDGIRSTW]*\)[ ][ ]*\([_A-Za-z][_A-Za-z0-9]*\)$/\1 \2 \2/p' | sed '/ __gnu_lto/d' \> conftest.nm
  221. configure:6290: $? = 0
  222. configure:6356: gcc -o conftest -march=i686 -mtune=generic -O0 -pipe -fstack-protector-strong -g3 -ggdb -fvar-tracking-assignments -fvisibility=hidden -I/usr/include/ghostscript -D_FORTIFY_SOURCE=2 -Wl,-O1,--sort-common,--as-needed,-z,relro conftest.c conftstm.o >&5
  223. configure:6359: $? = 0
  224. configure:6397: result: ok
  225. configure:6444: checking for sysroot
  226. configure:6474: result: no
  227. configure:6481: checking for a working dd
  228. configure:6519: result: /usr/bin/dd
  229. configure:6523: checking how to truncate binary pipes
  230. configure:6538: result: /usr/bin/dd bs=4096 count=1
  231. configure:6867: checking for mt
  232. configure:6897: result: no
  233. configure:6917: checking if : is a manifest tool
  234. configure:6923: : '-?'
  235. configure:6931: result: no
  236. configure:7608: checking how to run the C preprocessor
  237. configure:7639: gcc -E -D_FORTIFY_SOURCE=2 conftest.c
  238. In file included from /usr/include/bits/libc-header-start.h:33:0,
  239.                  from /usr/include/limits.h:26,
  240.                  from /usr/lib/gcc/i686-pc-linux-gnu/6.3.1/include-fixed/limits.h:168,
  241.                  from /usr/lib/gcc/i686-pc-linux-gnu/6.3.1/include-fixed/syslimits.h:7,
  242.                  from /usr/lib/gcc/i686-pc-linux-gnu/6.3.1/include-fixed/limits.h:34,
  243.                  from conftest.c:12:
  244. /usr/include/features.h:373:4: warning: #warning _FORTIFY_SOURCE requires compiling with optimization (-O) [-Wcpp]
  245.  #  warning _FORTIFY_SOURCE requires compiling with optimization (-O)
  246.     ^~~~~~~
  247. configure:7639: $? = 0
  248. configure:7653: gcc -E -D_FORTIFY_SOURCE=2 conftest.c
  249. conftest.c:11:28: fatal error: ac_nonexistent.h: No such file or directory
  250.  #include <ac_nonexistent.h>
  251.                             ^
  252. compilation terminated.
  253. configure:7653: $? = 1
  254. configure: failed program was:
  255. | /* confdefs.h */
  256. | #define PACKAGE_NAME "etui"
  257. | #define PACKAGE_TARNAME "etui"
  258. | #define PACKAGE_VERSION "0.0.4"
  259. | #define PACKAGE_STRING "etui 0.0.4"
  260. | #define PACKAGE_BUGREPORT "vincent.torri.remove@gmail.com"
  261. | #define PACKAGE_URL ""
  262. | #define PACKAGE "etui"
  263. | #define VERSION "0.0.4"
  264. | /* end confdefs.h.  */
  265. | #include <ac_nonexistent.h>
  266. configure:7678: result: gcc -E
  267. configure:7698: gcc -E -D_FORTIFY_SOURCE=2 conftest.c
  268. In file included from /usr/include/bits/libc-header-start.h:33:0,
  269.                  from /usr/include/limits.h:26,
  270.                  from /usr/lib/gcc/i686-pc-linux-gnu/6.3.1/include-fixed/limits.h:168,
  271.                  from /usr/lib/gcc/i686-pc-linux-gnu/6.3.1/include-fixed/syslimits.h:7,
  272.                  from /usr/lib/gcc/i686-pc-linux-gnu/6.3.1/include-fixed/limits.h:34,
  273.                  from conftest.c:12:
  274. /usr/include/features.h:373:4: warning: #warning _FORTIFY_SOURCE requires compiling with optimization (-O) [-Wcpp]
  275.  #  warning _FORTIFY_SOURCE requires compiling with optimization (-O)
  276.     ^~~~~~~
  277. configure:7698: $? = 0
  278. configure:7712: gcc -E -D_FORTIFY_SOURCE=2 conftest.c
  279. conftest.c:11:28: fatal error: ac_nonexistent.h: No such file or directory
  280.  #include <ac_nonexistent.h>
  281.                             ^
  282. compilation terminated.
  283. configure:7712: $? = 1
  284. configure: failed program was:
  285. | /* confdefs.h */
  286. | #define PACKAGE_NAME "etui"
  287. | #define PACKAGE_TARNAME "etui"
  288. | #define PACKAGE_VERSION "0.0.4"
  289. | #define PACKAGE_STRING "etui 0.0.4"
  290. | #define PACKAGE_BUGREPORT "vincent.torri.remove@gmail.com"
  291. | #define PACKAGE_URL ""
  292. | #define PACKAGE "etui"
  293. | #define VERSION "0.0.4"
  294. | /* end confdefs.h.  */
  295. | #include <ac_nonexistent.h>
  296. configure:7741: checking for ANSI C header files
  297. configure:7761: gcc -c -march=i686 -mtune=generic -O0 -pipe -fstack-protector-strong -g3 -ggdb -fvar-tracking-assignments -fvisibility=hidden -I/usr/include/ghostscript -D_FORTIFY_SOURCE=2 conftest.c >&5
  298. In file included from /usr/include/bits/libc-header-start.h:33:0,
  299.                  from /usr/include/stdlib.h:25,
  300.                  from conftest.c:11:
  301. /usr/include/features.h:373:4: warning: #warning _FORTIFY_SOURCE requires compiling with optimization (-O) [-Wcpp]
  302.  #  warning _FORTIFY_SOURCE requires compiling with optimization (-O)
  303.     ^~~~~~~
  304. configure:7761: $? = 0
  305. In file included from /usr/include/bits/libc-header-start.h:33:0,
  306.                  from /usr/include/string.h:26,
  307.                  from conftest.c:11:
  308. /usr/include/features.h:373:4: warning: #warning _FORTIFY_SOURCE requires compiling with optimization (-O) [-Wcpp]
  309.  #  warning _FORTIFY_SOURCE requires compiling with optimization (-O)
  310.     ^~~~~~~
  311. In file included from /usr/include/bits/libc-header-start.h:33:0,
  312.                  from /usr/include/stdlib.h:25,
  313.                  from conftest.c:11:
  314. /usr/include/features.h:373:4: warning: #warning _FORTIFY_SOURCE requires compiling with optimization (-O) [-Wcpp]
  315.  #  warning _FORTIFY_SOURCE requires compiling with optimization (-O)
  316.     ^~~~~~~
  317. configure:7834: gcc -o conftest -march=i686 -mtune=generic -O0 -pipe -fstack-protector-strong -g3 -ggdb -fvar-tracking-assignments -fvisibility=hidden -I/usr/include/ghostscript -D_FORTIFY_SOURCE=2 -Wl,-O1,--sort-common,--as-needed,-z,relro conftest.c  >&5
  318. In file included from /usr/include/ctype.h:25:0,
  319.                  from conftest.c:11:
  320. /usr/include/features.h:373:4: warning: #warning _FORTIFY_SOURCE requires compiling with optimization (-O) [-Wcpp]
  321.  #  warning _FORTIFY_SOURCE requires compiling with optimization (-O)
  322.     ^~~~~~~
  323. configure:7834: $? = 0
  324. configure:7834: ./conftest
  325. configure:7834: $? = 0
  326. configure:7845: result: yes
  327. configure:7858: checking for sys/types.h
  328. configure:7858: gcc -c -march=i686 -mtune=generic -O0 -pipe -fstack-protector-strong -g3 -ggdb -fvar-tracking-assignments -fvisibility=hidden -I/usr/include/ghostscript -D_FORTIFY_SOURCE=2 conftest.c >&5
  329. In file included from /usr/include/bits/libc-header-start.h:33:0,
  330.                  from /usr/include/stdio.h:28,
  331.                  from conftest.c:12:
  332. /usr/include/features.h:373:4: warning: #warning _FORTIFY_SOURCE requires compiling with optimization (-O) [-Wcpp]
  333.  #  warning _FORTIFY_SOURCE requires compiling with optimization (-O)
  334.     ^~~~~~~
  335. configure:7858: $? = 0
  336. configure:7858: result: yes
  337. configure:7858: checking for sys/stat.h
  338. configure:7858: gcc -c -march=i686 -mtune=generic -O0 -pipe -fstack-protector-strong -g3 -ggdb -fvar-tracking-assignments -fvisibility=hidden -I/usr/include/ghostscript -D_FORTIFY_SOURCE=2 conftest.c >&5
  339. In file included from /usr/include/bits/libc-header-start.h:33:0,
  340.                  from /usr/include/stdio.h:28,
  341.                  from conftest.c:13:
  342. /usr/include/features.h:373:4: warning: #warning _FORTIFY_SOURCE requires compiling with optimization (-O) [-Wcpp]
  343.  #  warning _FORTIFY_SOURCE requires compiling with optimization (-O)
  344.     ^~~~~~~
  345. configure:7858: $? = 0
  346. configure:7858: result: yes
  347. configure:7858: checking for stdlib.h
  348. configure:7858: gcc -c -march=i686 -mtune=generic -O0 -pipe -fstack-protector-strong -g3 -ggdb -fvar-tracking-assignments -fvisibility=hidden -I/usr/include/ghostscript -D_FORTIFY_SOURCE=2 conftest.c >&5
  349. In file included from /usr/include/bits/libc-header-start.h:33:0,
  350.                  from /usr/include/stdio.h:28,
  351.                  from conftest.c:14:
  352. /usr/include/features.h:373:4: warning: #warning _FORTIFY_SOURCE requires compiling with optimization (-O) [-Wcpp]
  353.  #  warning _FORTIFY_SOURCE requires compiling with optimization (-O)
  354.     ^~~~~~~
  355. configure:7858: $? = 0
  356. configure:7858: result: yes
  357. configure:7858: checking for string.h
  358. configure:7858: gcc -c -march=i686 -mtune=generic -O0 -pipe -fstack-protector-strong -g3 -ggdb -fvar-tracking-assignments -fvisibility=hidden -I/usr/include/ghostscript -D_FORTIFY_SOURCE=2 conftest.c >&5
  359. In file included from /usr/include/bits/libc-header-start.h:33:0,
  360.                  from /usr/include/stdio.h:28,
  361.                  from conftest.c:15:
  362. /usr/include/features.h:373:4: warning: #warning _FORTIFY_SOURCE requires compiling with optimization (-O) [-Wcpp]
  363.  #  warning _FORTIFY_SOURCE requires compiling with optimization (-O)
  364.     ^~~~~~~
  365. configure:7858: $? = 0
  366. configure:7858: result: yes
  367. configure:7858: checking for memory.h
  368. configure:7858: gcc -c -march=i686 -mtune=generic -O0 -pipe -fstack-protector-strong -g3 -ggdb -fvar-tracking-assignments -fvisibility=hidden -I/usr/include/ghostscript -D_FORTIFY_SOURCE=2 conftest.c >&5
  369. In file included from /usr/include/bits/libc-header-start.h:33:0,
  370.                  from /usr/include/stdio.h:28,
  371.                  from conftest.c:16:
  372. /usr/include/features.h:373:4: warning: #warning _FORTIFY_SOURCE requires compiling with optimization (-O) [-Wcpp]
  373.  #  warning _FORTIFY_SOURCE requires compiling with optimization (-O)
  374.     ^~~~~~~
  375. configure:7858: $? = 0
  376. configure:7858: result: yes
  377. configure:7858: checking for strings.h
  378. configure:7858: gcc -c -march=i686 -mtune=generic -O0 -pipe -fstack-protector-strong -g3 -ggdb -fvar-tracking-assignments -fvisibility=hidden -I/usr/include/ghostscript -D_FORTIFY_SOURCE=2 conftest.c >&5
  379. In file included from /usr/include/bits/libc-header-start.h:33:0,
  380.                  from /usr/include/stdio.h:28,
  381.                  from conftest.c:17:
  382. /usr/include/features.h:373:4: warning: #warning _FORTIFY_SOURCE requires compiling with optimization (-O) [-Wcpp]
  383.  #  warning _FORTIFY_SOURCE requires compiling with optimization (-O)
  384.     ^~~~~~~
  385. configure:7858: $? = 0
  386. configure:7858: result: yes
  387. configure:7858: checking for inttypes.h
  388. configure:7858: gcc -c -march=i686 -mtune=generic -O0 -pipe -fstack-protector-strong -g3 -ggdb -fvar-tracking-assignments -fvisibility=hidden -I/usr/include/ghostscript -D_FORTIFY_SOURCE=2 conftest.c >&5
  389. In file included from /usr/include/bits/libc-header-start.h:33:0,
  390.                  from /usr/include/stdio.h:28,
  391.                  from conftest.c:18:
  392. /usr/include/features.h:373:4: warning: #warning _FORTIFY_SOURCE requires compiling with optimization (-O) [-Wcpp]
  393.  #  warning _FORTIFY_SOURCE requires compiling with optimization (-O)
  394.     ^~~~~~~
  395. configure:7858: $? = 0
  396. configure:7858: result: yes
  397. configure:7858: checking for stdint.h
  398. configure:7858: gcc -c -march=i686 -mtune=generic -O0 -pipe -fstack-protector-strong -g3 -ggdb -fvar-tracking-assignments -fvisibility=hidden -I/usr/include/ghostscript -D_FORTIFY_SOURCE=2 conftest.c >&5
  399. In file included from /usr/include/bits/libc-header-start.h:33:0,
  400.                  from /usr/include/stdio.h:28,
  401.                  from conftest.c:19:
  402. /usr/include/features.h:373:4: warning: #warning _FORTIFY_SOURCE requires compiling with optimization (-O) [-Wcpp]
  403.  #  warning _FORTIFY_SOURCE requires compiling with optimization (-O)
  404.     ^~~~~~~
  405. configure:7858: $? = 0
  406. configure:7858: result: yes
  407. configure:7858: checking for unistd.h
  408. configure:7858: gcc -c -march=i686 -mtune=generic -O0 -pipe -fstack-protector-strong -g3 -ggdb -fvar-tracking-assignments -fvisibility=hidden -I/usr/include/ghostscript -D_FORTIFY_SOURCE=2 conftest.c >&5
  409. In file included from /usr/include/bits/libc-header-start.h:33:0,
  410.                  from /usr/include/stdio.h:28,
  411.                  from conftest.c:20:
  412. /usr/include/features.h:373:4: warning: #warning _FORTIFY_SOURCE requires compiling with optimization (-O) [-Wcpp]
  413.  #  warning _FORTIFY_SOURCE requires compiling with optimization (-O)
  414.     ^~~~~~~
  415. configure:7858: $? = 0
  416. configure:7858: result: yes
  417. configure:7872: checking for dlfcn.h
  418. configure:7872: gcc -c -march=i686 -mtune=generic -O0 -pipe -fstack-protector-strong -g3 -ggdb -fvar-tracking-assignments -fvisibility=hidden -I/usr/include/ghostscript -D_FORTIFY_SOURCE=2 conftest.c >&5
  419. In file included from /usr/include/bits/libc-header-start.h:33:0,
  420.                  from /usr/include/stdio.h:28,
  421.                  from conftest.c:21:
  422. /usr/include/features.h:373:4: warning: #warning _FORTIFY_SOURCE requires compiling with optimization (-O) [-Wcpp]
  423.  #  warning _FORTIFY_SOURCE requires compiling with optimization (-O)
  424.     ^~~~~~~
  425. configure:7872: $? = 0
  426. configure:7872: result: yes
  427. configure:8425: checking for objdir
  428. configure:8440: result: .libs
  429. configure:8704: checking if gcc supports -fno-rtti -fno-exceptions
  430. configure:8722: gcc -c -march=i686 -mtune=generic -O0 -pipe -fstack-protector-strong -g3 -ggdb -fvar-tracking-assignments -fvisibility=hidden -I/usr/include/ghostscript -D_FORTIFY_SOURCE=2 -fno-rtti -fno-exceptions conftest.c >&5
  431. cc1: warning: command line option '-fno-rtti' is valid for C++/ObjC++ but not for C
  432. configure:8726: $? = 0
  433. configure:8739: result: no
  434. configure:9097: checking for gcc option to produce PIC
  435. configure:9104: result: -fPIC -DPIC
  436. configure:9112: checking if gcc PIC flag -fPIC -DPIC works
  437. configure:9130: gcc -c -march=i686 -mtune=generic -O0 -pipe -fstack-protector-strong -g3 -ggdb -fvar-tracking-assignments -fvisibility=hidden -I/usr/include/ghostscript -D_FORTIFY_SOURCE=2 -fPIC -DPIC -DPIC conftest.c >&5
  438. configure:9134: $? = 0
  439. configure:9147: result: yes
  440. configure:9176: checking if gcc static flag -static works
  441. configure:9204: result: yes
  442. configure:9219: checking if gcc supports -c -o file.o
  443. configure:9240: gcc -c -march=i686 -mtune=generic -O0 -pipe -fstack-protector-strong -g3 -ggdb -fvar-tracking-assignments -fvisibility=hidden -I/usr/include/ghostscript -D_FORTIFY_SOURCE=2 -o out/conftest2.o conftest.c >&5
  444. configure:9244: $? = 0
  445. configure:9266: result: yes
  446. configure:9274: checking if gcc supports -c -o file.o
  447. configure:9321: result: yes
  448. configure:9354: checking whether the gcc linker (/usr/bin/ld) supports shared libraries
  449. configure:10613: result: yes
  450. configure:10650: checking whether -lc should be explicitly linked in
  451. configure:10658: gcc -c -march=i686 -mtune=generic -O0 -pipe -fstack-protector-strong -g3 -ggdb -fvar-tracking-assignments -fvisibility=hidden -I/usr/include/ghostscript -D_FORTIFY_SOURCE=2 conftest.c >&5
  452. configure:10661: $? = 0
  453. configure:10676: gcc -shared  -fPIC -DPIC conftest.o  -v -Wl,-soname -Wl,conftest -o conftest 2\>\&1 \| /usr/bin/grep  -lc  \>/dev/null 2\>\&1
  454. configure:10679: $? = 0
  455. configure:10693: result: no
  456. configure:10853: checking dynamic linker characteristics
  457. configure:11434: gcc -o conftest -march=i686 -mtune=generic -O0 -pipe -fstack-protector-strong -g3 -ggdb -fvar-tracking-assignments -fvisibility=hidden -I/usr/include/ghostscript -D_FORTIFY_SOURCE=2 -Wl,-O1,--sort-common,--as-needed,-z,relro -Wl,-rpath -Wl,/foo conftest.c  >&5
  458. configure:11434: $? = 0
  459. configure:11671: result: GNU/Linux ld.so
  460. configure:11793: checking how to hardcode library paths into programs
  461. configure:11818: result: immediate
  462. configure:12366: checking whether stripping libraries is possible
  463. configure:12371: result: yes
  464. configure:12406: checking if libtool supports shared libraries
  465. configure:12408: result: yes
  466. configure:12411: checking whether to build shared libraries
  467. configure:12436: result: yes
  468. configure:12439: checking whether to build static libraries
  469. configure:12443: result: no
  470. configure:12637: checking for gcc
  471. configure:12664: result: gcc
  472. configure:12893: checking for C compiler version
  473. configure:12902: gcc --version >&5
  474. gcc (GCC) 6.3.1 20170306
  475. Copyright (C) 2016 Free Software Foundation, Inc.
  476. This is free software; see the source for copying conditions.  There is NO
  477. warranty; not even for MERCHANTABILITY or FITNESS FOR A PARTICULAR PURPOSE.
  478.  
  479. configure:12913: $? = 0
  480. configure:12902: gcc -v >&5
  481. Using built-in specs.
  482. COLLECT_GCC=gcc
  483. COLLECT_LTO_WRAPPER=/usr/lib/gcc/i686-pc-linux-gnu/6.3.1/lto-wrapper
  484. Target: i686-pc-linux-gnu
  485. Configured with: /build/gcc/src/gcc/configure --prefix=/usr --libdir=/usr/lib --libexecdir=/usr/lib --mandir=/usr/share/man --infodir=/usr/share/info --with-bugurl=https://bugs.archlinux.org/ --enable-languages=c,c++,ada,fortran,go,lto,objc,obj-c++ --enable-shared --enable-threads=posix --enable-libmpx --with-system-zlib --with-isl --enable-__cxa_atexit --disable-libunwind-exceptions --enable-clocale=gnu --disable-libstdcxx-pch --disable-libssp --enable-gnu-unique-object --enable-linker-build-id --enable-lto --enable-plugin --enable-install-libiberty --with-linker-hash-style=gnu --enable-gnu-indirect-function --disable-multilib --disable-werror --enable-checking=release
  486. Thread model: posix
  487. gcc version 6.3.1 20170306 (GCC)
  488. configure:12913: $? = 0
  489. configure:12902: gcc -V >&5
  490. gcc: error: unrecognized command line option '-V'
  491. gcc: fatal error: no input files
  492. compilation terminated.
  493. configure:12913: $? = 1
  494. configure:12902: gcc -qversion >&5
  495. gcc: error: unrecognized command line option '-qversion'; did you mean '--version'?
  496. gcc: fatal error: no input files
  497. compilation terminated.
  498. configure:12913: $? = 1
  499. configure:12917: checking whether we are using the GNU C compiler
  500. configure:12945: result: yes
  501. configure:12954: checking whether gcc accepts -g
  502. configure:13015: result: yes
  503. configure:13032: checking for gcc option to accept ISO C89
  504. configure:13108: result: none needed
  505. configure:13133: checking whether gcc understands -c and -o together
  506. configure:13170: result: yes
  507. configure:13189: checking dependency style of gcc
  508. configure:13300: result: gcc3
  509. configure:13370: checking for pkg-config
  510. configure:13388: found /usr/bin/pkg-config
  511. configure:13400: result: /usr/bin/pkg-config
  512. configure:13425: checking pkg-config is at least version 0.9.0
  513. configure:13428: result: yes
  514. configure:13451: edje_cc set to /usr/bin/edje_cc
  515. configure:13502: $PKG_CONFIG --exists --print-errors "libarchive >= 3"
  516. configure:13505: $? = 0
  517. configure:13524: checking for libarchive >= 3
  518. configure:13531: $PKG_CONFIG --exists --print-errors "${requirements_pc}"
  519. configure:13534: $? = 0
  520. configure:13548: $PKG_CONFIG --exists --print-errors "${requirements_pc}"
  521. configure:13551: $? = 0
  522. configure:13609: result: yes
  523. configure:13628: checking whether to enable CB module built
  524. configure:13630: result: yes
  525. configure:13714: $PKG_CONFIG --exists --print-errors "ddjvuapi"
  526. configure:13717: $? = 0
  527. configure:13737: checking for ddjvuapi
  528. configure:13744: $PKG_CONFIG --exists --print-errors "${requirements_pc}"
  529. configure:13747: $? = 0
  530. configure:13761: $PKG_CONFIG --exists --print-errors "${requirements_pc}"
  531. configure:13764: $? = 0
  532. configure:13822: result: yes
  533. configure:13841: checking whether to enable DJVU module built
  534. configure:13843: result: yes
  535. configure:13930: $PKG_CONFIG --exists --print-errors "libarchive >= 3 ewebkit2 >= ${efl_version} ecore-file >= ${efl_version}"
  536. Package ewebkit2 was not found in the pkg-config search path.
  537. Perhaps you should add the directory containing `ewebkit2.pc'
  538. to the PKG_CONFIG_PATH environment variable
  539. No package 'ewebkit2' found
  540. configure:13933: $? = 1
  541. configure:14050: checking whether to enable EPUB module built
  542. configure:14052: result: no
  543. configure:14147: $PKG_CONFIG --exists --print-errors "libturbojpeg"
  544. configure:14150: $? = 0
  545. configure:14212: $PKG_CONFIG --exists --print-errors "libopenjp2 freetype2 zlib"
  546. configure:14215: $? = 0
  547. configure:14229: checking for libopenjp2 freetype2 zlib libturbojpeg
  548. configure:14236: $PKG_CONFIG --exists --print-errors "${requirements_pc}"
  549. configure:14239: $? = 0
  550. configure:14253: $PKG_CONFIG --exists --print-errors "${requirements_pc}"
  551. configure:14256: $? = 0
  552. configure:14314: result: yes
  553. configure:14344: gcc -o conftest -I/usr/include -march=i686 -mtune=generic -O0 -pipe -fstack-protector-strong -g3 -ggdb -fvar-tracking-assignments -fvisibility=hidden -I/usr/include/ghostscript -D_FORTIFY_SOURCE=2 -Wl,-O1,--sort-common,--as-needed,-z,relro conftest.c -Wl,/usr/lib/libmupdf.a -Wl,/usr/lib/libmupdfthird.a -ljbig2dec -lopenjp2 -lfreetype -lz -lturbojpeg   -lm >&5
  554. In file included from /usr/include/bits/libc-header-start.h:33:0,
  555.                  from /usr/include/stdio.h:28,
  556.                  from /usr/include/mupdf/fitz/system.h:28,
  557.                  from /usr/include/mupdf/fitz.h:10,
  558.                  from conftest.c:28:
  559. /usr/include/features.h:373:4: warning: #warning _FORTIFY_SOURCE requires compiling with optimization (-O) [-Wcpp]
  560.  #  warning _FORTIFY_SOURCE requires compiling with optimization (-O)
  561.     ^~~~~~~
  562. configure:14344: $? = 0
  563. configure:14369: checking whether to enable PDF module built
  564. configure:14371: result: yes
  565. configure:14458: $PKG_CONFIG --exists --print-errors "xpost"
  566. Package xpost was not found in the pkg-config search path.
  567. Perhaps you should add the directory containing `xpost.pc'
  568. to the PKG_CONFIG_PATH environment variable
  569. No package 'xpost' found
  570. configure:14461: $? = 1
  571. configure:14578: checking whether to enable PS module built
  572. configure:14580: result: no
  573. configure:14667: $PKG_CONFIG --exists --print-errors "libtiff-4"
  574. configure:14670: $? = 0
  575. configure:14683: checking for libtiff-4
  576. configure:14690: $PKG_CONFIG --exists --print-errors "${requirements_pc}"
  577. configure:14693: $? = 0
  578. configure:14707: $PKG_CONFIG --exists --print-errors "${requirements_pc}"
  579. configure:14710: $? = 0
  580. configure:14768: result: yes
  581. configure:14787: checking whether to enable TIFF module built
  582. configure:14789: result: yes
  583. configure:14843: checking for eio >= 1.18.0 ecore >= 1.18.0 evas >= 1.18.0 eina >= 1.18.0
  584. configure:14850: $PKG_CONFIG --exists --print-errors "${requirements_etui_pc}"
  585. configure:14853: $? = 0
  586. configure:14867: $PKG_CONFIG --exists --print-errors "${requirements_etui_pc}"
  587. configure:14870: $? = 0
  588. configure:14928: result: yes
  589. configure:14934: checking for elementary >= 1.18.0 ecore-input >= 1.18.0 ecore-evas >= 1.18.0 ecore >= 1.18.0 evas >= 1.18.0 eina >= 1.18.0
  590. configure:14941: $PKG_CONFIG --exists --print-errors "${requirements_etui_bin_pc}"
  591. configure:14944: $? = 0
  592. configure:14958: $PKG_CONFIG --exists --print-errors "${requirements_etui_bin_pc}"
  593. configure:14961: $? = 0
  594. configure:15019: result: yes
  595. configure:15036: checking whether byte ordering is bigendian
  596. configure:15051: gcc -c -march=i686 -mtune=generic -O0 -pipe -fstack-protector-strong -g3 -ggdb -fvar-tracking-assignments -fvisibility=hidden -I/usr/include/ghostscript -D_FORTIFY_SOURCE=2 conftest.c >&5
  597. conftest.c:30:9: error: unknown type name 'not'
  598.          not a universal capable compiler
  599.          ^~~
  600. conftest.c:30:15: error: expected '=', ',', ';', 'asm' or '__attribute__' before 'universal'
  601.          not a universal capable compiler
  602.                ^~~~~~~~~
  603. conftest.c:30:15: error: unknown type name 'universal'
  604. configure:15051: $? = 1
  605. configure: failed program was:
  606. | /* confdefs.h */
  607. | #define PACKAGE_NAME "etui"
  608. | #define PACKAGE_TARNAME "etui"
  609. | #define PACKAGE_VERSION "0.0.4"
  610. | #define PACKAGE_STRING "etui 0.0.4"
  611. | #define PACKAGE_BUGREPORT "vincent.torri.remove@gmail.com"
  612. | #define PACKAGE_URL ""
  613. | #define PACKAGE "etui"
  614. | #define VERSION "0.0.4"
  615. | #define STDC_HEADERS 1
  616. | #define HAVE_SYS_TYPES_H 1
  617. | #define HAVE_SYS_STAT_H 1
  618. | #define HAVE_STDLIB_H 1
  619. | #define HAVE_STRING_H 1
  620. | #define HAVE_MEMORY_H 1
  621. | #define HAVE_STRINGS_H 1
  622. | #define HAVE_INTTYPES_H 1
  623. | #define HAVE_STDINT_H 1
  624. | #define HAVE_UNISTD_H 1
  625. | #define HAVE_DLFCN_H 1
  626. | #define LT_OBJDIR ".libs/"
  627. | #define MODULE_ARCH "linux-gnu-i686-0.0.4"
  628. | #define HAVE_LIBARCHIVE 1
  629. | #define ETUI_BUILD_CB 1
  630. | #define ETUI_BUILD_DJVU 1
  631. | #define ETUI_BUILD_PDF 1
  632. | #define ETUI_BUILD_TIFF 1
  633. | /* end confdefs.h.  */
  634. | #ifndef __APPLE_CC__
  635. |          not a universal capable compiler
  636. |        #endif
  637. |        typedef int dummy;
  638. |
  639. configure:15096: gcc -c -march=i686 -mtune=generic -O0 -pipe -fstack-protector-strong -g3 -ggdb -fvar-tracking-assignments -fvisibility=hidden -I/usr/include/ghostscript -D_FORTIFY_SOURCE=2 conftest.c >&5
  640. In file included from /usr/include/sys/types.h:25:0,
  641.                  from conftest.c:29:
  642. /usr/include/features.h:373:4: warning: #warning _FORTIFY_SOURCE requires compiling with optimization (-O) [-Wcpp]
  643.  #  warning _FORTIFY_SOURCE requires compiling with optimization (-O)
  644.     ^~~~~~~
  645. configure:15096: $? = 0
  646. configure:15114: gcc -c -march=i686 -mtune=generic -O0 -pipe -fstack-protector-strong -g3 -ggdb -fvar-tracking-assignments -fvisibility=hidden -I/usr/include/ghostscript -D_FORTIFY_SOURCE=2 conftest.c >&5
  647. In file included from /usr/include/sys/types.h:25:0,
  648.                  from conftest.c:29:
  649. /usr/include/features.h:373:4: warning: #warning _FORTIFY_SOURCE requires compiling with optimization (-O) [-Wcpp]
  650.  #  warning _FORTIFY_SOURCE requires compiling with optimization (-O)
  651.     ^~~~~~~
  652. conftest.c: In function 'main':
  653. conftest.c:36:4: error: unknown type name 'not'
  654.     not big endian
  655.     ^~~
  656. conftest.c:36:12: error: expected '=', ',', ';', 'asm' or '__attribute__' before 'endian'
  657.     not big endian
  658.             ^~~~~~
  659. configure:15114: $? = 1
  660. configure: failed program was:
  661. | /* confdefs.h */
  662. | #define PACKAGE_NAME "etui"
  663. | #define PACKAGE_TARNAME "etui"
  664. | #define PACKAGE_VERSION "0.0.4"
  665. | #define PACKAGE_STRING "etui 0.0.4"
  666. | #define PACKAGE_BUGREPORT "vincent.torri.remove@gmail.com"
  667. | #define PACKAGE_URL ""
  668. | #define PACKAGE "etui"
  669. | #define VERSION "0.0.4"
  670. | #define STDC_HEADERS 1
  671. | #define HAVE_SYS_TYPES_H 1
  672. | #define HAVE_SYS_STAT_H 1
  673. | #define HAVE_STDLIB_H 1
  674. | #define HAVE_STRING_H 1
  675. | #define HAVE_MEMORY_H 1
  676. | #define HAVE_STRINGS_H 1
  677. | #define HAVE_INTTYPES_H 1
  678. | #define HAVE_STDINT_H 1
  679. | #define HAVE_UNISTD_H 1
  680. | #define HAVE_DLFCN_H 1
  681. | #define LT_OBJDIR ".libs/"
  682. | #define MODULE_ARCH "linux-gnu-i686-0.0.4"
  683. | #define HAVE_LIBARCHIVE 1
  684. | #define ETUI_BUILD_CB 1
  685. | #define ETUI_BUILD_DJVU 1
  686. | #define ETUI_BUILD_PDF 1
  687. | #define ETUI_BUILD_TIFF 1
  688. | /* end confdefs.h.  */
  689. | #include <sys/types.h>
  690. |       #include <sys/param.h>
  691. |
  692. | int
  693. | main ()
  694. | {
  695. | #if BYTE_ORDER != BIG_ENDIAN
  696. |        not big endian
  697. |       #endif
  698. |
  699. |   ;
  700. |   return 0;
  701. | }
  702. configure:15242: result: no
  703. configure:15273: checking whether the C compiler supports -Wall -Wextra -Wshadow -Wdeclaration-after-statement -Wmissing-prototypes -Wstrict-prototypes -Wpointer-arith -Wno-missing-field-initializers -fvisibility=hidden -fdata-sections -ffunction-sections
  704. configure:15286: gcc -c -march=i686 -mtune=generic -O0 -pipe -fstack-protector-strong -g3 -ggdb -fvar-tracking-assignments -fvisibility=hidden -I/usr/include/ghostscript -Wall -Wextra -Wshadow -Wdeclaration-after-statement -Wmissing-prototypes -Wstrict-prototypes -Wpointer-arith -Wmissing-field-initializers -fvisibility=hidden -fdata-sections -ffunction-sections -D_FORTIFY_SOURCE=2 conftest.c >&5
  705. conftest.c:31:1: warning: function declaration isn't a prototype [-Wstrict-prototypes]
  706.  main ()
  707.  ^~~~
  708. configure:15286: $? = 0
  709. configure:15292: result: yes
  710. configure:15795: checking whether the C compiler supports -Wall -Wextra -Wshadow -Wdeclaration-after-statement -Wmissing-prototypes -Wstrict-prototypes -Wpointer-arith -Wno-missing-field-initializers -fvisibility=hidden -fdata-sections -ffunction-sections
  711. configure:15808: gcc -c -march=i686 -mtune=generic -O0 -pipe -fstack-protector-strong -g3 -ggdb -fvar-tracking-assignments -fvisibility=hidden -I/usr/include/ghostscript -Wall -Wextra -Wshadow -Wdeclaration-after-statement -Wmissing-prototypes -Wstrict-prototypes -Wpointer-arith -Wmissing-field-initializers -fvisibility=hidden -fdata-sections -ffunction-sections -D_FORTIFY_SOURCE=2 conftest.c >&5
  712. conftest.c:31:1: warning: function declaration isn't a prototype [-Wstrict-prototypes]
  713.  main ()
  714.  ^~~~
  715. configure:15808: $? = 0
  716. configure:15814: result: yes
  717. configure:16322: checking for special C compiler options needed for large files
  718. configure:16367: result: no
  719. configure:16373: checking for _FILE_OFFSET_BITS value needed for large files
  720. configure:16398: gcc -c -march=i686 -mtune=generic -O0 -pipe -fstack-protector-strong -g3 -ggdb -fvar-tracking-assignments -fvisibility=hidden -I/usr/include/ghostscript -D_FORTIFY_SOURCE=2 conftest.c >&5
  721. In file included from /usr/include/sys/types.h:25:0,
  722.                  from conftest.c:29:
  723. /usr/include/features.h:373:4: warning: #warning _FORTIFY_SOURCE requires compiling with optimization (-O) [-Wcpp]
  724.  #  warning _FORTIFY_SOURCE requires compiling with optimization (-O)
  725.     ^~~~~~~
  726. conftest.c:34:33: warning: left shift count >= width of type [-Wshift-count-overflow]
  727.  #define LARGE_OFF_T (((off_t) 1 << 62) - 1 + ((off_t) 1 << 62))
  728.                                  ^
  729. conftest.c:35:23: note: in expansion of macro 'LARGE_OFF_T'
  730.    int off_t_is_large[(LARGE_OFF_T % 2147483629 == 721
  731.                        ^~~~~~~~~~~
  732. conftest.c:34:57: warning: left shift count >= width of type [-Wshift-count-overflow]
  733.  #define LARGE_OFF_T (((off_t) 1 << 62) - 1 + ((off_t) 1 << 62))
  734.                                                          ^
  735. conftest.c:35:23: note: in expansion of macro 'LARGE_OFF_T'
  736.    int off_t_is_large[(LARGE_OFF_T % 2147483629 == 721
  737.                        ^~~~~~~~~~~
  738. conftest.c:34:33: warning: left shift count >= width of type [-Wshift-count-overflow]
  739.  #define LARGE_OFF_T (((off_t) 1 << 62) - 1 + ((off_t) 1 << 62))
  740.                                  ^
  741. conftest.c:36:13: note: in expansion of macro 'LARGE_OFF_T'
  742.           && LARGE_OFF_T % 2147483647 == 1)
  743.              ^~~~~~~~~~~
  744. conftest.c:34:57: warning: left shift count >= width of type [-Wshift-count-overflow]
  745.  #define LARGE_OFF_T (((off_t) 1 << 62) - 1 + ((off_t) 1 << 62))
  746.                                                          ^
  747. conftest.c:36:13: note: in expansion of macro 'LARGE_OFF_T'
  748.           && LARGE_OFF_T % 2147483647 == 1)
  749.              ^~~~~~~~~~~
  750. conftest.c:35:7: error: variably modified 'off_t_is_large' at file scope
  751.    int off_t_is_large[(LARGE_OFF_T % 2147483629 == 721
  752.        ^~~~~~~~~~~~~~
  753. configure:16398: $? = 1
  754. configure: failed program was:
  755. | /* confdefs.h */
  756. | #define PACKAGE_NAME "etui"
  757. | #define PACKAGE_TARNAME "etui"
  758. | #define PACKAGE_VERSION "0.0.4"
  759. | #define PACKAGE_STRING "etui 0.0.4"
  760. | #define PACKAGE_BUGREPORT "vincent.torri.remove@gmail.com"
  761. | #define PACKAGE_URL ""
  762. | #define PACKAGE "etui"
  763. | #define VERSION "0.0.4"
  764. | #define STDC_HEADERS 1
  765. | #define HAVE_SYS_TYPES_H 1
  766. | #define HAVE_SYS_STAT_H 1
  767. | #define HAVE_STDLIB_H 1
  768. | #define HAVE_STRING_H 1
  769. | #define HAVE_MEMORY_H 1
  770. | #define HAVE_STRINGS_H 1
  771. | #define HAVE_INTTYPES_H 1
  772. | #define HAVE_STDINT_H 1
  773. | #define HAVE_UNISTD_H 1
  774. | #define HAVE_DLFCN_H 1
  775. | #define LT_OBJDIR ".libs/"
  776. | #define MODULE_ARCH "linux-gnu-i686-0.0.4"
  777. | #define HAVE_LIBARCHIVE 1
  778. | #define ETUI_BUILD_CB 1
  779. | #define ETUI_BUILD_DJVU 1
  780. | #define ETUI_BUILD_PDF 1
  781. | #define ETUI_BUILD_TIFF 1
  782. | /* end confdefs.h.  */
  783. | #include <sys/types.h>
  784. |  /* Check that off_t can represent 2**63 - 1 correctly.
  785. |     We can't simply define LARGE_OFF_T to be 9223372036854775807,
  786. |     since some C++ compilers masquerading as C compilers
  787. |     incorrectly reject 9223372036854775807.  */
  788. | #define LARGE_OFF_T (((off_t) 1 << 62) - 1 + ((off_t) 1 << 62))
  789. |   int off_t_is_large[(LARGE_OFF_T % 2147483629 == 721
  790. |              && LARGE_OFF_T % 2147483647 == 1)
  791. |             ? 1 : -1];
  792. | int
  793. | main ()
  794. | {
  795. |
  796. |   ;
  797. |   return 0;
  798. | }
  799. configure:16422: gcc -c -march=i686 -mtune=generic -O0 -pipe -fstack-protector-strong -g3 -ggdb -fvar-tracking-assignments -fvisibility=hidden -I/usr/include/ghostscript -D_FORTIFY_SOURCE=2 conftest.c >&5
  800. In file included from /usr/include/sys/types.h:25:0,
  801.                  from conftest.c:30:
  802. /usr/include/features.h:373:4: warning: #warning _FORTIFY_SOURCE requires compiling with optimization (-O) [-Wcpp]
  803.  #  warning _FORTIFY_SOURCE requires compiling with optimization (-O)
  804.     ^~~~~~~
  805. configure:16422: $? = 0
  806. configure:16430: result: 64
  807. configure:16628: checking that generated files are newer than configure
  808. configure:16634: result: done
  809. configure:16714: creating ./config.status
  810.  
  811. ## ---------------------- ##
  812. ## Running config.status. ##
  813. ## ---------------------- ##
  814.  
  815. This file was extended by etui config.status 0.0.4, which was
  816. generated by GNU Autoconf 2.69.  Invocation command line was
  817.  
  818.   CONFIG_FILES    =
  819.   CONFIG_HEADERS  =
  820.   CONFIG_LINKS    =
  821.   CONFIG_COMMANDS =
  822.   $ ./config.status
  823.  
  824. on testland
  825.  
  826. config.status:1173: creating Makefile
  827. config.status:1173: creating pkgbuild/PKGBUILD
  828. config.status:1173: creating config.h
  829. config.status:1354: config.h is unchanged
  830. config.status:1402: executing depfiles commands
  831. config.status:1402: executing libtool commands
  832.  
  833. ## ---------------- ##
  834. ## Cache variables. ##
  835. ## ---------------- ##
  836.  
  837. ac_cv_build=i686-pc-linux-gnu
  838. ac_cv_c_bigendian=no
  839. ac_cv_c_compiler_gnu=yes
  840. ac_cv_env_CB_CFLAGS_set=
  841. ac_cv_env_CB_CFLAGS_value=
  842. ac_cv_env_CB_LIBS_set=
  843. ac_cv_env_CB_LIBS_value=
  844. ac_cv_env_CC_set=
  845. ac_cv_env_CC_value=
  846. ac_cv_env_CFLAGS_set=set
  847. ac_cv_env_CFLAGS_value='-march=i686 -mtune=generic -O0 -pipe -fstack-protector-strong -g3 -ggdb -fvar-tracking-assignments -fvisibility=hidden -I/usr/include/ghostscript'
  848. ac_cv_env_CPPFLAGS_set=set
  849. ac_cv_env_CPPFLAGS_value=-D_FORTIFY_SOURCE=2
  850. ac_cv_env_CPP_set=
  851. ac_cv_env_CPP_value=
  852. ac_cv_env_DJVU_CFLAGS_set=
  853. ac_cv_env_DJVU_CFLAGS_value=
  854. ac_cv_env_DJVU_LIBS_set=
  855. ac_cv_env_DJVU_LIBS_value=
  856. ac_cv_env_EPUB_CFLAGS_set=
  857. ac_cv_env_EPUB_CFLAGS_value=
  858. ac_cv_env_EPUB_LIBS_set=
  859. ac_cv_env_EPUB_LIBS_value=
  860. ac_cv_env_ETUI_BIN_CFLAGS_set=
  861. ac_cv_env_ETUI_BIN_CFLAGS_value=
  862. ac_cv_env_ETUI_BIN_LIBS_set=
  863. ac_cv_env_ETUI_BIN_LIBS_value=
  864. ac_cv_env_ETUI_CFLAGS_set=
  865. ac_cv_env_ETUI_CFLAGS_value=
  866. ac_cv_env_ETUI_LIBS_set=
  867. ac_cv_env_ETUI_LIBS_value=
  868. ac_cv_env_LDFLAGS_set=set
  869. ac_cv_env_LDFLAGS_value=-Wl,-O1,--sort-common,--as-needed,-z,relro
  870. ac_cv_env_LIBS_set=
  871. ac_cv_env_LIBS_value=
  872. ac_cv_env_LT_SYS_LIBRARY_PATH_set=
  873. ac_cv_env_LT_SYS_LIBRARY_PATH_value=
  874. ac_cv_env_MUPDF_DEPS_CFLAGS_set=
  875. ac_cv_env_MUPDF_DEPS_CFLAGS_value=
  876. ac_cv_env_MUPDF_DEPS_LIBS_set=
  877. ac_cv_env_MUPDF_DEPS_LIBS_value=
  878. ac_cv_env_PKG_CONFIG_LIBDIR_set=
  879. ac_cv_env_PKG_CONFIG_LIBDIR_value=
  880. ac_cv_env_PKG_CONFIG_PATH_set=
  881. ac_cv_env_PKG_CONFIG_PATH_value=
  882. ac_cv_env_PKG_CONFIG_set=
  883. ac_cv_env_PKG_CONFIG_value=
  884. ac_cv_env_TIFF_CFLAGS_set=
  885. ac_cv_env_TIFF_CFLAGS_value=
  886. ac_cv_env_TIFF_LIBS_set=
  887. ac_cv_env_TIFF_LIBS_value=
  888. ac_cv_env_XPOST_CFLAGS_set=
  889. ac_cv_env_XPOST_CFLAGS_value=
  890. ac_cv_env_XPOST_LIBS_set=
  891. ac_cv_env_XPOST_LIBS_value=
  892. ac_cv_env_build_alias_set=
  893. ac_cv_env_build_alias_value=
  894. ac_cv_env_host_alias_set=
  895. ac_cv_env_host_alias_value=
  896. ac_cv_env_target_alias_set=
  897. ac_cv_env_target_alias_value=
  898. ac_cv_header_dlfcn_h=yes
  899. ac_cv_header_inttypes_h=yes
  900. ac_cv_header_memory_h=yes
  901. ac_cv_header_stdc=yes
  902. ac_cv_header_stdint_h=yes
  903. ac_cv_header_stdlib_h=yes
  904. ac_cv_header_string_h=yes
  905. ac_cv_header_strings_h=yes
  906. ac_cv_header_sys_stat_h=yes
  907. ac_cv_header_sys_types_h=yes
  908. ac_cv_header_unistd_h=yes
  909. ac_cv_host=i686-pc-linux-gnu
  910. ac_cv_objext=o
  911. ac_cv_path_EGREP='/usr/bin/grep -E'
  912. ac_cv_path_FGREP='/usr/bin/grep -F'
  913. ac_cv_path_GREP=/usr/bin/grep
  914. ac_cv_path_SED=/usr/bin/sed
  915. ac_cv_path_ac_pt_PKG_CONFIG=/usr/bin/pkg-config
  916. ac_cv_path_install='/usr/bin/install -c'
  917. ac_cv_path_lt_DD=/usr/bin/dd
  918. ac_cv_path_mkdir=/usr/bin/mkdir
  919. ac_cv_prog_AWK=gawk
  920. ac_cv_prog_CPP='gcc -E'
  921. ac_cv_prog_ac_ct_AR=ar
  922. ac_cv_prog_ac_ct_CC=gcc
  923. ac_cv_prog_ac_ct_OBJDUMP=objdump
  924. ac_cv_prog_ac_ct_RANLIB=ranlib
  925. ac_cv_prog_ac_ct_STRIP=strip
  926. ac_cv_prog_cc_c89=
  927. ac_cv_prog_cc_g=yes
  928. ac_cv_prog_make_make_set=yes
  929. ac_cv_sys_file_offset_bits=64
  930. ac_cv_sys_largefile_CC=no
  931. am_cv_CC_dependencies_compiler_type=gcc3
  932. am_cv_ar_interface=ar
  933. am_cv_make_support_nested_variables=yes
  934. am_cv_prog_cc_c_o=yes
  935. lt_cv_ar_at_file=@
  936. lt_cv_archive_cmds_need_lc=no
  937. lt_cv_deplibs_check_method=pass_all
  938. lt_cv_file_magic_cmd='$MAGIC_CMD'
  939. lt_cv_file_magic_test_file=
  940. lt_cv_ld_reload_flag=-r
  941. lt_cv_nm_interface='BSD nm'
  942. lt_cv_objdir=.libs
  943. lt_cv_path_LD=/usr/bin/ld
  944. lt_cv_path_NM='/usr/bin/nm -B'
  945. lt_cv_path_mainfest_tool=no
  946. lt_cv_prog_compiler_c_o=yes
  947. lt_cv_prog_compiler_pic='-fPIC -DPIC'
  948. lt_cv_prog_compiler_pic_works=yes
  949. lt_cv_prog_compiler_rtti_exceptions=no
  950. lt_cv_prog_compiler_static_works=yes
  951. lt_cv_prog_gnu_ld=yes
  952. lt_cv_sharedlib_from_linklib_cmd='printf %s\n'
  953. lt_cv_shlibpath_overrides_runpath=no
  954. lt_cv_sys_global_symbol_pipe='sed -n -e '\''s/^.*[   ]\([ABCDGIRSTW][ABCDGIRSTW]*\)[     ][  ]*\([_A-Za-z][_A-Za-z0-9]*\)$/\1 \2 \2/p'\'' | sed '\''/ __gnu_lto/d'\'''
  955. lt_cv_sys_global_symbol_to_c_name_address='sed -n -e '\''s/^: \(.*\) .*$/  {"\1", (void *) 0},/p'\'' -e '\''s/^[ABCDGIRSTW][ABCDGIRSTW]* .* \(.*\)$/  {"\1", (void *) \&\1},/p'\'''
  956. lt_cv_sys_global_symbol_to_c_name_address_lib_prefix='sed -n -e '\''s/^: \(.*\) .*$/  {"\1", (void *) 0},/p'\'' -e '\''s/^[ABCDGIRSTW][ABCDGIRSTW]* .* \(lib.*\)$/  {"\1", (void *) \&\1},/p'\'' -e '\''s/^[ABCDGIRSTW][ABCDGIRSTW]* .* \(.*\)$/  {"lib\1", (void *) \&\1},/p'\'''
  957. lt_cv_sys_global_symbol_to_cdecl='sed -n -e '\''s/^T .* \(.*\)$/extern int \1();/p'\'' -e '\''s/^[ABCDGIRSTW][ABCDGIRSTW]* .* \(.*\)$/extern char \1;/p'\'''
  958. lt_cv_sys_global_symbol_to_import=
  959. lt_cv_sys_max_cmd_len=1572864
  960. lt_cv_to_host_file_cmd=func_convert_file_noop
  961. lt_cv_to_tool_file_cmd=func_convert_file_noop
  962. lt_cv_truncate_bin='/usr/bin/dd bs=4096 count=1'
  963. pkg_cv_CB_CFLAGS=
  964. pkg_cv_CB_LIBS=-larchive
  965. pkg_cv_DJVU_CFLAGS=-pthread
  966. pkg_cv_DJVU_LIBS=-ldjvulibre
  967. pkg_cv_ETUI_BIN_CFLAGS='-pthread -I/usr/include/elementary-1 -I/usr/include/libdrm -I/usr/include/efl-1 -I/usr/include/ecore-wl2-1 -I/usr/include/efl-1 -I/usr/include/ecore-fb-1 -I/usr/include/efl-1 -I/usr/include/ecore-x-1 -I/usr/include/elocation-1 -I/usr/include/efl-1 -I/usr/include/efreet-1 -I/usr/include/efl-1 -I/usr/include/emotion-1 -I/usr/include/efl-1 -I/usr/include/ethumb-client-1 -I/usr/include/efl-1 -I/usr/include/ethumb-1 -I/usr/include/efl-1 -I/usr/include/edje-1 -I/usr/include/efl-1 -I/usr/include/ecore-audio-1 -I/usr/include/efl-1 -I/usr/include/eio-1 -I/usr/include/efl-1 -I/usr/include/efreet-1 -I/usr/include/efl-1 -I/usr/include/efreet-1 -I/usr/include/efl-1 -I/usr/include/ecore-ipc-1 -I/usr/include/efl-1 -I/usr/include/embryo-1 -I/usr/include/efl-1 -I/usr/include/ecore-imf-evas-1 -I/usr/include/efl-1 -I/usr/include/ecore-imf-1 -I/usr/include/efl-1 -I/usr/include/ecore-evas-1 -I/usr/include/efl-1 -I/usr/include/ecore-drm2-1 -I/usr/include/efl-1 -I/usr/include/elput-1 -I/usr/include/efl-1 -I/usr/include/ecore-input-evas-1 -I/usr/include/efl-1 -I/usr/include/ecore-input-1 -I/usr/include/efl-1 -I/usr/include/eeze-1 -I/usr/include/libmount -I/usr/include/blkid -I/usr/include/uuid -I/usr/include/efl-1 -I/usr/include/ecore-file-1 -I/usr/include/efl-1 -I/usr/include/ecore-con-1 -I/usr/include/efl-1 -I/usr/include/eldbus-1 -I/usr/include/dbus-1.0 -I/usr/lib/dbus-1.0/include -I/usr/include/efl-1 -I/usr/include/evas-1 -I/usr/include/evas-1/canvas -I/usr/include/fribidi -I/usr/include/freetype2 -I/usr/include/libpng16 -I/usr/include/harfbuzz -I/usr/include/glib-2.0 -I/usr/lib/glib-2.0/include -I/usr/include/freetype2 -I/usr/include/libpng16 -I/usr/include/harfbuzz -I/usr/include/efl-1 -I/usr/include/ecore-1 -I/usr/include/glib-2.0 -I/usr/lib/glib-2.0/include -I/usr/include/efl-1 -I/usr/include/eet-1 -I/usr/include/efl-1 -I/usr/include/emile-1 -I/usr/include/efl-1 -I/usr/include/eo-1 -I/usr/include/luajit-2.0 -I/usr/include/efl-1 -I/usr/include/eina-1 -I/usr/include/eina-1/eina'
  968. pkg_cv_ETUI_BIN_LIBS='-lelementary -lefl -leina -lpthread -leet -levas -lecore -lecore_evas -lecore_file -lecore_input -ledje -leo -lethumb_client -lemotion -lecore_imf -lecore_con -leldbus -lefreet -lefreet_mime -lefreet_trash -leio -lpthread -lm -ldl -lrt -lecore_input -lecore_evas -lecore -lefl -levas -leina -lpthread'
  969. pkg_cv_ETUI_CFLAGS='-pthread -I/usr/include/efl-1 -I/usr/include/eio-1 -I/usr/include/efl-1 -I/usr/include/efreet-1 -I/usr/include/efl-1 -I/usr/include/ecore-ipc-1 -I/usr/include/efl-1 -I/usr/include/ecore-file-1 -I/usr/include/efl-1 -I/usr/include/ecore-con-1 -I/usr/include/efl-1 -I/usr/include/eldbus-1 -I/usr/include/dbus-1.0 -I/usr/lib/dbus-1.0/include -I/usr/include/efl-1 -I/usr/include/evas-1 -I/usr/include/evas-1/canvas -I/usr/include/fribidi -I/usr/include/freetype2 -I/usr/include/libpng16 -I/usr/include/harfbuzz -I/usr/include/glib-2.0 -I/usr/lib/glib-2.0/include -I/usr/include/freetype2 -I/usr/include/libpng16 -I/usr/include/harfbuzz -I/usr/include/efl-1 -I/usr/include/ecore-1 -I/usr/include/glib-2.0 -I/usr/lib/glib-2.0/include -I/usr/include/efl-1 -I/usr/include/eet-1 -I/usr/include/efl-1 -I/usr/include/emile-1 -I/usr/include/efl-1 -I/usr/include/eo-1 -I/usr/include/luajit-2.0 -I/usr/include/efl-1 -I/usr/include/eina-1 -I/usr/include/eina-1/eina'
  970. pkg_cv_ETUI_LIBS='-leio -lecore -lefl -levas -leina -lpthread'
  971. pkg_cv_MUPDF_DEPS_CFLAGS='-I/usr/include/openjpeg-2.1 -I/usr/include/freetype2 -I/usr/include/libpng16 -I/usr/include/harfbuzz -I/usr/include/glib-2.0 -I/usr/lib/glib-2.0/include'
  972. pkg_cv_MUPDF_DEPS_LIBS='-lopenjp2 -lfreetype -lz -lturbojpeg'
  973. pkg_cv_TIFF_CFLAGS=
  974. pkg_cv_TIFF_LIBS=-ltiff
  975.  
  976. ## ----------------- ##
  977. ## Output variables. ##
  978. ## ----------------- ##
  979.  
  980. ACLOCAL='${SHELL} /home/toliz/Builds/etui-git/src/etui/missing aclocal-1.15'
  981. AMDEPBACKSLASH='\'
  982. AMDEP_FALSE='#'
  983. AMDEP_TRUE=''
  984. AMTAR='$${TAR-tar}'
  985. AM_BACKSLASH='\'
  986. AM_DEFAULT_V='$(AM_DEFAULT_VERBOSITY)'
  987. AM_DEFAULT_VERBOSITY='0'
  988. AM_V='$(V)'
  989. AR='ar'
  990. AS='as'
  991. AUTOCONF='${SHELL} /home/toliz/Builds/etui-git/src/etui/missing autoconf'
  992. AUTOHEADER='${SHELL} /home/toliz/Builds/etui-git/src/etui/missing autoheader'
  993. AUTOMAKE='${SHELL} /home/toliz/Builds/etui-git/src/etui/missing automake-1.15'
  994. AWK='gawk'
  995. CB_CFLAGS=''
  996. CB_LIBS='-larchive'
  997. CC='gcc'
  998. CCDEPMODE='depmode=gcc3'
  999. CFLAGS='-march=i686 -mtune=generic -O0 -pipe -fstack-protector-strong -g3 -ggdb -fvar-tracking-assignments -fvisibility=hidden -I/usr/include/ghostscript'
  1000. CPP='gcc -E'
  1001. CPPFLAGS='-D_FORTIFY_SOURCE=2'
  1002. CYGPATH_W='echo'
  1003. DEFS='-DHAVE_CONFIG_H'
  1004. DEPDIR='.deps'
  1005. DJVU_CFLAGS='-pthread'
  1006. DJVU_LIBS='-ldjvulibre'
  1007. DLLTOOL='false'
  1008. DSYMUTIL=''
  1009. DUMPBIN=''
  1010. ECHO_C=''
  1011. ECHO_N='-n'
  1012. ECHO_T=''
  1013. EGREP='/usr/bin/grep -E'
  1014. EPUB_CFLAGS=''
  1015. EPUB_LIBS=''
  1016. ETUI_BIN_CFLAGS='-pthread -I/usr/include/elementary-1 -I/usr/include/libdrm -I/usr/include/efl-1 -I/usr/include/ecore-wl2-1 -I/usr/include/efl-1 -I/usr/include/ecore-fb-1 -I/usr/include/efl-1 -I/usr/include/ecore-x-1 -I/usr/include/elocation-1 -I/usr/include/efl-1 -I/usr/include/efreet-1 -I/usr/include/efl-1 -I/usr/include/emotion-1 -I/usr/include/efl-1 -I/usr/include/ethumb-client-1 -I/usr/include/efl-1 -I/usr/include/ethumb-1 -I/usr/include/efl-1 -I/usr/include/edje-1 -I/usr/include/efl-1 -I/usr/include/ecore-audio-1 -I/usr/include/efl-1 -I/usr/include/eio-1 -I/usr/include/efl-1 -I/usr/include/efreet-1 -I/usr/include/efl-1 -I/usr/include/efreet-1 -I/usr/include/efl-1 -I/usr/include/ecore-ipc-1 -I/usr/include/efl-1 -I/usr/include/embryo-1 -I/usr/include/efl-1 -I/usr/include/ecore-imf-evas-1 -I/usr/include/efl-1 -I/usr/include/ecore-imf-1 -I/usr/include/efl-1 -I/usr/include/ecore-evas-1 -I/usr/include/efl-1 -I/usr/include/ecore-drm2-1 -I/usr/include/efl-1 -I/usr/include/elput-1 -I/usr/include/efl-1 -I/usr/include/ecore-input-evas-1 -I/usr/include/efl-1 -I/usr/include/ecore-input-1 -I/usr/include/efl-1 -I/usr/include/eeze-1 -I/usr/include/libmount -I/usr/include/blkid -I/usr/include/uuid -I/usr/include/efl-1 -I/usr/include/ecore-file-1 -I/usr/include/efl-1 -I/usr/include/ecore-con-1 -I/usr/include/efl-1 -I/usr/include/eldbus-1 -I/usr/include/dbus-1.0 -I/usr/lib/dbus-1.0/include -I/usr/include/efl-1 -I/usr/include/evas-1 -I/usr/include/evas-1/canvas -I/usr/include/fribidi -I/usr/include/freetype2 -I/usr/include/libpng16 -I/usr/include/harfbuzz -I/usr/include/glib-2.0 -I/usr/lib/glib-2.0/include -I/usr/include/freetype2 -I/usr/include/libpng16 -I/usr/include/harfbuzz -I/usr/include/efl-1 -I/usr/include/ecore-1 -I/usr/include/glib-2.0 -I/usr/lib/glib-2.0/include -I/usr/include/efl-1 -I/usr/include/eet-1 -I/usr/include/efl-1 -I/usr/include/emile-1 -I/usr/include/efl-1 -I/usr/include/eo-1 -I/usr/include/luajit-2.0 -I/usr/include/efl-1 -I/usr/include/eina-1 -I/usr/include/eina-1/eina -Wall -Wextra -Wshadow -Wdeclaration-after-statement -Wmissing-prototypes -Wstrict-prototypes -Wpointer-arith -Wno-missing-field-initializers -fvisibility=hidden -fdata-sections -ffunction-sections'
  1017. ETUI_BIN_LIBS='-lelementary -lefl -leina -lpthread -leet -levas -lecore -lecore_evas -lecore_file -lecore_input -ledje -leo -lethumb_client -lemotion -lecore_imf -lecore_con -leldbus -lefreet -lefreet_mime -lefreet_trash -leio -lpthread -lm -ldl -lrt -lecore_input -lecore_evas -lecore -lefl -levas -leina -lpthread'
  1018. ETUI_BUILD_CB_FALSE='#'
  1019. ETUI_BUILD_CB_TRUE=''
  1020. ETUI_BUILD_DJVU_FALSE='#'
  1021. ETUI_BUILD_DJVU_TRUE=''
  1022. ETUI_BUILD_EPUB_FALSE=''
  1023. ETUI_BUILD_EPUB_TRUE='#'
  1024. ETUI_BUILD_PDF_FALSE='#'
  1025. ETUI_BUILD_PDF_TRUE=''
  1026. ETUI_BUILD_PS_FALSE=''
  1027. ETUI_BUILD_PS_TRUE='#'
  1028. ETUI_BUILD_STATIC_CB_FALSE=''
  1029. ETUI_BUILD_STATIC_CB_TRUE='#'
  1030. ETUI_BUILD_STATIC_DJVU_FALSE=''
  1031. ETUI_BUILD_STATIC_DJVU_TRUE='#'
  1032. ETUI_BUILD_STATIC_EPUB_FALSE=''
  1033. ETUI_BUILD_STATIC_EPUB_TRUE='#'
  1034. ETUI_BUILD_STATIC_PDF_FALSE=''
  1035. ETUI_BUILD_STATIC_PDF_TRUE='#'
  1036. ETUI_BUILD_STATIC_PS_FALSE=''
  1037. ETUI_BUILD_STATIC_PS_TRUE='#'
  1038. ETUI_BUILD_STATIC_TIFF_FALSE=''
  1039. ETUI_BUILD_STATIC_TIFF_TRUE='#'
  1040. ETUI_BUILD_TIFF_FALSE='#'
  1041. ETUI_BUILD_TIFF_TRUE=''
  1042. ETUI_CFLAGS='-pthread -I/usr/include/efl-1 -I/usr/include/eio-1 -I/usr/include/efl-1 -I/usr/include/efreet-1 -I/usr/include/efl-1 -I/usr/include/ecore-ipc-1 -I/usr/include/efl-1 -I/usr/include/ecore-file-1 -I/usr/include/efl-1 -I/usr/include/ecore-con-1 -I/usr/include/efl-1 -I/usr/include/eldbus-1 -I/usr/include/dbus-1.0 -I/usr/lib/dbus-1.0/include -I/usr/include/efl-1 -I/usr/include/evas-1 -I/usr/include/evas-1/canvas -I/usr/include/fribidi -I/usr/include/freetype2 -I/usr/include/libpng16 -I/usr/include/harfbuzz -I/usr/include/glib-2.0 -I/usr/lib/glib-2.0/include -I/usr/include/freetype2 -I/usr/include/libpng16 -I/usr/include/harfbuzz -I/usr/include/efl-1 -I/usr/include/ecore-1 -I/usr/include/glib-2.0 -I/usr/lib/glib-2.0/include -I/usr/include/efl-1 -I/usr/include/eet-1 -I/usr/include/efl-1 -I/usr/include/emile-1 -I/usr/include/efl-1 -I/usr/include/eo-1 -I/usr/include/luajit-2.0 -I/usr/include/efl-1 -I/usr/include/eina-1 -I/usr/include/eina-1/eina'
  1043. ETUI_LIBS='-leio -lecore -lefl -levas -leina -lpthread'
  1044. ETUI_LIB_CFLAGS=' -Wall -Wextra -Wshadow -Wdeclaration-after-statement -Wmissing-prototypes -Wstrict-prototypes -Wpointer-arith -Wno-missing-field-initializers -fvisibility=hidden -fdata-sections -ffunction-sections'
  1045. EXEEXT=''
  1046. FGREP='/usr/bin/grep -F'
  1047. GREP='/usr/bin/grep'
  1048. HAVE_WIN32_FALSE=''
  1049. HAVE_WIN32_TRUE='#'
  1050. INSTALL_DATA='${INSTALL} -m 644'
  1051. INSTALL_PROGRAM='${INSTALL}'
  1052. INSTALL_SCRIPT='${INSTALL}'
  1053. INSTALL_STRIP_PROGRAM='$(install_sh) -c -s'
  1054. LD='/usr/bin/ld'
  1055. LDFLAGS='-Wl,-O1,--sort-common,--as-needed,-z,relro'
  1056. LIBOBJS=''
  1057. LIBS=''
  1058. LIBTOOL='$(SHELL) $(top_builddir)/libtool'
  1059. LIPO=''
  1060. LN_S='ln -s'
  1061. LTLIBOBJS=''
  1062. LT_SYS_LIBRARY_PATH=''
  1063. MAKEINFO='${SHELL} /home/toliz/Builds/etui-git/src/etui/missing makeinfo'
  1064. MANIFEST_TOOL=':'
  1065. MKDIR_P='/usr/bin/mkdir -p'
  1066. MODULE_ARCH='linux-gnu-i686-0.0.4'
  1067. MUPDF_CFLAGS='-I/usr/include'
  1068. MUPDF_DEPS_CFLAGS='-I/usr/include/openjpeg-2.1 -I/usr/include/freetype2 -I/usr/include/libpng16 -I/usr/include/harfbuzz -I/usr/include/glib-2.0 -I/usr/lib/glib-2.0/include'
  1069. MUPDF_DEPS_LIBS='-lopenjp2 -lfreetype -lz -lturbojpeg '
  1070. MUPDF_SHARED_LIBS='-ljbig2dec'
  1071. MUPDF_STATIC_LIBS='-Wl,/usr/lib/libmupdf.a -Wl,/usr/lib/libmupdfthird.a'
  1072. NM='/usr/bin/nm -B'
  1073. NMEDIT=''
  1074. OBJDUMP='objdump'
  1075. OBJEXT='o'
  1076. OTOOL64=''
  1077. OTOOL=''
  1078. PACKAGE='etui'
  1079. PACKAGE_BUGREPORT='vincent.torri.remove@gmail.com'
  1080. PACKAGE_NAME='etui'
  1081. PACKAGE_STRING='etui 0.0.4'
  1082. PACKAGE_TARNAME='etui'
  1083. PACKAGE_URL=''
  1084. PACKAGE_VERSION='0.0.4'
  1085. PATH_SEPARATOR=':'
  1086. PKG_CONFIG='/usr/bin/pkg-config'
  1087. PKG_CONFIG_LIBDIR=''
  1088. PKG_CONFIG_PATH=''
  1089. RANLIB='ranlib'
  1090. SED='/usr/bin/sed'
  1091. SET_MAKE=''
  1092. SHELL='/bin/sh'
  1093. STRIP='strip'
  1094. TIFF_CFLAGS=''
  1095. TIFF_LIBS='-ltiff'
  1096. VERSION='0.0.4'
  1097. VMAJ='0'
  1098. XPOST_CFLAGS=''
  1099. XPOST_LIBS=''
  1100. ac_ct_AR='ar'
  1101. ac_ct_CC='gcc'
  1102. ac_ct_DUMPBIN=''
  1103. am__EXEEXT_FALSE=''
  1104. am__EXEEXT_TRUE='#'
  1105. am__fastdepCC_FALSE='#'
  1106. am__fastdepCC_TRUE=''
  1107. am__include='include'
  1108. am__isrc=''
  1109. am__leading_dot='.'
  1110. am__nodep='_no'
  1111. am__quote=''
  1112. am__tar='$${TAR-tar} chof - "$$tardir"'
  1113. am__untar='$${TAR-tar} xf -'
  1114. bindir='${exec_prefix}/bin'
  1115. build='i686-pc-linux-gnu'
  1116. build_alias=''
  1117. build_cpu='i686'
  1118. build_os='linux-gnu'
  1119. build_vendor='pc'
  1120. datadir='${datarootdir}'
  1121. datarootdir='${prefix}/share'
  1122. docdir='${datarootdir}/doc/${PACKAGE_TARNAME}'
  1123. dvidir='${docdir}'
  1124. edje_cc='/usr/bin/edje_cc'
  1125. exec_prefix='${prefix}'
  1126. host='i686-pc-linux-gnu'
  1127. host_alias=''
  1128. host_cpu='i686'
  1129. host_os='linux-gnu'
  1130. host_vendor='pc'
  1131. htmldir='${docdir}'
  1132. includedir='${prefix}/include'
  1133. infodir='${datarootdir}/info'
  1134. install_sh='${SHELL} /home/toliz/Builds/etui-git/src/etui/install-sh'
  1135. libdir='${exec_prefix}/lib'
  1136. libexecdir='${exec_prefix}/libexec'
  1137. localedir='${datarootdir}/locale'
  1138. localstatedir='${prefix}/var'
  1139. mandir='${datarootdir}/man'
  1140. mkdir_p='$(MKDIR_P)'
  1141. oldincludedir='/usr/include'
  1142. pdfdir='${docdir}'
  1143. prefix='/usr'
  1144. program_transform_name='s,x,x,'
  1145. psdir='${docdir}'
  1146. release_info='v_rel'
  1147. requirements_etui_libs=''
  1148. requirements_etui_pc='eio >= 1.18.0 ecore >= 1.18.0 evas >= 1.18.0 eina >= 1.18.0'
  1149. sbindir='${exec_prefix}/sbin'
  1150. sharedstatedir='${prefix}/com'
  1151. sysconfdir='${prefix}/etc'
  1152. target_alias=''
  1153. version_info='0:4:0'
  1154.  
  1155. ## ----------- ##
  1156. ## confdefs.h. ##
  1157. ## ----------- ##
  1158.  
  1159. /* confdefs.h */
  1160. #define PACKAGE_NAME "etui"
  1161. #define PACKAGE_TARNAME "etui"
  1162. #define PACKAGE_VERSION "0.0.4"
  1163. #define PACKAGE_STRING "etui 0.0.4"
  1164. #define PACKAGE_BUGREPORT "vincent.torri.remove@gmail.com"
  1165. #define PACKAGE_URL ""
  1166. #define PACKAGE "etui"
  1167. #define VERSION "0.0.4"
  1168. #define STDC_HEADERS 1
  1169. #define HAVE_SYS_TYPES_H 1
  1170. #define HAVE_SYS_STAT_H 1
  1171. #define HAVE_STDLIB_H 1
  1172. #define HAVE_STRING_H 1
  1173. #define HAVE_MEMORY_H 1
  1174. #define HAVE_STRINGS_H 1
  1175. #define HAVE_INTTYPES_H 1
  1176. #define HAVE_STDINT_H 1
  1177. #define HAVE_UNISTD_H 1
  1178. #define HAVE_DLFCN_H 1
  1179. #define LT_OBJDIR ".libs/"
  1180. #define MODULE_ARCH "linux-gnu-i686-0.0.4"
  1181. #define HAVE_LIBARCHIVE 1
  1182. #define ETUI_BUILD_CB 1
  1183. #define ETUI_BUILD_DJVU 1
  1184. #define ETUI_BUILD_PDF 1
  1185. #define ETUI_BUILD_TIFF 1
  1186. #define _FILE_OFFSET_BITS 64
  1187.  
  1188. configure: exit 0
RAW Paste Data
We use cookies for various purposes including analytics. By continuing to use Pastebin, you agree to our use of cookies as described in the Cookies Policy. OK, I Understand
Not a member of Pastebin yet?
Sign Up, it unlocks many cool features!
 
Top