SHARE
TWEET

Untitled

a guest Feb 12th, 2018 65 Never
Not a member of Pastebin yet? Sign Up, it unlocks many cool features!
  1. Welcome to Ubuntu 16.04.3 LTS (GNU/Linux 4.4.0 x86_64)
  2.  
  3.  * Documentation:  https://help.ubuntu.com
  4.  * Management:     https://landscape.canonical.com
  5.  * Support:        https://ubuntu.com/advantage
  6. Last login: Mon Feb 12 20:26:17 2018 from 109.41.192.46
  7. mrkl16@localhost:~$ cd halium
  8. mrkl16@localhost:~/halium$ source build/envsetup.sh
  9. including vendor/cm/vendorsetup.sh
  10. including sdk/bash_completion/adb.bash
  11. including vendor/cm/bash_completion/git.bash
  12. including vendor/cm/bash_completion/repo.bash
  13. mrkl16@localhost:~/halium$ breakfast jfltexx
  14. including vendor/cm/vendorsetup.sh
  15. Trying dependencies-only mode on a non-existing device tree?
  16.  
  17. ============================================
  18. PLATFORM_VERSION_CODENAME=REL
  19. PLATFORM_VERSION=7.1.1
  20. LINEAGE_VERSION=14.1-20180212-UNOFFICIAL-jfltexx
  21. TARGET_PRODUCT=lineage_jfltexx
  22. TARGET_BUILD_VARIANT=userdebug
  23. TARGET_BUILD_TYPE=release
  24. TARGET_BUILD_APPS=
  25. TARGET_ARCH=arm
  26. TARGET_ARCH_VARIANT=armv7-a-neon
  27. TARGET_CPU_VARIANT=krait
  28. TARGET_2ND_ARCH=
  29. TARGET_2ND_ARCH_VARIANT=
  30. TARGET_2ND_CPU_VARIANT=
  31. HOST_ARCH=x86_64
  32. HOST_2ND_ARCH=x86
  33. HOST_OS=linux
  34. HOST_OS_EXTRA=Linux-4.4.0-x86_64-with-Ubuntu-16.04-xenial
  35. HOST_CROSS_OS=windows
  36. HOST_CROSS_ARCH=x86
  37. HOST_CROSS_2ND_ARCH=x86_64
  38. HOST_BUILD_TYPE=release
  39. BUILD_ID=NOF27B
  40. OUT_DIR=/home/mrkl16/halium/out
  41. ============================================
  42. mrkl16@localhost:~/halium$ mka hybris-boot
  43. make: Entering directory '/home/mrkl16/halium'
  44. ============================================
  45. PLATFORM_VERSION_CODENAME=REL
  46. PLATFORM_VERSION=7.1.1
  47. LINEAGE_VERSION=14.1-20180212-UNOFFICIAL-jfltexx
  48. TARGET_PRODUCT=lineage_jfltexx
  49. TARGET_BUILD_VARIANT=userdebug
  50. TARGET_BUILD_TYPE=release
  51. TARGET_BUILD_APPS=
  52. TARGET_ARCH=arm
  53. TARGET_ARCH_VARIANT=armv7-a-neon
  54. TARGET_CPU_VARIANT=krait
  55. TARGET_2ND_ARCH=
  56. TARGET_2ND_ARCH_VARIANT=
  57. TARGET_2ND_CPU_VARIANT=
  58. HOST_ARCH=x86_64
  59. HOST_2ND_ARCH=x86
  60. HOST_OS=linux
  61. HOST_OS_EXTRA=Linux-4.4.0-x86_64-with-Ubuntu-16.04-xenial
  62. HOST_CROSS_OS=windows
  63. HOST_CROSS_ARCH=x86
  64. HOST_CROSS_2ND_ARCH=x86_64
  65. HOST_BUILD_TYPE=release
  66. BUILD_ID=NOF27B
  67. OUT_DIR=/home/mrkl16/halium/out
  68. ============================================
  69. Running kati to generate build-lineage_jfltexx.ninja...
  70. Environment variable BUILD_NUMBER was modified (52b653f039 => 6623a28a2d), regenerating...
  71. ============================================
  72. PLATFORM_VERSION_CODENAME=REL
  73. PLATFORM_VERSION=7.1.1
  74. LINEAGE_VERSION=14.1-20180212-UNOFFICIAL-jfltexx
  75. TARGET_PRODUCT=lineage_jfltexx
  76. TARGET_BUILD_VARIANT=userdebug
  77. TARGET_BUILD_TYPE=release
  78. TARGET_BUILD_APPS=
  79. TARGET_ARCH=arm
  80. TARGET_ARCH_VARIANT=armv7-a-neon
  81. TARGET_CPU_VARIANT=krait
  82. TARGET_2ND_ARCH=
  83. TARGET_2ND_ARCH_VARIANT=
  84. TARGET_2ND_CPU_VARIANT=
  85. HOST_ARCH=x86_64
  86. HOST_2ND_ARCH=x86
  87. HOST_OS=linux
  88. HOST_OS_EXTRA=Linux-4.4.0-x86_64-with-Ubuntu-16.04-xenial
  89. HOST_CROSS_OS=windows
  90. HOST_CROSS_ARCH=x86
  91. HOST_CROSS_2ND_ARCH=x86_64
  92. HOST_BUILD_TYPE=release
  93. BUILD_ID=NOF27B
  94. OUT_DIR=/home/mrkl16/halium/out
  95. ============================================
  96. frameworks/av/camera/cameraserver/Android.mk:18: Target has integrated cameraserver into mediaserver. This is weakening security measures introduced in 7.0
  97. halium/hybris-boot/Android.mk:67: ********************* /boot appears to live on /dev/block/platform/msm_sdcc.1/by-name/boot
  98. halium/hybris-boot/Android.mk:68: ********************* /data appears to live on /dev/block/platform/msm_sdcc.1/by-name/userdata
  99. halium/ubports-boot/Android.mk:52: ********************* /boot appears to live on /dev/block/platform/msm_sdcc.1/by-name/boot
  100. halium/ubports-boot/Android.mk:53: ********************* /data appears to live on /dev/block/platform/msm_sdcc.1/by-name/userdata
  101. No private recovery resources for TARGET_DEVICE jfltexx
  102. build/core/base_rules.mk:316: warning: overriding commands for target `/home/mrkl16/halium/out/target/product/jfltexx/root/res/images/charger/battery_fail.png'
  103. build/core/base_rules.mk:316: warning: ignoring old commands for target `/home/mrkl16/halium/out/target/product/jfltexx/root/res/images/charger/battery_fail.png'
  104. build/core/Makefile:34: warning: overriding commands for target `/home/mrkl16/halium/out/target/product/jfltexx/system/bin/rild'
  105. build/core/base_rules.mk:316: warning: ignoring old commands for target `/home/mrkl16/halium/out/target/product/jfltexx/system/bin/rild'
  106. build/core/Makefile:34: warning: overriding commands for target `/home/mrkl16/halium/out/target/product/jfltexx/system/lib/libreference-ril.so'
  107. build/core/base_rules.mk:316: warning: ignoring old commands for target `/home/mrkl16/halium/out/target/product/jfltexx/system/lib/libreference-ril.so'
  108. build/core/Makefile:34: warning: overriding commands for target `/home/mrkl16/halium/out/target/product/jfltexx/system/lib/libril.so'
  109. build/core/base_rules.mk:316: warning: ignoring old commands for target `/home/mrkl16/halium/out/target/product/jfltexx/system/lib/libril.so'
  110. build/core/Makefile:34: warning: overriding commands for target `/home/mrkl16/halium/out/target/product/jfltexx/system/lib/libsecril-client.so'
  111. build/core/base_rules.mk:316: warning: ignoring old commands for target `/home/mrkl16/halium/out/target/product/jfltexx/system/lib/libsecril-client.so'
  112. Starting build with ninja
  113. ninja: Entering directory `.'
  114. [  3% 72/2075] Building Kernel Config                                        make: Entering directory '/home/mrkl16/halium/kernel/samsung/jf'
  115.  GEN     /home/mrkl16/halium/out/target/product/jfltexx/obj/KERNEL_OBJ/Makefile
  116. drivers/usb/otg/Kconfig:187:warning: leading whitespace ignored
  117. drivers/media/video/msm-jf/Kconfig:114:warning: choice value used outside its choice group
  118. drivers/media/video/msm/Kconfig:108:warning: choice value used outside its choice group
  119. drivers/media/video/msm-jf/Kconfig:119:warning: choice value used outside its choice group
  120. drivers/media/video/msm/Kconfig:113:warning: choice value used outside its choice group
  121. arch/arm/configs/lineageos_jf_defconfig:586:warning: override: reassigning to symbol UTS_NS
  122. arch/arm/configs/lineageos_jf_defconfig:592:warning: override: reassigning to symbol PID_NS
  123. arch/arm/configs/lineageos_jf_defconfig:601:warning: override: reassigning to symbol AUDIT
  124. #
  125. # configuration written to .config
  126. #
  127. make: Leaving directory '/home/mrkl16/halium/kernel/samsung/jf'
  128. make: Entering directory '/home/mrkl16/halium/kernel/samsung/jf'
  129.  GEN     /home/mrkl16/halium/out/target/product/jfltexx/obj/KERNEL_OBJ/Makefile
  130. scripts/kconfig/conf --savedefconfig=defconfig Kconfig
  131. drivers/usb/otg/Kconfig:187:warning: leading whitespace ignored
  132. drivers/media/video/msm-jf/Kconfig:114:warning: choice value used outside its choice group
  133. drivers/media/video/msm/Kconfig:108:warning: choice value used outside its choice group
  134. drivers/media/video/msm-jf/Kconfig:119:warning: choice value used outside its choice group
  135. drivers/media/video/msm/Kconfig:113:warning: choice value used outside its choice group
  136. make: Leaving directory '/home/mrkl16/halium/kernel/samsung/jf'
  137. [  5% 115/2075] Building Kernel Headers                                      make: Entering directory '/home/mrkl16/halium/kernel/samsung/jf'
  138.  GEN     /home/mrkl16/halium/out/target/product/jfltexx/obj/KERNEL_OBJ/Makefile
  139. drivers/usb/otg/Kconfig:187:warning: leading whitespace ignored
  140. drivers/media/video/msm-jf/Kconfig:114:warning: choice value used outside its choice group
  141. drivers/media/video/msm/Kconfig:108:warning: choice value used outside its choice group
  142. drivers/media/video/msm-jf/Kconfig:119:warning: choice value used outside its choice group
  143. drivers/media/video/msm/Kconfig:113:warning: choice value used outside its choice group
  144. arch/arm/configs/lineageos_jf_defconfig:586:warning: override: reassigning to symbol UTS_NS
  145. arch/arm/configs/lineageos_jf_defconfig:592:warning: override: reassigning to symbol PID_NS
  146. arch/arm/configs/lineageos_jf_defconfig:601:warning: override: reassigning to symbol AUDIT
  147. #
  148. # configuration written to .config
  149. #
  150. make: Leaving directory '/home/mrkl16/halium/kernel/samsung/jf'
  151. make: Entering directory '/home/mrkl16/halium/kernel/samsung/jf'
  152.  CHK     include/linux/version.h
  153. make: Leaving directory '/home/mrkl16/halium/kernel/samsung/jf'
  154. [ 18% 376/2075] Building Kernel                                              FAILED: /bin/bash -c "(make -j2  CFLAGS_MODULE=\"-fno-pic\" -C kernel/samsung/jf O=/home/mrkl16/halium/out/target/product/jfltexx/obj/KERNEL_OBJ ARCH=arm CROSS_COMPILE=\" arm-linux-androidkernel-\" zImage ) && (if grep -q 'CONFIG_OF=y' /home/mrkl16/halium/out/target/product/jfltexx/obj/KERNEL_OBJ/.config ;then                             echo \"Building DTBs\" ;                    make -j2  CFLAGS_MODULE=\"-fno-pic\" -C kernel/samsung/jf O=/home/mrkl16/halium/out/target/product/jfltexx/obj/KERNEL_OBJ ARCH=arm CROSS_COMPILE=\" arm-linux-androidkernel-\" dtbs ;                      else                        echo \"DTBs not enabled\" ;                      fi ) && (if grep -q 'CONFIG_MODULES=y' /home/mrkl16/halium/out/target/product/jfltexx/obj/KERNEL_OBJ/.config ;                    then                            echo \"Building Kernel Modules\" ;                           make -j2  CFLAGS_MODULE=\"-fno-pic\" -C kernel/samsung/jf O=/home/mrkl16/halium/out/target/product/jfltexx/obj/KERNEL_OBJ ARCH=arm CROSS_COMPILE=\" arm-linux-androidkernel-\" modules &&     make -j2  CFLAGS_MODULE=\"-fno-pic\" -C kernel/samsung/jf O=/home/mrkl16/halium/out/target/product/jfltexx/obj/KERNEL_OBJ INSTALL_MOD_PATH=../../system ARCH=arm CROSS_COMPILE=\" arm-linux-androidkernel-\" modules_install &&            mdpath=\`find /home/mrkl16/halium/out/target/product/jfltexx/system/lib/modules -type f -name modules.order\`; if [ \"\$mdpath\" != \"\" ];then mpath=\`dirname \$mdpath\`; ko=\`find \$mpath/kernel -type f -name *.ko\`; for i in \$ko; do arm-linux-androidkernel-strip --strip-unneeded \$i; mv \$i /home/mrkl16/halium/out/target/product/jfltexx/system/lib/modules/; done; fi &&          mdpath=\`find /home/mrkl16/halium/out/target/product/jfltexx/system/lib/modules -type f -name modules.order\`; if [ \"\$mdpath\" != \"\" ];then mpath=\`dirname \$mdpath\`; rm -rf \$mpath; fi ;                       else        echo \"Kernel Modules not enabled\" ;                    fi )"
  155. make: Entering directory '/home/mrkl16/halium/kernel/samsung/jf'
  156.  GEN     /home/mrkl16/halium/out/target/product/jfltexx/obj/KERNEL_OBJ/Makefile
  157. scripts/kconfig/conf --silentoldconfig Kconfig
  158. drivers/usb/otg/Kconfig:187:warning: leading whitespace ignored
  159. drivers/media/video/msm-jf/Kconfig:114:warning: choice value used outside its choice group
  160. drivers/media/video/msm/Kconfig:108:warning: choice value used outside its choice group
  161. drivers/media/video/msm-jf/Kconfig:119:warning: choice value used outside its choice group
  162. drivers/media/video/msm/Kconfig:113:warning: choice value used outside its choice group
  163.  GEN     /home/mrkl16/halium/out/target/product/jfltexx/obj/KERNEL_OBJ/Makefile
  164.  CHK     include/linux/version.h
  165.  Using /home/mrkl16/halium/kernel/samsung/jf as source for kernel
  166.  CHK     include/generated/utsrelease.h
  167. make[2]: 'include/generated/mach-types.h' is up to date.
  168.  CALL    /home/mrkl16/halium/kernel/samsung/jf/scripts/checksyscalls.sh
  169.  CHK     include/generated/compile.h
  170.  GZIP    kernel/config_data.gz
  171.  CHK     kernel/config_data.h
  172.  LD      arch/arm/lib/built-in.o
  173.  AS      arch/arm/lib/ashldi3.o
  174.  AS      arch/arm/lib/ashrdi3.o
  175.  AS      arch/arm/lib/backtrace.o
  176.  AS      arch/arm/lib/call_with_stack.o
  177.  AS      arch/arm/lib/changebit.o
  178.  AS      arch/arm/lib/clear_user.o
  179.  AS      arch/arm/lib/clearbit.o
  180.  AS      arch/arm/lib/csumipv6.o
  181.  AS      arch/arm/lib/csumpartial.o
  182.  AS      arch/arm/lib/csumpartialcopy.o
  183.  AS      arch/arm/lib/csumpartialcopyuser.o
  184.  AS      arch/arm/lib/delay-loop.o
  185.  CC      arch/arm/lib/delay.o
  186.  AS      arch/arm/lib/div64.o
  187.  AS      arch/arm/lib/findbit.o
  188.  AS      arch/arm/lib/getuser.o
  189.  AS      arch/arm/lib/io-readsb.o
  190.  AS      arch/arm/lib/io-readsl.o
  191.  AS      arch/arm/lib/io-readsw-armv4.o
  192.  AS      arch/arm/lib/io-writesb.o
  193.  AS      arch/arm/lib/io-writesl.o
  194.  AS      arch/arm/lib/io-writesw-armv4.o
  195.  AS      arch/arm/lib/lib1funcs.o
  196.  AS      arch/arm/lib/lshrdi3.o
  197.  AS      arch/arm/lib/memchr.o
  198.  AS      arch/arm/lib/memset.o
  199.  AS      arch/arm/lib/memzero.o
  200.  AS      arch/arm/lib/muldi3.o
  201.  AS      arch/arm/lib/putuser.o
  202.  AS      arch/arm/lib/setbit.o
  203.  AS      arch/arm/lib/strchr.o
  204.  AS      arch/arm/lib/strncpy_from_user.o
  205.  AS      arch/arm/lib/strnlen_user.o
  206.  AS      arch/arm/lib/strrchr.o
  207.  AS      arch/arm/lib/testchangebit.o
  208.  AS      arch/arm/lib/testclearbit.o
  209.  LD      drivers/video/fb.o
  210.  AS      arch/arm/lib/testsetbit.o
  211.  AS      arch/arm/lib/ucmpdi2.o
  212.  LD      drivers/video/msm/msm_mipi.o
  213.  CC      drivers/video/msm/mipi_samsung_octa.o
  214.  AR      arch/arm/lib/lib.a
  215.  CC      lib/bcd.o
  216. In file included from /home/mrkl16/halium/kernel/samsung/jf/include/linux/kobject.h:21:0,
  217.                 from /home/mrkl16/halium/kernel/samsung/jf/include/linux/device.h:17,
  218.                 from /home/mrkl16/halium/kernel/samsung/jf/include/linux/lcd.h:11,
  219.                 from /home/mrkl16/halium/kernel/samsung/jf/drivers/video/msm/mipi_samsung_octa.c:13:
  220. /home/mrkl16/halium/kernel/samsung/jf/drivers/video/msm/mipi_samsung_octa.c:1157:3: error: 'mipi_samsung_disp_get_power' undeclared here (not in a function)
  221.   mipi_samsung_disp_get_power,
  222.   ^
  223. /home/mrkl16/halium/kernel/samsung/jf/include/linux/sysfs.h:72:10: note: in definition of macro '__ATTR'
  224.  .show = _show,     \
  225.          ^
  226. /home/mrkl16/halium/kernel/samsung/jf/drivers/video/msm/mipi_samsung_octa.c:1156:8: note: in expansion of macro 'DEVICE_ATTR'
  227. static DEVICE_ATTR(lcd_power, S_IRUGO | S_IWUSR,
  228.        ^
  229. /home/mrkl16/halium/kernel/samsung/jf/drivers/video/msm/mipi_samsung_octa.c:1158:3: error: 'mipi_samsung_disp_set_power' undeclared here (not in a function)
  230.   mipi_samsung_disp_set_power);
  231.   ^
  232. /home/mrkl16/halium/kernel/samsung/jf/include/linux/sysfs.h:73:11: note: in definition of macro '__ATTR'
  233.  .store = _store,     \
  234.           ^
  235. /home/mrkl16/halium/kernel/samsung/jf/drivers/video/msm/mipi_samsung_octa.c:1156:8: note: in expansion of macro 'DEVICE_ATTR'
  236. static DEVICE_ATTR(lcd_power, S_IRUGO | S_IWUSR,
  237.        ^
  238. /home/mrkl16/halium/kernel/samsung/jf/drivers/video/msm/mipi_samsung_octa.c: In function 'mipi_samsung_disp_probe':
  239. /home/mrkl16/halium/kernel/samsung/jf/drivers/video/msm/mipi_samsung_octa.c:1394:27: warning: unused variable 'bd' [-Wunused-variable]
  240. error, forbidden warning: mipi_samsung_octa.c:1394
  241. /home/mrkl16/halium/kernel/samsung/jf/scripts/Makefile.build:307: recipe for target 'drivers/video/msm/mipi_samsung_octa.o' failed
  242. make[4]: *** [drivers/video/msm/mipi_samsung_octa.o] Error 1
  243. /home/mrkl16/halium/kernel/samsung/jf/scripts/Makefile.build:443: recipe for target 'drivers/video/msm' failed
  244. make[3]: *** [drivers/video/msm] Error 2
  245. /home/mrkl16/halium/kernel/samsung/jf/scripts/Makefile.build:443: recipe for target 'drivers/video' failed
  246. make[2]: *** [drivers/video] Error 2
  247. /home/mrkl16/halium/kernel/samsung/jf/Makefile:973: recipe for target 'drivers' failed
  248. make[1]: *** [drivers] Error 2
  249. make[1]: *** Waiting for unfinished jobs....
  250.  CC      lib/div64.o
  251.  CC      lib/sort.o
  252.  CC      lib/parser.o
  253.  CC      lib/halfmd4.o
  254.  CC      lib/debug_locks.o
  255.  CC      lib/random32.o
  256.  CC      lib/bust_spinlocks.o
  257.  CC      lib/hexdump.o
  258.  CC      lib/kasprintf.o
  259.  CC      lib/bitmap.o
  260.  CC      lib/scatterlist.o
  261.  CC      lib/string_helpers.o
  262.  CC      lib/gcd.o
  263.  CC      lib/lcm.o
  264.  CC      lib/list_sort.o
  265.  CC      lib/uuid.o
  266.  CC      lib/flex_array.o
  267.  CC      lib/bsearch.o
  268.  CC      lib/find_last_bit.o
  269.  CC      lib/find_next_bit.o
  270.  CC      lib/llist.o
  271.  CC      lib/kstrtox.o
  272.  CC      lib/pci_iomap.o
  273.  CC      lib/iomap_copy.o
  274.  CC      lib/devres.o
  275.  CC      lib/hweight.o
  276.  CC      lib/bitrev.o
  277.  CC      lib/crc-ccitt.o
  278.  CC      lib/crc16.o
  279.  HOSTCC  lib/gen_crc32table
  280.  CC      lib/libcrc32c.o
  281.  CC      lib/genalloc.o
  282.  CC      lib/lzo/lzo1x_compress.o
  283.  CC      lib/reed_solomon/reed_solomon.o
  284.  CC      lib/lzo/lzo1x_decompress_safe.o
  285.  LD      lib/lzo/lzo_compress.o
  286.  LD      lib/lzo/lzo_decompress.o
  287.  LD      lib/lzo/built-in.o
  288.  LD      lib/reed_solomon/built-in.o
  289.  CC      lib/zlib_deflate/deflate.o
  290.  CC      lib/zlib_inflate/inffast.o
  291.  CC      lib/zlib_inflate/inflate.o
  292.  CC      lib/zlib_deflate/deftree.o
  293.  CC      lib/zlib_inflate/infutil.o
  294.  CC      lib/zlib_inflate/inftrees.o
  295.  CC      lib/zlib_inflate/inflate_syms.o
  296.  LD      lib/zlib_inflate/zlib_inflate.o
  297.  LD      lib/zlib_inflate/built-in.o
  298.  CC      lib/textsearch.o
  299.  CC      lib/zlib_deflate/deflate_syms.o
  300.  LD      lib/zlib_deflate/zlib_deflate.o
  301.  LD      lib/zlib_deflate/built-in.o
  302.  CC      lib/ts_kmp.o
  303.  CC      lib/ts_bm.o
  304.  CC      lib/ts_fsm.o
  305.  CC      lib/percpu_counter.o
  306.  CC      lib/nlattr.o
  307.  CC      lib/cpu_rmap.o
  308.  CC      lib/dynamic_queue_limits.o
  309.  CC      lib/argv_split.o
  310.  CC      lib/bug.o
  311.  CC      lib/cmdline.o
  312.  CC      lib/cpumask.o
  313.  CC      lib/ctype.o
  314.  CC      lib/dec_and_lock.o
  315.  CC      lib/decompress.o
  316.  CC      lib/decompress_inflate.o
  317.  CC      lib/decompress_unlzma.o
  318.  CC      lib/dump_stack.o
  319.  CC      lib/extable.o
  320.  CC      lib/idr.o
  321.  CC      lib/int_sqrt.o
  322.  CC      lib/ioremap.o
  323.  CC      lib/irq_regs.o
  324.  CC      lib/is_single_threaded.o
  325.  CC      lib/klist.o
  326.  CC      lib/kobject.o
  327.  CC      lib/kobject_uevent.o
  328.  CC      lib/md5.o
  329.  CC      lib/memory_alloc.o
  330.  CC      lib/plist.o
  331.  CC      lib/prio_heap.o
  332.  CC      lib/prio_tree.o
  333.  CC      lib/proportions.o
  334.  CC      lib/radix-tree.o
  335.  CC      lib/ratelimit.o
  336.  CC      lib/rbtree.o
  337.  CC      lib/reciprocal_div.o
  338.  CC      lib/rwsem.o
  339.  CC      lib/sha1.o
  340.  CC      lib/show_mem.o
  341.  CC      lib/string.o
  342.  CC      lib/timerqueue.o
  343.  CC      lib/vsprintf.o
  344.  GEN     lib/crc32table.h
  345.  CC      lib/crc32.o
  346.  LD      lib/built-in.o
  347.  AR      lib/lib.a
  348. Makefile:130: recipe for target 'sub-make' failed
  349. make: *** [sub-make] Error 2
  350. make: Leaving directory '/home/mrkl16/halium/kernel/samsung/jf'
  351. [ 18% 376/2075] target thumb C: libc_... <= bionic/libc/dns/resolv/res_init. ninja: build stopped: subcommand failed.
  352. build/core/ninja.mk:151: recipe for target 'ninja_wrapper' failed
  353. make: *** [ninja_wrapper] Error 1
  354. make: Leaving directory '/home/mrkl16/halium'
  355.  
  356. #### make failed to build some targets (48 seconds) ####
  357.  
  358. mrkl16@localhost:~/halium$
RAW Paste Data
We use cookies for various purposes including analytics. By continuing to use Pastebin, you agree to our use of cookies as described in the Cookies Policy. OK, I Understand
 
Top