SHARE
TWEET

Untitled

Hariton Dec 29th, 2019 96 Never
Not a member of Pastebin yet? Sign Up, it unlocks many cool features!
  1. 10:09:26.280  Testing credentials for 'C:\Users\Hariton\Documents\Corona Projects\myevpanet.keystore':
  2. 10:09:29.101  jar signed.
  3. 10:09:29.101  Picked up JAVA_TOOL_OPTIONS: -Duser.language=en
  4. 10:09:30.382  Using custom build id from app bundle: 00000 (AppSettings.lua)
  5. 10:09:30.382  
  6. 10:09:30.382  Using custom Build Id 00000
  7. 10:09:30.382  Prepackage: Compiling Lua ...
  8. 10:09:30.475  Prepackage: Building server data file
  9. 10:09:30.475  Prepackage: running: "C:\Program Files\Java\jdk1.8.0_231\bin\java.exe" -Djava.class.path="C:\Program Files (x86)\Corona Labs\Corona\Resources/ant.jar;C:\Program Files (x86)\Corona Labs\Corona\Resources/ant-launcher.jar;C:\Program Files (x86)\Corona Labs\Corona\Resources/AntLiveManifest.jar" org.apache.tools.ant.launch.Launcher -d -DTEMP_DIR="C:\Users\Hariton\AppData\Local\Temp\Corona Labs\CLtmpa09944" -DSRC_DIR="C:\Users\Hariton\Documents\Corona Projects\myEvpaNet" -DBUNDLE_DIR="C:\Program Files (x86)\Corona Labs\Corona\Resources" -DLIVE_BUILD=NO -DLIVE_BUILD_MANIFEST_FILE= -f "C:\Program Files (x86)\Corona Labs\Corona\Resources"/build.xml build-input-zip
  10. 10:09:33.233  Apache Ant version 1.8.1 compiled on April 30 2010
  11. 10:09:33.233  Buildfile: C:\Program Files (x86)\Corona Labs\Corona\Resources\build.xml
  12. 10:09:33.233  Adding reference: ant.PropertyHelper
  13. 10:09:33.233  Detected Java version: 1.6 in: C:\Program Files\Java\jdk1.8.0_231\jre
  14. 10:09:33.233  Detected OS: Windows 8
  15. 10:09:33.233  Adding reference: ant.ComponentHelper
  16. 10:09:33.233  Setting ro project property: LIVE_BUILD -> NO
  17. 10:09:33.233  Setting ro project property: BUNDLE_DIR -> C:\Program Files (x86)\Corona Labs\Corona\Resources
  18. 10:09:33.233  Setting ro project property: SRC_DIR -> C:\Users\Hariton\Documents\Corona Projects\myEvpaNet
  19. 10:09:33.233  Setting ro project property: TEMP_DIR -> C:\Users\Hariton\AppData\Local\Temp\Corona Labs\CLtmpa09944
  20. 10:09:33.233  Setting ro project property: LIVE_BUILD_MANIFEST_FILE ->
  21. 10:09:33.233  Setting ro project property: ant.file -> C:\Program Files (x86)\Corona Labs\Corona\Resources\build.xml
  22. 10:09:33.233  Setting ro project property: ant.file.type -> file
  23. 10:09:33.233  Adding reference: ant.projectHelper
  24. 10:09:33.233  Adding reference: ant.parsing.context
  25. 10:09:33.233  Adding reference: ant.targets
  26. 10:09:33.233  parsing buildfile C:\Program Files (x86)\Corona Labs\Corona\Resources\build.xml with URI = file:/C:/Program%20Files%20(x86)/Corona%20Labs/Corona/Resources/build.xml
  27. 10:09:33.233  Setting ro project property: ant.project.name -> Corona Client Build
  28. 10:09:33.233  Adding reference: Corona Client Build
  29. 10:09:33.233  Setting ro project property: ant.project.default-target -> none
  30. 10:09:33.233  Setting ro project property: ant.file.Corona Client Build -> C:\Program Files (x86)\Corona Labs\Corona\Resources\build.xml
  31. 10:09:33.233  Setting ro project property: ant.file.type.Corona Client Build -> file
  32. 10:09:33.233  Project base dir set to: C:\Program Files (x86)\Corona Labs\Corona\Resources
  33. 10:09:33.233   +Target:
  34. 10:09:33.233   +Target: generate-live-build-manifest
  35. 10:09:33.233   +Target: check-gradle-bundle
  36. 10:09:33.233   +Target: setup-gradle-builds
  37. 10:09:33.233   +Target: build-input-zip
  38. 10:09:33.233   +Target: unzip-apk-template
  39. 10:09:33.233   +Target: find-main-application-icons
  40. 10:09:33.233   +Target: find-main-application-banner
  41. 10:09:33.233   +Target: find-ouya-application-icon
  42. 10:09:33.233   +Target: find-ouya-xiaomi-application-icon
  43. 10:09:33.233   +Target: find-default-notification-icons
  44. 10:09:33.233   +Target: copy-file
  45. 10:09:33.233   +Target: can-copy-file
  46. 10:09:33.233   +Target: delete-file
  47. 10:09:33.233   +Target: can-delete-file
  48. 10:09:33.233   +Target: insert-main-application-icons
  49. 10:09:33.233   +Target: insert-main-application-banner
  50. 10:09:33.233   +Target: insert-ouya-application-icon
  51. 10:09:33.233   +Target: insert-ouya-xiaomi-application-icon
  52. 10:09:33.233   +Target: insert-default-notification-icons
  53. 10:09:33.233   +Target: insert-assets-multi-icon
  54. 10:09:33.233   +Target: copy-apk-assets
  55. 10:09:33.233   +Target: copy-files-to-apk
  56. 10:09:33.233   +Target: sign-apk
  57. 10:09:33.233   +Target: sign-apk-md5
  58. 10:09:33.233   +Target: sign-apk-sha1
  59. 10:09:33.233   +Target: sign-apk-auto
  60. 10:09:33.233   +Target: build-unsigned-apk
  61. 10:09:33.233   +Target: build-signed-apk
  62. 10:09:33.233   +Target: build-expansion-file
  63. 10:09:33.233   +Target: copy-apk-to
  64. 10:09:33.233   +Target: copy-to
  65. 10:09:33.233   +Target: build
  66. 10:09:33.233   +Target: test-sign
  67. 10:09:33.233  Adding reference: ant.LocalProperties
  68. 10:09:33.233  parsing buildfile jar:file:/C:/Program%20Files%20(x86)/Corona%20Labs/Corona/Resources/ant.jar!/org/apache/tools/ant/antlib.xml with URI = jar:file:/C:/Program%20Files%20(x86)/Corona%20Labs/Corona/Resources/ant.jar!/org/apache/tools/ant/antlib.xml from a zip file
  69. 10:09:33.233   [property] Loading C:\Program Files (x86)\Corona Labs\Corona\Resources\build.properties
  70. 10:09:33.233  Setting project property: ANDROID_ROOT -> /usr/local/bin/android-sdk-mac_x86
  71. 10:09:33.233  Setting project property: ANDROID_API_VERSION -> android-8
  72. 10:09:33.233  Setting project property: USER_ACTIVITY_PATH -> com/ansca/test/analyticstest
  73. 10:09:33.233  Setting project property: ANDROID_VERSION -> android-8
  74. 10:09:33.233  Setting project property: USER_ACTIVITY_PACKAGE -> com.ansca.test.analyticstest
  75. 10:09:33.233  Setting project property: ANDROID_MIN_SDK_INTEGER_VERSION -> 8
  76. 10:09:33.233  Setting project property: CORONA_ROOT -> /Volumes/Ansca/code/main
  77. 10:09:33.233  Setting project property: USER_APP_DISPLAY_NAME -> analyticstest
  78. 10:09:33.233  Override ignored for property "SRC_DIR"
  79. 10:09:33.233  Setting project property: APK_APP_NAME -> MyCoronaActivity
  80. 10:09:33.233  Class org.apache.tools.ant.taskdefs.condition.Os loaded from parent loader (parentFirst)
  81. 10:09:33.233  Condition true; setting SCRIPT_EXT to exe
  82. 10:09:33.233  Setting project property: SCRIPT_EXT -> exe
  83. 10:09:33.233  Override ignored for property "SCRIPT_EXT"
  84. 10:09:33.233  Condition true; setting USE_OLD_TOUCH to true
  85. 10:09:33.233  Setting project property: USE_OLD_TOUCH -> true
  86. 10:09:33.233  Condition true; setting onWindows to true
  87. 10:09:33.233  Setting project property: onWindows -> true
  88. 10:09:33.233  Class org.apache.tools.ant.taskdefs.condition.Equals loaded from parent loader (parentFirst)
  89. 10:09:33.233  Condition false; not setting live.build
  90. 10:09:33.233  Adding reference: asset.fileset
  91. 10:09:33.233  [available] Found: C:\Program Files (x86)\Corona Labs\Corona\Native\Corona\android
  92. 10:09:33.233  Condition true; setting corona.native.android to C:\Program Files (x86)\Corona Labs\Corona\Resources/../Native/Corona/android
  93. 10:09:33.233  Setting project property: corona.native.android -> C:\Program Files (x86)\Corona Labs\Corona\Resources/../Native/Corona/android
  94. 10:09:33.233  [available] Unable to find C:\Program Files (x86)\Native\Corona\android
  95. 10:09:33.233  Condition false; not setting corona.native.android
  96. 10:09:33.233  [available] Unable to find ..\..\..\..\..\android
  97. 10:09:33.233  Condition false; not setting corona.native.android
  98. 10:09:33.233  [available] Unable to find C:\Users\Hariton\Library\Application Support\Corona\Native\Corona\android
  99. 10:09:33.233  Condition false; not setting corona.native.android
  100. 10:09:33.233   +Datatype copy-res-file org.apache.tools.ant.taskdefs.MacroInstance
  101. 10:09:33.233   [macrodef] creating macro  copy-res-file
  102. 10:09:33.233   +Datatype copy-drawable-file org.apache.tools.ant.taskdefs.MacroInstance
  103. 10:09:33.233   [macrodef] creating macro  copy-drawable-file
  104. 10:09:33.233   +Datatype copy-mipmap-file org.apache.tools.ant.taskdefs.MacroInstance
  105. 10:09:33.233   [macrodef] creating macro  copy-mipmap-file
  106. 10:09:33.233   +Datatype copy-notification-icon org.apache.tools.ant.taskdefs.MacroInstance
  107. 10:09:33.233   [macrodef] creating macro  copy-notification-icon
  108. 10:09:33.233  Setting ro project property: ant.project.invoked-targets -> build-input-zip
  109. 10:09:33.233  Attempting to create object of type org.apache.tools.ant.helper.DefaultExecutor
  110. 10:09:33.233  Adding reference: ant.executor
  111. 10:09:33.233  Build sequence for target(s) `build-input-zip' is [generate-live-build-manifest, check-gradle-bundle, setup-gradle-builds, build-input-zip]
  112. 10:09:33.233  Complete build sequence is [generate-live-build-manifest, check-gradle-bundle, setup-gradle-builds, build-input-zip, can-delete-file, unzip-apk-template, build-unsigned-apk, sign-apk-md5, sign-apk-sha1, can-copy-file, build-signed-apk, copy-files-to-apk, copy-apk-assets, test-sign, find-ouya-xiaomi-application-icon, insert-ouya-xiaomi-application-icon, copy-apk-to, sign-apk-auto, sign-apk, find-main-application-banner, insert-main-application-banner, find-main-application-icons, insert-main-application-icons, find-default-notification-icons, insert-default-notification-icons, insert-assets-multi-icon, build-expansion-file, copy-to, build, find-ouya-application-icon, insert-ouya-application-icon, copy-file, , delete-file]
  113. 10:09:33.233  
  114. 10:09:33.233  generate-live-build-manifest:
  115. 10:09:33.233  Skipped because property 'live.build' not set.
  116. 10:09:33.233  
  117. 10:09:33.233  check-gradle-bundle:
  118. 10:09:33.233  [available] Found: C:\Program Files (x86)\Corona Labs\Corona\Native\Corona\android\resource\android-template.zip
  119. 10:09:33.233  Setting project property: gradle.bundle.exists -> true
  120. 10:09:33.233  
  121. 10:09:33.233  setup-gradle-builds:
  122. 10:09:33.233      [unzip] Expanding: C:\Program Files (x86)\Corona Labs\Corona\Native\Corona\android\resource\android-template.zip into C:\Users\Hariton\AppData\Local\Temp\Corona Labs\CLtmpa09944
  123. 10:09:33.233      [unzip] extracting template/gradlew.bat
  124. 10:09:33.233      [unzip] expanding template/gradlew.bat to C:\Users\Hariton\AppData\Local\Temp\Corona Labs\CLtmpa09944\template\gradlew.bat
  125. 10:09:33.233      [unzip] extracting template/setup.sh
  126. 10:09:33.233      [unzip] expanding template/setup.sh to C:\Users\Hariton\AppData\Local\Temp\Corona Labs\CLtmpa09944\template\setup.sh
  127. 10:09:33.233      [unzip] extracting template/gradle.properties
  128. 10:09:33.233      [unzip] expanding template/gradle.properties to C:\Users\Hariton\AppData\Local\Temp\Corona Labs\CLtmpa09944\template\gradle.properties
  129. 10:09:33.233      [unzip] extracting template/app/
  130. 10:09:33.233      [unzip] expanding template/app/ to C:\Users\Hariton\AppData\Local\Temp\Corona Labs\CLtmpa09944\template\app
  131. 10:09:33.233      [unzip] extracting template/app/build.gradle.kts
  132. 10:09:33.233      [unzip] expanding template/app/build.gradle.kts to C:\Users\Hariton\AppData\Local\Temp\Corona Labs\CLtmpa09944\template\app\build.gradle.kts
  133. 10:09:33.233      [unzip] extracting template/gradle/wrapper/gradle-wrapper.properties
  134. 10:09:33.233      [unzip] expanding template/gradle/wrapper/gradle-wrapper.properties to C:\Users\Hariton\AppData\Local\Temp\Corona Labs\CLtmpa09944\template\gradle\wrapper\gradle-wrapper.properties
  135. 10:09:33.233      [unzip] extracting template/app/src/main/
  136. 10:09:33.233      [unzip] expanding template/app/src/main/ to C:\Users\Hariton\AppData\Local\Temp\Corona Labs\CLtmpa09944\template\app\src\main
  137. 10:09:33.233      [unzip] extracting sdk/licenses/android-sdk-license
  138. 10:09:33.233      [unzip] expanding sdk/licenses/android-sdk-license to C:\Users\Hariton\AppData\Local\Temp\Corona Labs\CLtmpa09944\sdk\licenses\android-sdk-license
  139. 10:09:33.233      [unzip] extracting template/app/buildTools/strings.xml
  140. 10:09:33.233      [unzip] expanding template/app/buildTools/strings.xml to C:\Users\Hariton\AppData\Local\Temp\Corona Labs\CLtmpa09944\template\app\buildTools\strings.xml
  141. 10:09:33.233      [unzip] extracting template/app/_corona_splash_screen.png
  142. 10:09:33.233      [unzip] expanding template/app/_corona_splash_screen.png to C:\Users\Hariton\AppData\Local\Temp\Corona Labs\CLtmpa09944\template\app\_corona_splash_screen.png
  143. 10:09:33.233      [unzip] extracting template/app/src/main/res/values/
  144. 10:09:33.233      [unzip] expanding template/app/src/main/res/values/ to C:\Users\Hariton\AppData\Local\Temp\Corona Labs\CLtmpa09944\template\app\src\main\res\values
  145. 10:09:33.233      [unzip] extracting template/
  146. 10:09:33.233      [unzip] expanding template/ to C:\Users\Hariton\AppData\Local\Temp\Corona Labs\CLtmpa09944\template
  147. 10:09:33.233      [unzip] extracting sdk/
  148. 10:09:33.233      [unzip] expanding sdk/ to C:\Users\Hariton\AppData\Local\Temp\Corona Labs\CLtmpa09944\sdk
  149. 10:09:33.233      [unzip] extracting template/gradlew
  150. 10:09:33.233      [unzip] expanding template/gradlew to C:\Users\Hariton\AppData\Local\Temp\Corona Labs\CLtmpa09944\template\gradlew
  151. 10:09:33.233      [unzip] extracting template/app/proguard-rules.pro
  152. 10:09:33.233      [unzip] expanding template/app/proguard-rules.pro to C:\Users\Hariton\AppData\Local\Temp\Corona Labs\CLtmpa09944\template\app\proguard-rules.pro
  153. 10:09:33.233      [unzip] extracting template/app/buildTools/update_manifest.lua
  154. 10:09:33.233      [unzip] expanding template/app/buildTools/update_manifest.lua to C:\Users\Hariton\AppData\Local\Temp\Corona Labs\CLtmpa09944\template\app\buildTools\update_manifest.lua
  155. 10:09:33.233      [unzip] extracting template/app/buildTools/convert_metadata.lua
  156. 10:09:33.243      [unzip] expanding template/app/buildTools/convert_metadata.lua to C:\Users\Hariton\AppData\Local\Temp\Corona Labs\CLtmpa09944\template\app\buildTools\convert_metadata.lua
  157. 10:09:33.243      [unzip] extracting template/app/src/main/res/
  158. 10:09:33.243      [unzip] expanding template/app/src/main/res/ to C:\Users\Hariton\AppData\Local\Temp\Corona Labs\CLtmpa09944\template\app\src\main\res
  159. 10:09:33.243      [unzip] extracting template/gradle/wrapper/
  160. 10:09:33.243      [unzip] expanding template/gradle/wrapper/ to C:\Users\Hariton\AppData\Local\Temp\Corona Labs\CLtmpa09944\template\gradle\wrapper
  161. 10:09:33.243      [unzip] extracting template/gradle/wrapper/gradle-wrapper.jar
  162. 10:09:33.243      [unzip] expanding template/gradle/wrapper/gradle-wrapper.jar to C:\Users\Hariton\AppData\Local\Temp\Corona Labs\CLtmpa09944\template\gradle\wrapper\gradle-wrapper.jar
  163. 10:09:33.243      [unzip] extracting template/settings.gradle.kts
  164. 10:09:33.243      [unzip] expanding template/settings.gradle.kts to C:\Users\Hariton\AppData\Local\Temp\Corona Labs\CLtmpa09944\template\settings.gradle.kts
  165. 10:09:33.243      [unzip] extracting template/app/src/
  166. 10:09:33.243      [unzip] expanding template/app/src/ to C:\Users\Hariton\AppData\Local\Temp\Corona Labs\CLtmpa09944\template\app\src
  167. 10:09:33.243      [unzip] extracting template/gradle/
  168. 10:09:33.243      [unzip] expanding template/gradle/ to C:\Users\Hariton\AppData\Local\Temp\Corona Labs\CLtmpa09944\template\gradle
  169. 10:09:33.243      [unzip] extracting template/app/src/main/res/values/strings.xml
  170. 10:09:33.243      [unzip] expanding template/app/src/main/res/values/strings.xml to C:\Users\Hariton\AppData\Local\Temp\Corona Labs\CLtmpa09944\template\app\src\main\res\values\strings.xml
  171. 10:09:33.243      [unzip] extracting template/app/buildTools/
  172. 10:09:33.243      [unzip] expanding template/app/buildTools/ to C:\Users\Hariton\AppData\Local\Temp\Corona Labs\CLtmpa09944\template\app\buildTools
  173. 10:09:33.243      [unzip] extracting template/build.gradle.kts
  174. 10:09:33.243      [unzip] expanding template/build.gradle.kts to C:\Users\Hariton\AppData\Local\Temp\Corona Labs\CLtmpa09944\template\build.gradle.kts
  175. 10:09:33.243      [unzip] extracting template/app/libs/licensing-google.jar
  176. 10:09:33.243      [unzip] expanding template/app/libs/licensing-google.jar to C:\Users\Hariton\AppData\Local\Temp\Corona Labs\CLtmpa09944\template\app\libs\licensing-google.jar
  177. 10:09:33.243      [unzip] extracting template/app/buildTools/AndroidManifest.template.xml
  178. 10:09:33.243      [unzip] expanding template/app/buildTools/AndroidManifest.template.xml to C:\Users\Hariton\AppData\Local\Temp\Corona Labs\CLtmpa09944\template\app\buildTools\AndroidManifest.template.xml
  179. 10:09:33.243      [unzip] extracting template/app/libs/
  180. 10:09:33.243      [unzip] expanding template/app/libs/ to C:\Users\Hariton\AppData\Local\Temp\Corona Labs\CLtmpa09944\template\app\libs
  181. 10:09:33.243      [unzip] extracting sdk/licenses/
  182. 10:09:33.243      [unzip] expanding sdk/licenses/ to C:\Users\Hariton\AppData\Local\Temp\Corona Labs\CLtmpa09944\sdk\licenses
  183. 10:09:33.243      [unzip] extracting template/setup.bat
  184. 10:09:33.243      [unzip] expanding template/setup.bat to C:\Users\Hariton\AppData\Local\Temp\Corona Labs\CLtmpa09944\template\setup.bat
  185. 10:09:33.243      [unzip] extracting template/app/src/main/AndroidManifest.xml
  186. 10:09:33.243      [unzip] expanding template/app/src/main/AndroidManifest.xml to C:\Users\Hariton\AppData\Local\Temp\Corona Labs\CLtmpa09944\template\app\src\main\AndroidManifest.xml
  187. 10:09:33.243      [unzip] expand complete
  188. 10:09:33.243  fileset: Setup scanner in dir C:\Program Files (x86)\Corona Labs\Corona\Native\Corona\android\lib\gradle with patternSet{ includes: [] excludes: [] }
  189. 10:09:33.243       [copy] Corona.aar added as Corona.aar doesn't exist.
  190. 10:09:33.243       [copy]  added as  is outdated.
  191. 10:09:33.243       [copy] Copying 1 file to C:\Users\Hariton\AppData\Local\Temp\Corona Labs\CLtmpa09944\template\app\libs
  192. 10:09:33.243       [copy] Copying C:\Program Files (x86)\Corona Labs\Corona\Native\Corona\android\lib\gradle\Corona.aar to C:\Users\Hariton\AppData\Local\Temp\Corona Labs\CLtmpa09944\template\app\libs\Corona.aar
  193. 10:09:33.243  
  194. 10:09:33.243  build-input-zip:
  195. 10:09:33.243  Setting project property: USER_ZIP -> C:\Users\Hariton\AppData\Local\Temp\Corona Labs\CLtmpa09944/input.zip
  196. 10:09:33.243  fileset: Setup scanner in dir C:\Users\Hariton\AppData\Local\Temp\Corona Labs\CLtmpa09944 with patternSet{ includes: [] excludes: [resource.car] }
  197. 10:09:33.243        [zip] Building zip: C:\Users\Hariton\AppData\Local\Temp\Corona Labs\CLtmpa09944\input.zip
  198. 10:09:33.243        [zip] adding directory sdk/
  199. 10:09:33.243        [zip] adding directory sdk/licenses/
  200. 10:09:33.243        [zip] adding directory template/
  201. 10:09:33.243        [zip] adding directory template/app/
  202. 10:09:33.243        [zip] adding directory template/app/buildTools/
  203. 10:09:33.243        [zip] adding directory template/app/libs/
  204. 10:09:33.243        [zip] adding directory template/app/src/
  205. 10:09:33.243        [zip] adding directory template/app/src/main/
  206. 10:09:33.243        [zip] adding directory template/app/src/main/res/
  207. 10:09:33.243        [zip] adding directory template/app/src/main/res/values/
  208. 10:09:33.243        [zip] adding directory template/gradle/
  209. 10:09:33.243        [zip] adding directory template/gradle/wrapper/
  210. 10:09:33.243        [zip] adding entry app.data.data_source.lu
  211. 10:09:33.243        [zip] adding entry app.data.my_api.lu
  212. 10:09:33.243        [zip] adding entry app.fragments.setup.setup.lu
  213. 10:09:33.243        [zip] adding entry app.fragments.setup.setup_view.lu
  214. 10:09:33.243        [zip] adding entry app.fragments.statistics.statistics.lu
  215. 10:09:33.243        [zip] adding entry app.fragments.statistics.statistics_view.lu
  216. 10:09:33.243        [zip] adding entry app.fragments.test_1.test_1.lu
  217. 10:09:33.243        [zip] adding entry app.fragments.test_1.test_1_view.lu
  218. 10:09:33.243        [zip] adding entry app.fragments.test_2.test_2.lu
  219. 10:09:33.253        [zip] adding entry app.fragments.test_2.test_2_view.lu
  220. 10:09:33.253        [zip] adding entry app.fragments.userinfo.userinfo.lu
  221. 10:09:33.253        [zip] adding entry app.fragments.userinfo.userinfo_view.lu
  222. 10:09:33.253        [zip] adding entry app.scenes.guids.guids.lu
  223. 10:09:33.253        [zip] adding entry app.scenes.guids.guids_view.lu
  224. 10:09:33.253        [zip] adding entry app.scenes.login.login.lu
  225. 10:09:33.253        [zip] adding entry app.scenes.login.login_view.lu
  226. 10:09:33.253        [zip] adding entry app.scenes.messages.messages.lu
  227. 10:09:33.253        [zip] adding entry app.scenes.messages.messages_view.lu
  228. 10:09:33.253        [zip] adding entry app.scenes.pay.pay.lu
  229. 10:09:33.253        [zip] adding entry app.scenes.pay.pay_view.lu
  230. 10:09:33.253        [zip] adding entry app.scenes.splash.old_splash.lu
  231. 10:09:33.253        [zip] adding entry app.scenes.splash.old_splash_view.lu
  232. 10:09:33.253        [zip] adding entry app.scenes.splash.splash.lu
  233. 10:09:33.253        [zip] adding entry app.scenes.splash.splash_view.lu
  234. 10:09:33.253        [zip] adding entry app.scenes.support.support.lu
  235. 10:09:33.253        [zip] adding entry app.scenes.support.support_view.lu
  236. 10:09:33.253        [zip] adding entry app.scenes.userinfo.userinfo.lu
  237. 10:09:33.253        [zip] adding entry app.scenes.userinfo.userinfo_view.lu
  238. 10:09:33.253        [zip] adding entry build.properties
  239. 10:09:33.253        [zip] adding entry config.lu
  240. 10:09:33.253        [zip] adding entry excludesfile.properties
  241. 10:09:33.253        [zip] adding entry main.lu
  242. 10:09:33.253        [zip] adding entry myapi.lu
  243. 10:09:33.253        [zip] adding entry scripts.convertcolor.lu
  244. 10:09:33.253        [zip] adding entry scripts.funx.lu
  245. 10:09:33.253        [zip] adding entry sdk/licenses/android-sdk-license
  246. 10:09:33.253        [zip] adding entry template/app/_corona_splash_screen.png
  247. 10:09:33.253        [zip] adding entry template/app/build.gradle.kts
  248. 10:09:33.253        [zip] adding entry template/app/buildTools/AndroidManifest.template.xml
  249. 10:09:33.253        [zip] adding entry template/app/buildTools/convert_metadata.lua
  250. 10:09:33.253        [zip] adding entry template/app/buildTools/strings.xml
  251. 10:09:33.253        [zip] adding entry template/app/buildTools/update_manifest.lua
  252. 10:09:33.253        [zip] adding entry template/app/libs/Corona.aar
  253. 10:09:33.253        [zip] adding entry template/app/libs/licensing-google.jar
  254. 10:09:33.253        [zip] adding entry template/app/proguard-rules.pro
  255. 10:09:33.253        [zip] adding entry template/app/src/main/AndroidManifest.xml
  256. 10:09:33.253        [zip] adding entry template/app/src/main/res/values/strings.xml
  257. 10:09:33.253        [zip] adding entry template/build.gradle.kts
  258. 10:09:33.253        [zip] adding entry template/gradle.properties
  259. 10:09:33.253        [zip] adding entry template/gradle/wrapper/gradle-wrapper.jar
  260. 10:09:33.253        [zip] adding entry template/gradle/wrapper/gradle-wrapper.properties
  261. 10:09:33.253        [zip] adding entry template/gradlew
  262. 10:09:33.253        [zip] adding entry template/gradlew.bat
  263. 10:09:33.253        [zip] adding entry template/settings.gradle.kts
  264. 10:09:33.253        [zip] adding entry template/setup.bat
  265. 10:09:33.253        [zip] adding entry template/setup.sh
  266. 10:09:33.253  Picked up JAVA_TOOL_OPTIONS: -Duser.language=en
  267. 10:09:33.253  
  268. 10:09:33.253  BUILD SUCCESSFUL
  269. 10:09:33.253  Total time: 2 seconds
  270. 10:09:33.253  DeviceBuildData: {"isLaunchPadActive":false,"targetCertType":"distribution","targetPlatformVersion":140300,"debugBuildProcess":5,"targetDevice":0,"splashScreen":{"enable":false},"dailyBuildRevision":3564,"buildBucket":"ansca-templates","clientPlatform":"Win","targetAppStore":"google","targetPlatform":1,"clientDeviceId":"454bf7af3900ec293b5c4d05246908f5","plugins":{"plugin.app_framework":{"publisherId":"maciej.czekala"},"plugin.notifications.v2":{"publisherId":"com.coronalabs"},"plugin.ui_framework":{"publisherId":"com.skyjoy"}},"dailyBuildYear":2019,"clientProductId":"basic","appName":"Мой EvpaNet"}
  271. 10:09:33.273  Build: running: cd /d "C:\Users\Hariton\AppData\Local\Temp\Corona Labs\CLtmpa09944" && cd template && setup.bat && gradlew.bat buildCoronaApp --no-daemon -PconfigureCoronaPlugins=YES -PcoronaBuild=2019.3564 -PcoronaResourcesDir="C:\Program Files (x86)\Corona Labs\Corona\Resources" -PcoronaDstDir="C:\Users\Hariton\Documents\Corona Built Apps" -PcoronaTmpDir="C:\Users\Hariton\AppData\Local\Temp\Corona Labs\CLtmpa09944" -PcoronaSrcDir="C:\Users\Hariton\Documents\Corona Projects\myEvpaNet" -PcoronaAppFileName="Мой EvpaNet" -PcoronaAppPackage="com.evpanet.app" -PcoronaVersionCode=102 -PcoronaVersionName="0.9.1" -PcoronaKeystore="C:\Users\Hariton\Documents\Corona Projects\myevpanet.keystore" -PcoronaKeystorePassword="XXXXXX" -PcoronaKeyAlias="evpanet" -PcoronaTargetStore="google" -PcoronaKeyAliasPassword="XXXXXX" -PcoronaBuildData="C:\Users\Hariton\AppData\Local\Temp\Corona Labs\CLtmpa09944\build.data" --console=plain
  272. 10:11:17.097  @ver > NUL
  273. 10:11:17.097  Exception in thread "DisconnectableInputStream source reader" org.gradle.api.UncheckedIOException: java.io.IOException:                  
  274. 10:11:17.097    at org.gradle.internal.UncheckedException.throwAsUncheckedException(UncheckedException.java:61)
  275. 10:11:17.097    at org.gradle.internal.UncheckedException.throwAsUncheckedException(UncheckedException.java:41)
  276. 10:11:17.097    at org.gradle.util.DisconnectableInputStream$1.run(DisconnectableInputStream.java:125)
  277. 10:11:17.097    at java.lang.Thread.run(Thread.java:748)
  278. 10:11:17.097  Caused by: java.io.IOException:                  
  279. 10:11:17.097    at java.io.FileInputStream.readBytes(Native Method)
  280. 10:11:17.097    at java.io.FileInputStream.read(FileInputStream.java:255)
  281. 10:11:17.097    at java.io.BufferedInputStream.fill(BufferedInputStream.java:246)
  282. 10:11:17.097    at java.io.BufferedInputStream.read1(BufferedInputStream.java:286)
  283. 10:11:17.097    at java.io.BufferedInputStream.read(BufferedInputStream.java:345)
  284. 10:11:17.097    at org.gradle.util.DisconnectableInputStream$1.run(DisconnectableInputStream.java:96)
  285. 10:11:17.097    ... 1 more
  286. 10:11:17.097  
  287. 10:11:17.097  FAILURE: Build failed with an exception.
  288. 10:11:17.097  
  289. 10:11:17.097  * What went wrong:
  290. 10:11:17.097  Could not determine the dependencies of task ':App:lintVitalRelease'.
  291. 10:11:17.097  > Could not resolve all artifacts for configuration ':App:debugCompileClasspath'.
  292. 10:11:17.097     > Could not find any matches for com.google.firebase:firebase-messaging:17.+ as no versions of com.google.firebase:firebase-messaging are available.
  293. 10:11:17.097       Required by:
  294. 10:11:17.097           project :App
  295. 10:11:17.097     > Could not find any matches for com.google.firebase:firebase-core:16.+ as no versions of com.google.firebase:firebase-core are available.
  296. 10:11:17.097       Required by:
  297. 10:11:17.097           project :App
  298. 10:11:17.097     > Could not find any matches for com.google.android.gms:play-services-base:16.+ as no versions of com.google.android.gms:play-services-base are available.
  299. 10:11:17.097       Required by:
  300. 10:11:17.097           project :App
  301. 10:11:17.097     > Could not find any matches for com.android.support:support-v4:28.0.+ as no versions of com.android.support:support-v4 are available.
  302. 10:11:17.097       Required by:
  303. 10:11:17.097           project :App
  304. 10:11:17.097     > Could not find any matches for com.android.support:support-fragment:28.0.+ as no versions of com.android.support:support-fragment are available.
  305. 10:11:17.097       Required by:
  306. 10:11:17.097           project :App
  307. 10:11:17.097     > Could not find any matches for com.android.support:support-core-ui:28.0.+ as no versions of com.android.support:support-core-ui are available.
  308. 10:11:17.097       Required by:
  309. 10:11:17.097           project :App
  310. 10:11:17.097     > Could not find any matches for com.android.support:support-core-utils:28.0.+ as no versions of com.android.support:support-core-utils are available.
  311. 10:11:17.097       Required by:
  312. 10:11:17.097           project :App
  313. 10:11:17.097     > Could not find any matches for com.android.support:support-media-compat:28.0.+ as no versions of com.android.support:support-media-compat are available.
  314. 10:11:17.097       Required by:
  315. 10:11:17.097           project :App
  316. 10:11:17.097     > Could not find any matches for com.android.support:support-compat:28.0.+ as no versions of com.android.support:support-compat are available.
  317. 10:11:17.097       Required by:
  318. 10:11:17.097           project :App
  319. 10:11:17.097  
  320. 10:11:17.097  * Try:
  321. 10:11:17.097  Run with --stacktrace option to get the stack trace. Run with --info or --debug option to get more log output. Run with --scan to get full insights.
  322. 10:11:17.097  
  323. 10:11:17.097  * Get more help at https://help.gradle.org
  324. 10:11:17.097  
  325. 10:11:17.097  BUILD FAILED in 1m 42s
  326. 10:11:17.097  Picked up JAVA_TOOL_OPTIONS: -Duser.language=en
  327. 10:11:17.299  Android build failed (1) after 107 seconds
RAW Paste Data
We use cookies for various purposes including analytics. By continuing to use Pastebin, you agree to our use of cookies as described in the Cookies Policy. OK, I Understand
Top