Herowaree

Error #2

Jul 28th, 2025
63
0
Never
Not a member of Pastebin yet? Sign Up, it unlocks many cool features!
text 0.87 KB | None | 0 0
  1. --- stderr: laser_msgs
  2. failed to create symbolic link '/home/thulioamorim/laser_uav_system_ws/build/laser_msgs/ament_cmake_python/laser_msgs/laser_msgs' because existing path cannot be removed: Is a directory
  3. gmake[2]: *** [CMakeFiles/ament_cmake_python_symlink_laser_msgs.dir/build.make:70: CMakeFiles/ament_cmake_python_symlink_laser_msgs] Error 1
  4. gmake[1]: *** [CMakeFiles/Makefile2:421: CMakeFiles/ament_cmake_python_symlink_laser_msgs.dir/all] Error 2
  5. gmake[1]: *** Waiting for unfinished jobs....
  6. gmake: *** [Makefile:146: all] Error 2
  7. ---
  8. Failed <<< laser_msgs [0.07s, exited with code 2]
  9. Aborted <<< laser_uav_simulation [0.06s]
  10. Aborted <<< px4_msgs [0.32s]
  11.  
  12. Summary: 0 packages finished [0.51s]
  13. 1 package failed: laser_msgs
  14. 2 packages aborted: laser_uav_simulation px4_msgs
  15. 2 packages had stderr output: laser_msgs px4_msgs
  16. 4 packages not processed
  17.  
Advertisement
Add Comment
Please, Sign In to add comment