Guest User

Untitled

a guest
Sep 3rd, 2019
17
Never
Not a member of Pastebin yet? Sign Up, it unlocks many cool features!
  1. moc /workdir/build/tmp/work/i586-poky-linux/qtbase/5.12.3+gitAUTOINC+b527725766-r0/git/tests/auto/dbus/qdbusinterface/tst_qdbusinterface.cpp
  2. moc /workdir/build/tmp/work/i586-poky-linux/qtbase/5.12.3+gitAUTOINC+b527725766-r0/git/tests/auto/dbus/qdbusinterface/myobject.h
  3. compiling /workdir/build/tmp/work/i586-poky-linux/qtbase/5.12.3+gitAUTOINC+b527725766-r0/git/tests/auto/dbus/qdbusinterface/tst_qdbusinterface.cpp
  4. {standard input}: Assembler messages:
  5. {standard input}:1078456: Warning: end of file in string; '"' inserted
  6. compiling .moc/moc_myobject.cpp
  7. linking ../tst_qdbusinterface
  8. make[5]: Leaving directory '/workdir/build/tmp/work/i586-poky-linux/qtbase/5.12.3+gitAUTOINC+b527725766-r0/build/tests/auto/dbus/qdbusinterface/qdbusinterface'
  9. make[4]: Leaving directory '/workdir/build/tmp/work/i586-poky-linux/qtbase/5.12.3+gitAUTOINC+b527725766-r0/build/tests/auto/dbus/qdbusinterface'
  10. cd qdbuslocalcalls/ && ( test -e Makefile || /workdir/build/tmp/work/i586-poky-linux/qtbase/5.12.3+gitAUTOINC+b527725766-r0/recipe-sysroot-native/usr/bin/qmake -o Makefile /workdir/build/tmp/work/i586-poky-linux/qtbase/5.12.3+gitAUTOINC+b527725766-r0/git/tests/auto/dbus/qdbuslocalcalls/qdbuslocalcalls.pro -qtconf /workdir/build/tmp/work/i586-poky-linux/qtbase/5.12.3+gitAUTOINC+b527725766-r0/build/bin/qt.conf ) && make -f Makefile
  11. make[4]: Entering directory '/workdir/build/tmp/work/i586-poky-linux/qtbase/5.12.3+gitAUTOINC+b527725766-r0/build/tests/auto/dbus/qdbuslocalcalls'
  12. generating .moc/moc_predefs.h
  13. moc /workdir/build/tmp/work/i586-poky-linux/qtbase/5.12.3+gitAUTOINC+b527725766-r0/git/tests/auto/dbus/qdbuslocalcalls/tst_qdbuslocalcalls.cpp
  14. compiling /workdir/build/tmp/work/i586-poky-linux/qtbase/5.12.3+gitAUTOINC+b527725766-r0/git/tests/auto/dbus/qdbuslocalcalls/tst_qdbuslocalcalls.cpp
  15. linking tst_qdbuslocalcalls
  16. make[4]: Leaving directory '/workdir/build/tmp/work/i586-poky-linux/qtbase/5.12.3+gitAUTOINC+b527725766-r0/build/tests/auto/dbus/qdbuslocalcalls'
  17. cd qdbusmetaobject/ && ( test -e Makefile || /workdir/build/tmp/work/i586-poky-linux/qtbase/5.12.3+gitAUTOINC+b527725766-r0/recipe-sysroot-native/usr/bin/qmake -o Makefile /workdir/build/tmp/work/i586-poky-linux/qtbase/5.12.3+gitAUTOINC+b527725766-r0/git/tests/auto/dbus/qdbusmetaobject/qdbusmetaobject.pro -qtconf /workdir/build/tmp/work/i586-poky-linux/qtbase/5.12.3+gitAUTOINC+b527725766-r0/build/bin/qt.conf ) && make -f Makefile
  18. make[4]: Entering directory '/workdir/build/tmp/work/i586-poky-linux/qtbase/5.12.3+gitAUTOINC+b527725766-r0/build/tests/auto/dbus/qdbusmetaobject'
  19. generating .moc/moc_predefs.h
  20. moc /workdir/build/tmp/work/i586-poky-linux/qtbase/5.12.3+gitAUTOINC+b527725766-r0/git/tests/auto/dbus/qdbusmetaobject/tst_qdbusmetaobject.cpp
  21. /workdir/build/tmp/work/i586-poky-linux/qtbase/5.12.3+gitAUTOINC+b527725766-r0/git/tests/auto/dbus/qdbusmetaobject/tst_qdbusmetaobject.cpp:644: Warning: Property declaration property has no READ accessor function or associated MEMBER variable. The property will be invalid.
  22. /workdir/build/tmp/work/i586-poky-linux/qtbase/5.12.3+gitAUTOINC+b527725766-r0/git/tests/auto/dbus/qdbusmetaobject/tst_qdbusmetaobject.cpp:655: Warning: Property declaration property has no READ accessor function or associated MEMBER variable. The property will be invalid.
  23. compiling /workdir/build/tmp/work/i586-poky-linux/qtbase/5.12.3+gitAUTOINC+b527725766-r0/git/tests/auto/dbus/qdbusmetaobject/tst_qdbusmetaobject.cpp
  24. i586-poky-linux-g++: fatal error: Killed signal terminated program cc1plus
  25. compilation terminated.
  26. Makefile:1689: recipe for target '.obj/tst_qmetatype.o' failed
  27. make[5]: *** [.obj/tst_qmetatype.o] Error 1
  28. make[5]: Leaving directory '/workdir/build/tmp/work/i586-poky-linux/qtbase/5.12.3+gitAUTOINC+b527725766-r0/build/tests/auto/corelib/kernel/qmetatype'
  29. Makefile:316: recipe for target 'sub-qmetatype-make_first' failed
  30. make[4]: *** [sub-qmetatype-make_first] Error 2
  31. make[4]: Leaving directory '/workdir/build/tmp/work/i586-poky-linux/qtbase/5.12.3+gitAUTOINC+b527725766-r0/build/tests/auto/corelib/kernel'
  32. Makefile:57: recipe for target 'sub-kernel-make_first' failed
  33. make[3]: *** [sub-kernel-make_first] Error 2
  34. make[3]: Leaving directory '/workdir/build/tmp/work/i586-poky-linux/qtbase/5.12.3+gitAUTOINC+b527725766-r0/build/tests/auto/corelib'
  35. Makefile:57: recipe for target 'sub-corelib-make_first' failed
  36. make[2]: *** [sub-corelib-make_first] Error 2
  37. make[2]: *** Waiting for unfinished jobs....
RAW Paste Data