Not a member of Pastebin yet?
Sign Up,
it unlocks many cool features!
- /mnt/Linux F/Invoke-/python311 master !1 ?2 makepkg -si ✔
- ==> Making package: python311 3.11.14-1 (Mon Nov 10 01:26:03 2025)
- ==> Checking runtime dependencies...
- ==> Checking buildtime dependencies...
- ==> Retrieving sources...
- -> Found Python-3.11.14.tar.xz
- -> Found EXTERNALLY-MANAGED
- ==> Validating source files with sha256sums...
- Python-3.11.14.tar.xz ... Passed
- EXTERNALLY-MANAGED ... Passed
- ==> Extracting sources...
- -> Extracting Python-3.11.14.tar.xz with bsdtar
- ==> Starting prepare()...
- ==> Removing existing $pkgdir/ directory...
- ==> Starting build()...
- checking build system type... x86_64-pc-linux-gnu
- checking host system type... x86_64-pc-linux-gnu
- checking for Python interpreter freezing... ./_bootstrap_python
- checking for python3.11... no
- checking for python3.10... no
- checking for python3.9... no
- checking for python3.8... no
- checking for python3.7... no
- checking for python3.6... no
- checking for python3... python3
- checking Python for regen version... Python 3.13.7
- checking for pkg-config... /usr/bin/pkg-config
- checking pkg-config is at least version 0.9.0... yes
- checking for --enable-universalsdk... no
- checking for --with-universal-archs... no
- checking MACHDEP... "linux"
- checking for gcc... gcc
- checking whether the C compiler works... yes
- checking for C compiler default output file name... a.out
- checking for suffix of executables...
- checking whether we are cross compiling... no
- checking for suffix of object files... o
- checking whether we are using the GNU C compiler... yes
- checking whether gcc accepts -g... yes
- checking for gcc option to accept ISO C89... none needed
- checking how to run the C preprocessor... gcc -E
- checking for grep that handles long lines and -e... /usr/bin/grep
- checking for a sed that does not truncate output... /usr/bin/sed
- checking for egrep... /usr/bin/grep -E
- checking for CC compiler name... gcc
- checking for ANSI C header files... yes
- checking for sys/types.h... yes
- checking for sys/stat.h... yes
- checking for stdlib.h... yes
- checking for string.h... yes
- checking for memory.h... yes
- checking for strings.h... yes
- checking for inttypes.h... yes
- checking for stdint.h... yes
- checking for unistd.h... yes
- checking minix/config.h usability... no
- checking minix/config.h presence... no
- checking for minix/config.h... no
- checking whether it is safe to define __EXTENSIONS__... yes
- checking for --with-cxx-main=<compiler>... no
- checking for g++... no
- configure:
- By default, distutils will build C++ extension modules with "g++".
- If this is not intended, then set CXX on the configure command line.
- checking for the platform triplet based on compiler characteristics... x86_64-linux-gnu
- checking for multiarch...
- checking for PEP 11 support tier... x86_64-pc-linux-gnu/gcc has tier 1 (supported)
- checking for -Wl,--no-as-needed... yes
- checking for the Android API level... not Android
- checking for --with-emscripten-target...
- checking for --enable-wasm-dynamic-linking... missing
- checking for --enable-wasm-pthreads... missing
- checking for --with-suffix...
- checking for case-insensitive build directory... no
- checking LIBRARY... libpython$(VERSION)$(ABIFLAGS).a
- checking LINKCC... $(PURIFY) $(MAINCC)
- checking EXPORTSYMS...
- checking for GNU ld... yes
- checking for --enable-shared... yes
- checking for --with-static-libpython... yes
- checking for --enable-profiling... no
- checking LDLIBRARY... checking HOSTRUNNER...
- libpython$(LDVERSION).so
- checking for ar... ar
- checking for readelf... readelf
- checking for a BSD-compatible install... /usr/bin/install -c
- checking for a thread-safe mkdir -p... /usr/bin/mkdir -p
- checking for --with-pydebug... no
- checking for --with-trace-refs... no
- checking for --enable-pystats... no
- checking for --with-assertions... no
- checking for --enable-optimizations... no
- checking PROFILE_TASK... -m test --pgo --timeout=$(TESTTIMEOUT)
- checking for --with-lto... no
- checking for llvm-profdata... no
- checking if gcc supports -Og optimization level... yes
- checking if we can add -Wextra... no
- checking whether gcc -fno-strict-aliasing accepts and needs -fno-strict-aliasing... no
- checking if we can disable gcc unused-parameter warning... no
- checking if we can disable gcc int-conversion warning... no
- checking if we can disable gcc missing-field-initializers warning... no
- checking if we can enable gcc sign-compare warning... no
- checking if we can enable gcc unreachable-code warning... no
- checking if we can enable gcc strict-prototypes warning... no
- checking if we can make implicit function declaration an error in gcc -Werror=implicit-function-declaration... yes
- checking if we can use visibility in gcc -fvisibility=hidden... yes
- checking whether pthreads are available without options... yes
- checking whether g++ also accepts flags for thread support... no
- checking alloca.h usability... yes
- checking alloca.h presence... yes
- checking for alloca.h... yes
- checking asm/types.h usability... yes
- checking asm/types.h presence... yes
- checking for asm/types.h... yes
- checking bluetooth.h usability... no
- checking bluetooth.h presence... no
- checking for bluetooth.h... no
- checking conio.h usability... no
- checking conio.h presence... no
- checking for conio.h... no
- checking crypt.h usability... yes
- checking crypt.h presence... yes
- checking for crypt.h... yes
- checking direct.h usability... no
- checking direct.h presence... no
- checking for direct.h... no
- checking dlfcn.h usability... yes
- checking dlfcn.h presence... yes
- checking for dlfcn.h... yes
- checking endian.h usability... yes
- checking endian.h presence... yes
- checking for endian.h... yes
- checking errno.h usability... yes
- checking errno.h presence... yes
- checking for errno.h... yes
- checking fcntl.h usability... yes
- checking fcntl.h presence... yes
- checking for fcntl.h... yes
- checking grp.h usability... yes
- checking grp.h presence... yes
- checking for grp.h... yes
- checking ieeefp.h usability... no
- checking ieeefp.h presence... no
- checking for ieeefp.h... no
- checking io.h usability... no
- checking io.h presence... no
- checking for io.h... no
- checking langinfo.h usability... yes
- checking langinfo.h presence... yes
- checking for langinfo.h... yes
- checking libintl.h usability... yes
- checking libintl.h presence... yes
- checking for libintl.h... yes
- checking libutil.h usability... no
- checking libutil.h presence... no
- checking for libutil.h... no
- checking linux/auxvec.h usability... yes
- checking linux/auxvec.h presence... yes
- checking for linux/auxvec.h... yes
- checking sys/auxv.h usability... yes
- checking sys/auxv.h presence... yes
- checking for sys/auxv.h... yes
- checking linux/limits.h usability... yes
- checking linux/limits.h presence... yes
- checking for linux/limits.h... yes
- checking linux/memfd.h usability... yes
- checking linux/memfd.h presence... yes
- checking for linux/memfd.h... yes
- checking linux/random.h usability... yes
- checking linux/random.h presence... yes
- checking for linux/random.h... yes
- checking linux/soundcard.h usability... yes
- checking linux/soundcard.h presence... yes
- checking for linux/soundcard.h... yes
- checking linux/tipc.h usability... yes
- checking linux/tipc.h presence... yes
- checking for linux/tipc.h... yes
- checking linux/wait.h usability... yes
- checking linux/wait.h presence... yes
- checking for linux/wait.h... yes
- checking netdb.h usability... yes
- checking netdb.h presence... yes
- checking for netdb.h... yes
- checking netinet/in.h usability... yes
- checking netinet/in.h presence... yes
- checking for netinet/in.h... yes
- checking netpacket/packet.h usability... yes
- checking netpacket/packet.h presence... yes
- checking for netpacket/packet.h... yes
- checking poll.h usability... yes
- checking poll.h presence... yes
- checking for poll.h... yes
- checking process.h usability... no
- checking process.h presence... no
- checking for process.h... no
- checking pthread.h usability... yes
- checking pthread.h presence... yes
- checking for pthread.h... yes
- checking pty.h usability... yes
- checking pty.h presence... yes
- checking for pty.h... yes
- checking sched.h usability... yes
- checking sched.h presence... yes
- checking for sched.h... yes
- checking setjmp.h usability... yes
- checking setjmp.h presence... yes
- checking for setjmp.h... yes
- checking shadow.h usability... yes
- checking shadow.h presence... yes
- checking for shadow.h... yes
- checking signal.h usability... yes
- checking signal.h presence... yes
- checking for signal.h... yes
- checking spawn.h usability... yes
- checking spawn.h presence... yes
- checking for spawn.h... yes
- checking stropts.h usability... no
- checking stropts.h presence... no
- checking for stropts.h... no
- checking sys/audioio.h usability... no
- checking sys/audioio.h presence... no
- checking for sys/audioio.h... no
- checking sys/bsdtty.h usability... no
- checking sys/bsdtty.h presence... no
- checking for sys/bsdtty.h... no
- checking sys/devpoll.h usability... no
- checking sys/devpoll.h presence... no
- checking for sys/devpoll.h... no
- checking sys/endian.h usability... no
- checking sys/endian.h presence... no
- checking for sys/endian.h... no
- checking sys/epoll.h usability... yes
- checking sys/epoll.h presence... yes
- checking for sys/epoll.h... yes
- checking sys/event.h usability... no
- checking sys/event.h presence... no
- checking for sys/event.h... no
- checking sys/eventfd.h usability... yes
- checking sys/eventfd.h presence... yes
- checking for sys/eventfd.h... yes
- checking sys/file.h usability... yes
- checking sys/file.h presence... yes
- checking for sys/file.h... yes
- checking sys/ioctl.h usability... yes
- checking sys/ioctl.h presence... yes
- checking for sys/ioctl.h... yes
- checking sys/kern_control.h usability... no
- checking sys/kern_control.h presence... no
- checking for sys/kern_control.h... no
- checking sys/loadavg.h usability... no
- checking sys/loadavg.h presence... no
- checking for sys/loadavg.h... no
- checking sys/lock.h usability... no
- checking sys/lock.h presence... no
- checking for sys/lock.h... no
- checking sys/memfd.h usability... no
- checking sys/memfd.h presence... no
- checking for sys/memfd.h... no
- checking sys/mkdev.h usability... no
- checking sys/mkdev.h presence... no
- checking for sys/mkdev.h... no
- checking sys/mman.h usability... yes
- checking sys/mman.h presence... yes
- checking for sys/mman.h... yes
- checking sys/modem.h usability... no
- checking sys/modem.h presence... no
- checking for sys/modem.h... no
- checking sys/param.h usability... yes
- checking sys/param.h presence... yes
- checking for sys/param.h... yes
- checking sys/poll.h usability... yes
- checking sys/poll.h presence... yes
- checking for sys/poll.h... yes
- checking sys/random.h usability... yes
- checking sys/random.h presence... yes
- checking for sys/random.h... yes
- checking sys/resource.h usability... yes
- checking sys/resource.h presence... yes
- checking for sys/resource.h... yes
- checking sys/select.h usability... yes
- checking sys/select.h presence... yes
- checking for sys/select.h... yes
- checking sys/sendfile.h usability... yes
- checking sys/sendfile.h presence... yes
- checking for sys/sendfile.h... yes
- checking sys/socket.h usability... yes
- checking sys/socket.h presence... yes
- checking for sys/socket.h... yes
- checking sys/soundcard.h usability... yes
- checking sys/soundcard.h presence... yes
- checking for sys/soundcard.h... yes
- checking for sys/stat.h... (cached) yes
- checking sys/statvfs.h usability... yes
- checking sys/statvfs.h presence... yes
- checking for sys/statvfs.h... yes
- checking sys/sys_domain.h usability... no
- checking sys/sys_domain.h presence... no
- checking for sys/sys_domain.h... no
- checking sys/syscall.h usability... yes
- checking sys/syscall.h presence... yes
- checking for sys/syscall.h... yes
- checking sys/sysmacros.h usability... yes
- checking sys/sysmacros.h presence... yes
- checking for sys/sysmacros.h... yes
- checking sys/termio.h usability... no
- checking sys/termio.h presence... no
- checking for sys/termio.h... no
- checking sys/time.h usability... yes
- checking sys/time.h presence... yes
- checking for sys/time.h... yes
- checking sys/times.h usability... yes
- checking sys/times.h presence... yes
- checking for sys/times.h... yes
- checking for sys/types.h... (cached) yes
- checking sys/uio.h usability... yes
- checking sys/uio.h presence... yes
- checking for sys/uio.h... yes
- checking sys/un.h usability... yes
- checking sys/un.h presence... yes
- checking for sys/un.h... yes
- checking sys/utsname.h usability... yes
- checking sys/utsname.h presence... yes
- checking for sys/utsname.h... yes
- checking sys/wait.h usability... yes
- checking sys/wait.h presence... yes
- checking for sys/wait.h... yes
- checking sys/xattr.h usability... yes
- checking sys/xattr.h presence... yes
- checking for sys/xattr.h... yes
- checking sysexits.h usability... yes
- checking sysexits.h presence... yes
- checking for sysexits.h... yes
- checking syslog.h usability... yes
- checking syslog.h presence... yes
- checking for syslog.h... yes
- checking termios.h usability... yes
- checking termios.h presence... yes
- checking for termios.h... yes
- checking util.h usability... no
- checking util.h presence... no
- checking for util.h... no
- checking utime.h usability... yes
- checking utime.h presence... yes
- checking for utime.h... yes
- checking utmp.h usability... yes
- checking utmp.h presence... yes
- checking for utmp.h... yes
- checking for dirent.h that defines DIR... yes
- checking for library containing opendir... none required
- checking whether sys/types.h defines makedev... no
- checking for sys/mkdev.h... (cached) no
- checking for sys/sysmacros.h... (cached) yes
- checking bluetooth/bluetooth.h usability... yes
- checking bluetooth/bluetooth.h presence... yes
- checking for bluetooth/bluetooth.h... yes
- checking for net/if.h... yes
- checking for linux/netlink.h... yes
- checking for linux/qrtr.h... yes
- checking for linux/vm_sockets.h... yes
- checking for linux/can.h... yes
- checking for linux/can/bcm.h... yes
- checking for linux/can/j1939.h... yes
- checking for linux/can/raw.h... yes
- checking for netcan/can.h... no
- checking for clock_t in time.h... yes
- checking for makedev... yes
- checking for le64toh... yes
- checking for mode_t... yes
- checking for off_t... yes
- checking for pid_t... yes
- checking for size_t... yes
- checking for uid_t in sys/types.h... yes
- checking for ssize_t... yes
- checking for __uint128_t... yes
- checking size of int... 4
- checking size of long... 8
- checking alignment of long... 8
- checking size of long long... 8
- checking size of void *... 8
- checking size of short... 2
- checking size of float... 4
- checking size of double... 8
- checking size of fpos_t... 16
- checking size of size_t... 8
- checking alignment of size_t... 8
- checking size of pid_t... 4
- checking size of uintptr_t... 8
- checking for long double... yes
- checking size of long double... 16
- checking size of _Bool... 1
- checking size of off_t... 8
- checking whether to enable large file support... no
- checking size of time_t... 8
- checking for pthread_t... yes
- checking size of pthread_t... 8
- checking size of pthread_key_t... 4
- checking whether pthread_key_t is compatible with int... yes
- checking for --enable-framework... no
- checking for dyld... no
- checking for --with-address-sanitizer... no
- checking for --with-memory-sanitizer... no
- checking for --with-undefined-behavior-sanitizer... no
- checking the extension of shared libraries... .so
- checking LDSHARED... $(CC) -shared
- checking BLDSHARED flags... $(CC) -shared
- checking CCSHARED... -fPIC
- checking LINKFORSHARED... -Xlinker -export-dynamic
- checking CFLAGSFORSHARED... $(CCSHARED)
- checking SHLIBS... $(LIBS)
- checking for sendfile in -lsendfile... no
- checking for dlopen in -ldl... yes
- checking for shl_load in -ldld... no
- checking uuid.h usability... no
- checking uuid.h presence... no
- checking for uuid.h... no
- checking for LIBUUID... yes
- checking for library containing sem_init... none required
- checking for textdomain in -lintl... no
- checking aligned memory access is required... no
- checking for --with-hash-algorithm... default
- checking for --with-tzpath... "/usr/share/zoneinfo"
- checking for t_open in -lnsl... no
- checking for socket in -lsocket... no
- checking for --with-libs... no
- checking for --with-system-expat... yes
- checking for --with-system-ffi... yes
- checking for --with-system-libmpdec... yes
- checking for --with-decimal-contextvar... yes
- checking for decimal libmpdec machine... uint128
- checking for LIBNSL... yes
- checking rpc/rpc.h usability... yes
- checking rpc/rpc.h presence... yes
- checking for rpc/rpc.h... yes
- checking for LIBSQLITE3... yes
- checking sqlite3.h usability... yes
- checking sqlite3.h presence... yes
- checking for sqlite3.h... yes
- checking for sqlite3_bind_double in -lsqlite3... yes
- checking for sqlite3_column_decltype in -lsqlite3... yes
- checking for sqlite3_column_double in -lsqlite3... yes
- checking for sqlite3_complete in -lsqlite3... yes
- checking for sqlite3_enable_shared_cache in -lsqlite3... yes
- checking for sqlite3_progress_handler in -lsqlite3... yes
- checking for sqlite3_result_double in -lsqlite3... yes
- checking for sqlite3_set_authorizer in -lsqlite3... yes
- checking for sqlite3_trace_v2 in -lsqlite3... yes
- checking for sqlite3_value_double in -lsqlite3... yes
- checking for sqlite3_load_extension in -lsqlite3... yes
- checking for sqlite3_serialize in -lsqlite3... yes
- checking for --enable-loadable-sqlite-extensions... yes
- checking for TCLTK... yes
- checking gdbm.h usability... yes
- checking gdbm.h presence... yes
- checking for gdbm.h... yes
- checking for gdbm_open in -lgdbm... yes
- checking ndbm.h usability... yes
- checking ndbm.h presence... yes
- checking for ndbm.h... yes
- checking for dbm_open in -lndbm... no
- checking for dbm_open in -lgdbm_compat... yes
- checking gdbm/ndbm.h usability... no
- checking gdbm/ndbm.h presence... no
- checking for gdbm/ndbm.h... no
- checking gdbm-ndbm.h usability... no
- checking gdbm-ndbm.h presence... no
- checking for gdbm-ndbm.h... no
- checking db.h usability... no
- checking db.h presence... no
- checking for db.h... no
- checking for --with-dbmliborder... gdbm:ndbm
- checking if PTHREAD_SCOPE_SYSTEM is supported... yes
- checking for pthread_sigmask... yes
- checking for pthread_getcpuclockid... yes
- checking if --enable-ipv6 is specified... yes
- checking ipv6 stack type... linux-glibc
- checking CAN_RAW_FD_FRAMES... yes
- checking for CAN_RAW_JOIN_FILTERS... yes
- checking for --with-doc-strings... yes
- checking for --with-pymalloc... yes
- checking for --with-freelists... yes
- checking for --with-c-locale-coercion... yes
- checking for --with-valgrind... no
- checking for --with-dtrace... no
- checking for dlopen... yes
- checking DYNLOADFILE... dynload_shlib.o
- checking MACHDEP_OBJS... none
- checking for accept4... yes
- checking for alarm... yes
- checking for bind_textdomain_codeset... yes
- checking for chmod... yes
- checking for chown... yes
- checking for clock... yes
- checking for close_range... yes
- checking for confstr... yes
- checking for copy_file_range... yes
- checking for ctermid... yes
- checking for dup... yes
- checking for dup3... yes
- checking for execv... yes
- checking for explicit_bzero... yes
- checking for explicit_memset... no
- checking for faccessat... yes
- checking for fchmod... yes
- checking for fchmodat... yes
- checking for fchown... yes
- checking for fchownat... yes
- checking for fdopendir... yes
- checking for fdwalk... no
- checking for fexecve... yes
- checking for fork... yes
- checking for fork1... no
- checking for fpathconf... yes
- checking for fstatat... yes
- checking for ftime... yes
- checking for ftruncate... yes
- checking for futimens... yes
- checking for futimes... yes
- checking for futimesat... yes
- checking for gai_strerror... yes
- checking for getegid... yes
- checking for getentropy... yes
- checking for geteuid... yes
- checking for getgid... yes
- checking for getgrgid... yes
- checking for getgrgid_r... yes
- checking for getgrnam_r... yes
- checking for getgrouplist... yes
- checking for getgroups... yes
- checking for gethostname... yes
- checking for getitimer... yes
- checking for getloadavg... yes
- checking for getlogin... yes
- checking for getpeername... yes
- checking for getpgid... yes
- checking for getpid... yes
- checking for getppid... yes
- checking for getpriority... yes
- checking for _getpty... no
- checking for getpwent... yes
- checking for getpwnam_r... yes
- checking for getpwuid... yes
- checking for getpwuid_r... yes
- checking for getresgid... yes
- checking for getresuid... yes
- checking for getrusage... yes
- checking for getsid... yes
- checking for getspent... yes
- checking for getspnam... yes
- checking for getuid... yes
- checking for getwd... yes
- checking for if_nameindex... yes
- checking for initgroups... yes
- checking for kill... yes
- checking for killpg... yes
- checking for lchown... yes
- checking for linkat... yes
- checking for lockf... yes
- checking for lstat... yes
- checking for lutimes... yes
- checking for madvise... yes
- checking for mbrtowc... yes
- checking for memrchr... yes
- checking for mkdirat... yes
- checking for mkfifo... yes
- checking for mkfifoat... yes
- checking for mknod... yes
- checking for mknodat... yes
- checking for mktime... yes
- checking for mmap... yes
- checking for mremap... yes
- checking for nice... yes
- checking for openat... yes
- checking for opendir... yes
- checking for pathconf... yes
- checking for pause... yes
- checking for pipe... yes
- checking for pipe2... yes
- checking for plock... no
- checking for poll... yes
- checking for posix_fadvise... yes
- checking for posix_fallocate... yes
- checking for posix_spawn... yes
- checking for posix_spawnp... yes
- checking for pread... yes
- checking for preadv... yes
- checking for preadv2... yes
- checking for pthread_condattr_setclock... yes
- checking for pthread_init... no
- checking for pthread_kill... yes
- checking for pwrite... yes
- checking for pwritev... yes
- checking for pwritev2... yes
- checking for readlink... yes
- checking for readlinkat... yes
- checking for readv... yes
- checking for realpath... yes
- checking for renameat... yes
- checking for rtpSpawn... no
- checking for sched_get_priority_max... yes
- checking for sched_rr_get_interval... yes
- checking for sched_setaffinity... yes
- checking for sched_setparam... yes
- checking for sched_setscheduler... yes
- checking for sem_clockwait... yes
- checking for sem_getvalue... yes
- checking for sem_open... yes
- checking for sem_timedwait... yes
- checking for sem_unlink... yes
- checking for sendfile... yes
- checking for setegid... yes
- checking for seteuid... yes
- checking for setgid... yes
- checking for sethostname... yes
- checking for setitimer... yes
- checking for setlocale... yes
- checking for setpgid... yes
- checking for setpgrp... yes
- checking for setpriority... yes
- checking for setregid... yes
- checking for setresgid... yes
- checking for setresuid... yes
- checking for setreuid... yes
- checking for setsid... yes
- checking for setuid... yes
- checking for setvbuf... yes
- checking for shutdown... yes
- checking for sigaction... yes
- checking for sigaltstack... yes
- checking for sigfillset... yes
- checking for siginterrupt... yes
- checking for sigpending... yes
- checking for sigrelse... yes
- checking for sigtimedwait... yes
- checking for sigwait... yes
- checking for sigwaitinfo... yes
- checking for snprintf... yes
- checking for splice... yes
- checking for strftime... yes
- checking for strlcpy... yes
- checking for strsignal... yes
- checking for symlinkat... yes
- checking for sync... yes
- checking for sysconf... yes
- checking for system... yes
- checking for tcgetpgrp... yes
- checking for tcsetpgrp... yes
- checking for tempnam... yes
- checking for timegm... yes
- checking for times... yes
- checking for tmpfile... yes
- checking for tmpnam... yes
- checking for tmpnam_r... yes
- checking for truncate... yes
- checking for ttyname... yes
- checking for umask... yes
- checking for uname... yes
- checking for unlinkat... yes
- checking for utimensat... yes
- checking for utimes... yes
- checking for vfork... yes
- checking for wait... yes
- checking for wait3... yes
- checking for wait4... yes
- checking for waitid... yes
- checking for waitpid... yes
- checking for wcscoll... yes
- checking for wcsftime... yes
- checking for wcsxfrm... yes
- checking for wmemcmp... yes
- checking for writev... yes
- checking whether dirfd is declared... yes
- checking for chroot... yes
- checking for link... yes
- checking for symlink... yes
- checking for fchdir... yes
- checking for fsync... yes
- checking for fdatasync... yes
- checking for epoll_create... yes
- checking for epoll_create1... yes
- checking for kqueue... no
- checking for prlimit... yes
- checking for _dyld_shared_cache_contains_path... no
- checking for memfd_create... yes
- checking for eventfd... yes
- checking for ctermid_r... no
- checking for flock declaration... yes
- checking for flock... yes
- checking for getpagesize... yes
- checking for broken unsetenv... no
- checking for true... true
- checking for inet_aton in -lc... yes
- checking for chflags... no
- checking for lchflags... no
- checking for ZLIB... yes
- checking for BZIP2... yes
- checking for LIBLZMA... yes
- checking for hstrerror... yes
- checking for getservbyname... yes
- checking for getservbyport... yes
- checking for gethostbyname... yes
- checking for gethostbyaddr... yes
- checking for getprotobyname... yes
- checking for inet_aton... yes
- checking for inet_ntoa... yes
- checking for inet_pton... yes
- checking for getpeername... (cached) yes
- checking for getsockname... yes
- checking for accept... yes
- checking for bind... yes
- checking for connect... yes
- checking for listen... yes
- checking for recvfrom... yes
- checking for sendto... yes
- checking for setsockopt... yes
- checking for socket... yes
- checking for setgroups... yes
- checking for openpty... yes
- checking for library containing login_tty... none required
- checking for forkpty... yes
- checking for fseek64... no
- checking for fseeko... yes
- checking for fstatvfs... yes
- checking for ftell64... no
- checking for ftello... yes
- checking for statvfs... yes
- checking for dup2... yes
- checking for getpgrp... yes
- checking for setpgrp... (cached) yes
- checking for LIBCRYPT... yes
- checking for crypt or crypt_r... yes
- checking for clock_gettime... yes
- checking for clock_getres... yes
- checking for clock_settime... yes
- checking for clock_nanosleep... yes
- checking for nanosleep... yes
- checking for major, minor, and makedev... yes
- checking for getaddrinfo... yes
- checking getaddrinfo bug... no
- checking for getnameinfo... yes
- checking whether struct tm is in sys/time.h or time.h... time.h
- checking for struct tm.tm_zone... yes
- checking for struct stat.st_rdev... yes
- checking for struct stat.st_blksize... yes
- checking for struct stat.st_flags... no
- checking for struct stat.st_gen... no
- checking for struct stat.st_birthtime... no
- checking for struct stat.st_blocks... yes
- checking for struct passwd.pw_gecos... yes
- checking for struct passwd.pw_passwd... yes
- checking for siginfo_t.si_band... yes
- checking for time.h that defines altzone... no
- checking for addrinfo... yes
- checking for sockaddr_storage... yes
- checking for sockaddr_alg... yes
- checking for an ANSI C-conforming const... yes
- checking for working signed char... yes
- checking for prototypes... yes
- checking for variable length prototypes and stdarg.h... yes
- checking for socketpair... yes
- checking if sockaddr has sa_len member... no
- checking for gethostbyname_r... yes
- checking gethostbyname_r with 6 args... yes
- checking for __fpu_control... yes
- checking for --with-libm=STRING... default LIBM="-lm"
- checking for --with-libc=STRING... default LIBC=""
- checking for x64 gcc inline assembler... yes
- checking whether float word ordering is bigendian... (cached) no
- checking whether we can use gcc inline assembler to get and set x87 control word... yes
- checking whether we can use gcc inline assembler to get and set mc68881 fpcr... no
- checking for x87-style double rounding... no
- checking for acosh... yes
- checking for asinh... yes
- checking for atanh... yes
- checking for erf... yes
- checking for erfc... yes
- checking for expm1... yes
- checking for log1p... yes
- checking for log2... yes
- checking whether POSIX semaphores are enabled... yes
- checking for broken sem_getvalue... no
- checking whether RTLD_LAZY is declared... yes
- checking whether RTLD_NOW is declared... yes
- checking whether RTLD_GLOBAL is declared... yes
- checking whether RTLD_LOCAL is declared... yes
- checking whether RTLD_NODELETE is declared... yes
- checking whether RTLD_NOLOAD is declared... yes
- checking whether RTLD_DEEPBIND is declared... yes
- checking whether RTLD_MEMBER is declared... no
- checking digit size for Python's longs... no value specified
- checking wchar.h usability... yes
- checking wchar.h presence... yes
- checking for wchar.h... yes
- checking size of wchar_t... 4
- checking whether wchar_t is signed... yes
- checking whether wchar_t is usable... no
- checking whether byte ordering is bigendian... no
- checking ABIFLAGS...
- checking SOABI... cpython-311-x86_64-linux-gnu
- checking LDVERSION... $(VERSION)$(ABIFLAGS)
- checking for --with-platlibdir... no
- checking for --with-wheel-pkg-dir... no
- checking whether right shift extends the sign bit... yes
- checking for getc_unlocked() and friends... yes
- checking how to link readline libs... -lreadline
- checking whether rl_completion_append_character is declared... yes
- checking whether rl_completion_suppress_append is declared... yes
- checking for rl_pre_input_hook in -lreadline... yes
- checking for rl_completion_display_matches_hook in -lreadline... yes
- checking for rl_resize_terminal in -lreadline... yes
- checking for rl_completion_matches in -lreadline... yes
- checking whether rl_catch_signals is declared... yes
- checking for append_history in -lreadline... yes
- checking for rl_compdisp_func_t... yes
- checking for broken nice()... no
- checking for broken poll()... no
- checking for working tzset()... yes
- checking for tv_nsec in struct stat... yes
- checking for tv_nsec2 in struct stat... no
- checking curses.h usability... yes
- checking curses.h presence... yes
- checking for curses.h... yes
- checking ncurses.h usability... yes
- checking ncurses.h presence... yes
- checking for ncurses.h... yes
- checking for term.h... yes
- checking whether mvwdelch is an expression... yes
- checking whether WINDOW has _flags... no
- checking for curses function is_pad... yes
- checking for curses function is_term_resized... yes
- checking for curses function resize_term... yes
- checking for curses function resizeterm... yes
- checking for curses function immedok... yes
- checking for curses function syncok... yes
- checking for curses function wchgat... yes
- checking for curses function filter... yes
- checking for curses function has_key... yes
- checking for curses function typeahead... yes
- checking for curses function use_env... yes
- configure: checking for device files
- checking for /dev/ptmx... yes
- checking for /dev/ptc... no
- checking for %zd printf() format support... yes
- checking for socklen_t... yes
- checking for broken mbstowcs... no
- checking for --with-computed-gotos... yes
- checking whether gcc supports computed gotos... yes
- checking for build directories... done
- checking for -O2... yes
- checking for glibc _FORTIFY_SOURCE/memmove bug... no
- checking for gcc ipa-pure-const bug... no
- checking for stdatomic.h... yes
- checking for builtin __atomic_load_n and __atomic_store_n functions... yes
- checking for ensurepip... no
- checking if the dirent structure of a d_type field... yes
- checking for the Linux getrandom() syscall... yes
- checking for the getrandom() function... yes
- checking for library containing shm_open... none required
- checking for shm_open... yes
- checking for shm_unlink... yes
- checking for pkg-config... /usr/bin/pkg-config
- checking whether compiling and linking against OpenSSL works... yes
- checking for --with-openssl-rpath...
- checking whether OpenSSL provides required ssl module APIs... yes
- checking whether OpenSSL provides required hashlib module APIs... yes
- checking for --with-ssl-default-suites... python
- checking for --with-builtin-hashlib-hashes... md5,sha1,sha256,sha512,sha3,blake2
- checking for LIBB2... yes
- checking for --disable-test-modules... yes
- checking for additional Modules/Setup files...
- checking for stdlib extension module _multiprocessing... yes
- checking for stdlib extension module _posixshmem... yes
- checking for stdlib extension module fcntl... yes
- checking for stdlib extension module mmap... yes
- checking for stdlib extension module _socket... yes
- checking for stdlib extension module grp... yes
- checking for stdlib extension module ossaudiodev... yes
- checking for stdlib extension module pwd... yes
- checking for stdlib extension module resource... yes
- checking for stdlib extension module _scproxy... n/a
- checking for stdlib extension module spwd... yes
- checking for stdlib extension module syslog... yes
- checking for stdlib extension module termios... yes
- checking for stdlib extension module pyexpat... yes
- checking for stdlib extension module _elementtree... yes
- checking for stdlib extension module _md5... yes
- checking for stdlib extension module _sha1... yes
- checking for stdlib extension module _sha256... yes
- checking for stdlib extension module _sha512... yes
- checking for stdlib extension module _sha3... yes
- checking for stdlib extension module _blake2... yes
- checking for stdlib extension module _crypt... yes
- checking for stdlib extension module _decimal... yes
- checking for stdlib extension module _gdbm... yes
- checking for stdlib extension module nis... yes
- checking for stdlib extension module _sqlite3... yes
- checking for stdlib extension module _tkinter... yes
- checking for stdlib extension module _uuid... yes
- checking for stdlib extension module zlib... yes
- checking for stdlib extension module _bz2... yes
- checking for stdlib extension module _lzma... yes
- checking for stdlib extension module _ssl... yes
- checking for stdlib extension module _hashlib... yes
- checking for stdlib extension module _testcapi... yes
- checking for stdlib extension module _testclinic... yes
- checking for stdlib extension module _testinternalcapi... yes
- checking for stdlib extension module _testbuffer... yes
- checking for stdlib extension module _testimportmultiple... yes
- checking for stdlib extension module _testmultiphase... yes
- checking for stdlib extension module _xxtestfuzz... yes
- checking for stdlib extension module _ctypes_test... yes
- checking for stdlib extension module xxlimited... yes
- checking for stdlib extension module xxlimited_35... yes
- configure: creating ./config.status
- config.status: creating Makefile.pre
- config.status: creating Misc/python.pc
- config.status: creating Misc/python-embed.pc
- config.status: creating Misc/python-config.sh
- config.status: creating Modules/Setup.bootstrap
- config.status: creating Modules/Setup.stdlib
- config.status: creating Modules/ld_so_aix
- config.status: creating pyconfig.h
- config.status: pyconfig.h is unchanged
- configure: creating Modules/Setup.local
- configure: creating Makefile
- configure:
- If you want a release build with all stable optimizations active (PGO, etc),
- please run ./configure --enable-optimizations
- gcc -c -DNDEBUG -g -fwrapv -O3 -Wall -march=x86-64 -mtune=generic -O2 -pipe -fno-plt -fexceptions -Wp,-D_FORTIFY_SOURCE=3 -Wformat -Werror=format-security -fstack-clash-protection -fcf-protection -fno-omit-frame-pointer -mno-omit-leaf-frame-pointer -march=x86-64 -mtune=generic -O2 -pipe -fno-plt -fexceptions -Wp,-D_FORTIFY_SOURCE=3 -Wformat -Werror=format-security -fstack-clash-protection -fcf-protection -fno-omit-frame-pointer -mno-omit-leaf-frame-pointer -march=x86-64 -mtune=generic -O2 -pipe -fno-plt -fexceptions -Wp,-D_FORTIFY_SOURCE=3 -Wformat -Werror=format-security -fstack-clash-protection -fcf-protection -fno-omit-frame-pointer -mno-omit-leaf-frame-pointer -std=c11 -Werror=implicit-function-declaration -fvisibility=hidden -I./Include/internal -I. -I./Include -fPIC -DPy_BUILD_CORE \
- -DABIFLAGS='""' \
- -DMULTIARCH=\"x86_64-linux-gnu\" \
- -o Python/sysmodule.o ./Python/sysmodule.c
- gcc -c -DNDEBUG -g -fwrapv -O3 -Wall -march=x86-64 -mtune=generic -O2 -pipe -fno-plt -fexceptions -Wp,-D_FORTIFY_SOURCE=3 -Wformat -Werror=format-security -fstack-clash-protection -fcf-protection -fno-omit-frame-pointer -mno-omit-leaf-frame-pointer -march=x86-64 -mtune=generic -O2 -pipe -fno-plt -fexceptions -Wp,-D_FORTIFY_SOURCE=3 -Wformat -Werror=format-security -fstack-clash-protection -fcf-protection -fno-omit-frame-pointer -mno-omit-leaf-frame-pointer -march=x86-64 -mtune=generic -O2 -pipe -fno-plt -fexceptions -Wp,-D_FORTIFY_SOURCE=3 -Wformat -Werror=format-security -fstack-clash-protection -fcf-protection -fno-omit-frame-pointer -mno-omit-leaf-frame-pointer -std=c11 -Werror=implicit-function-declaration -fvisibility=hidden -I./Include/internal -I. -I./Include -fPIC -DPy_BUILD_CORE \
- -DSOABI='"cpython-311-x86_64-linux-gnu"' \
- -o Python/dynload_shlib.o ./Python/dynload_shlib.c
- gcc -c -DNDEBUG -g -fwrapv -O3 -Wall -march=x86-64 -mtune=generic -O2 -pipe -fno-plt -fexceptions -Wp,-D_FORTIFY_SOURCE=3 -Wformat -Werror=format-security -fstack-clash-protection -fcf-protection -fno-omit-frame-pointer -mno-omit-leaf-frame-pointer -march=x86-64 -mtune=generic -O2 -pipe -fno-plt -fexceptions -Wp,-D_FORTIFY_SOURCE=3 -Wformat -Werror=format-security -fstack-clash-protection -fcf-protection -fno-omit-frame-pointer -mno-omit-leaf-frame-pointer -march=x86-64 -mtune=generic -O2 -pipe -fno-plt -fexceptions -Wp,-D_FORTIFY_SOURCE=3 -Wformat -Werror=format-security -fstack-clash-protection -fcf-protection -fno-omit-frame-pointer -mno-omit-leaf-frame-pointer -std=c11 -Werror=implicit-function-declaration -fvisibility=hidden -I./Include/internal -I. -I./Include -fPIC -DPy_BUILD_CORE -o Modules/config.o Modules/config.c
- gcc -DNDEBUG -g -fwrapv -O3 -Wall -march=x86-64 -mtune=generic -O2 -pipe -fno-plt -fexceptions -Wp,-D_FORTIFY_SOURCE=3 -Wformat -Werror=format-security -fstack-clash-protection -fcf-protection -fno-omit-frame-pointer -mno-omit-leaf-frame-pointer -march=x86-64 -mtune=generic -O2 -pipe -fno-plt -fexceptions -Wp,-D_FORTIFY_SOURCE=3 -Wformat -Werror=format-security -fstack-clash-protection -fcf-protection -fno-omit-frame-pointer -mno-omit-leaf-frame-pointer -march=x86-64 -mtune=generic -O2 -pipe -fno-plt -fexceptions -Wp,-D_FORTIFY_SOURCE=3 -Wformat -Werror=format-security -fstack-clash-protection -fcf-protection -fno-omit-frame-pointer -mno-omit-leaf-frame-pointer -std=c11 -Werror=implicit-function-declaration -fvisibility=hidden -I./Include/internal -I. -I./Include -fPIC -DPy_BUILD_CORE_BUILTIN -c ./Modules/atexitmodule.c -o Modules/atexitmodule.o
- gcc -DNDEBUG -g -fwrapv -O3 -Wall -march=x86-64 -mtune=generic -O2 -pipe -fno-plt -fexceptions -Wp,-D_FORTIFY_SOURCE=3 -Wformat -Werror=format-security -fstack-clash-protection -fcf-protection -fno-omit-frame-pointer -mno-omit-leaf-frame-pointer -march=x86-64 -mtune=generic -O2 -pipe -fno-plt -fexceptions -Wp,-D_FORTIFY_SOURCE=3 -Wformat -Werror=format-security -fstack-clash-protection -fcf-protection -fno-omit-frame-pointer -mno-omit-leaf-frame-pointer -march=x86-64 -mtune=generic -O2 -pipe -fno-plt -fexceptions -Wp,-D_FORTIFY_SOURCE=3 -Wformat -Werror=format-security -fstack-clash-protection -fcf-protection -fno-omit-frame-pointer -mno-omit-leaf-frame-pointer -std=c11 -Werror=implicit-function-declaration -fvisibility=hidden -I./Include/internal -I. -I./Include -fPIC -DPy_BUILD_CORE_BUILTIN -c ./Modules/faulthandler.c -o Modules/faulthandler.o
- gcc -DNDEBUG -g -fwrapv -O3 -Wall -march=x86-64 -mtune=generic -O2 -pipe -fno-plt -fexceptions -Wp,-D_FORTIFY_SOURCE=3 -Wformat -Werror=format-security -fstack-clash-protection -fcf-protection -fno-omit-frame-pointer -mno-omit-leaf-frame-pointer -march=x86-64 -mtune=generic -O2 -pipe -fno-plt -fexceptions -Wp,-D_FORTIFY_SOURCE=3 -Wformat -Werror=format-security -fstack-clash-protection -fcf-protection -fno-omit-frame-pointer -mno-omit-leaf-frame-pointer -march=x86-64 -mtune=generic -O2 -pipe -fno-plt -fexceptions -Wp,-D_FORTIFY_SOURCE=3 -Wformat -Werror=format-security -fstack-clash-protection -fcf-protection -fno-omit-frame-pointer -mno-omit-leaf-frame-pointer -std=c11 -Werror=implicit-function-declaration -fvisibility=hidden -I./Include/internal -I. -I./Include -fPIC -DPy_BUILD_CORE_BUILTIN -c ./Modules/posixmodule.c -o Modules/posixmodule.o
- gcc -DNDEBUG -g -fwrapv -O3 -Wall -march=x86-64 -mtune=generic -O2 -pipe -fno-plt -fexceptions -Wp,-D_FORTIFY_SOURCE=3 -Wformat -Werror=format-security -fstack-clash-protection -fcf-protection -fno-omit-frame-pointer -mno-omit-leaf-frame-pointer -march=x86-64 -mtune=generic -O2 -pipe -fno-plt -fexceptions -Wp,-D_FORTIFY_SOURCE=3 -Wformat -Werror=format-security -fstack-clash-protection -fcf-protection -fno-omit-frame-pointer -mno-omit-leaf-frame-pointer -march=x86-64 -mtune=generic -O2 -pipe -fno-plt -fexceptions -Wp,-D_FORTIFY_SOURCE=3 -Wformat -Werror=format-security -fstack-clash-protection -fcf-protection -fno-omit-frame-pointer -mno-omit-leaf-frame-pointer -std=c11 -Werror=implicit-function-declaration -fvisibility=hidden -I./Include/internal -I. -I./Include -fPIC -DPy_BUILD_CORE_BUILTIN -c ./Modules/signalmodule.c -o Modules/signalmodule.o
- gcc -DNDEBUG -g -fwrapv -O3 -Wall -march=x86-64 -mtune=generic -O2 -pipe -fno-plt -fexceptions -Wp,-D_FORTIFY_SOURCE=3 -Wformat -Werror=format-security -fstack-clash-protection -fcf-protection -fno-omit-frame-pointer -mno-omit-leaf-frame-pointer -march=x86-64 -mtune=generic -O2 -pipe -fno-plt -fexceptions -Wp,-D_FORTIFY_SOURCE=3 -Wformat -Werror=format-security -fstack-clash-protection -fcf-protection -fno-omit-frame-pointer -mno-omit-leaf-frame-pointer -march=x86-64 -mtune=generic -O2 -pipe -fno-plt -fexceptions -Wp,-D_FORTIFY_SOURCE=3 -Wformat -Werror=format-security -fstack-clash-protection -fcf-protection -fno-omit-frame-pointer -mno-omit-leaf-frame-pointer -std=c11 -Werror=implicit-function-declaration -fvisibility=hidden -I./Include/internal -I. -I./Include -fPIC -DPy_BUILD_CORE_BUILTIN -c ./Modules/_tracemalloc.c -o Modules/_tracemalloc.o
- gcc -DNDEBUG -g -fwrapv -O3 -Wall -march=x86-64 -mtune=generic -O2 -pipe -fno-plt -fexceptions -Wp,-D_FORTIFY_SOURCE=3 -Wformat -Werror=format-security -fstack-clash-protection -fcf-protection -fno-omit-frame-pointer -mno-omit-leaf-frame-pointer -march=x86-64 -mtune=generic -O2 -pipe -fno-plt -fexceptions -Wp,-D_FORTIFY_SOURCE=3 -Wformat -Werror=format-security -fstack-clash-protection -fcf-protection -fno-omit-frame-pointer -mno-omit-leaf-frame-pointer -march=x86-64 -mtune=generic -O2 -pipe -fno-plt -fexceptions -Wp,-D_FORTIFY_SOURCE=3 -Wformat -Werror=format-security -fstack-clash-protection -fcf-protection -fno-omit-frame-pointer -mno-omit-leaf-frame-pointer -std=c11 -Werror=implicit-function-declaration -fvisibility=hidden -I./Include/internal -I. -I./Include -fPIC -DPy_BUILD_CORE_BUILTIN -c ./Modules/_codecsmodule.c -o Modules/_codecsmodule.o
- gcc -DNDEBUG -g -fwrapv -O3 -Wall -march=x86-64 -mtune=generic -O2 -pipe -fno-plt -fexceptions -Wp,-D_FORTIFY_SOURCE=3 -Wformat -Werror=format-security -fstack-clash-protection -fcf-protection -fno-omit-frame-pointer -mno-omit-leaf-frame-pointer -march=x86-64 -mtune=generic -O2 -pipe -fno-plt -fexceptions -Wp,-D_FORTIFY_SOURCE=3 -Wformat -Werror=format-security -fstack-clash-protection -fcf-protection -fno-omit-frame-pointer -mno-omit-leaf-frame-pointer -march=x86-64 -mtune=generic -O2 -pipe -fno-plt -fexceptions -Wp,-D_FORTIFY_SOURCE=3 -Wformat -Werror=format-security -fstack-clash-protection -fcf-protection -fno-omit-frame-pointer -mno-omit-leaf-frame-pointer -std=c11 -Werror=implicit-function-declaration -fvisibility=hidden -I./Include/internal -I. -I./Include -fPIC -DPy_BUILD_CORE_BUILTIN -c ./Modules/_collectionsmodule.c -o Modules/_collectionsmodule.o
- gcc -DNDEBUG -g -fwrapv -O3 -Wall -march=x86-64 -mtune=generic -O2 -pipe -fno-plt -fexceptions -Wp,-D_FORTIFY_SOURCE=3 -Wformat -Werror=format-security -fstack-clash-protection -fcf-protection -fno-omit-frame-pointer -mno-omit-leaf-frame-pointer -march=x86-64 -mtune=generic -O2 -pipe -fno-plt -fexceptions -Wp,-D_FORTIFY_SOURCE=3 -Wformat -Werror=format-security -fstack-clash-protection -fcf-protection -fno-omit-frame-pointer -mno-omit-leaf-frame-pointer -march=x86-64 -mtune=generic -O2 -pipe -fno-plt -fexceptions -Wp,-D_FORTIFY_SOURCE=3 -Wformat -Werror=format-security -fstack-clash-protection -fcf-protection -fno-omit-frame-pointer -mno-omit-leaf-frame-pointer -std=c11 -Werror=implicit-function-declaration -fvisibility=hidden -I./Include/internal -I. -I./Include -fPIC -DPy_BUILD_CORE_BUILTIN -c ./Modules/errnomodule.c -o Modules/errnomodule.o
- gcc -I./Modules/_io -DNDEBUG -g -fwrapv -O3 -Wall -march=x86-64 -mtune=generic -O2 -pipe -fno-plt -fexceptions -Wp,-D_FORTIFY_SOURCE=3 -Wformat -Werror=format-security -fstack-clash-protection -fcf-protection -fno-omit-frame-pointer -mno-omit-leaf-frame-pointer -march=x86-64 -mtune=generic -O2 -pipe -fno-plt -fexceptions -Wp,-D_FORTIFY_SOURCE=3 -Wformat -Werror=format-security -fstack-clash-protection -fcf-protection -fno-omit-frame-pointer -mno-omit-leaf-frame-pointer -march=x86-64 -mtune=generic -O2 -pipe -fno-plt -fexceptions -Wp,-D_FORTIFY_SOURCE=3 -Wformat -Werror=format-security -fstack-clash-protection -fcf-protection -fno-omit-frame-pointer -mno-omit-leaf-frame-pointer -std=c11 -Werror=implicit-function-declaration -fvisibility=hidden -I./Include/internal -I. -I./Include -fPIC -DPy_BUILD_CORE_BUILTIN -c ./Modules/_io/_iomodule.c -o Modules/_io/_iomodule.o
- gcc -I./Modules/_io -DNDEBUG -g -fwrapv -O3 -Wall -march=x86-64 -mtune=generic -O2 -pipe -fno-plt -fexceptions -Wp,-D_FORTIFY_SOURCE=3 -Wformat -Werror=format-security -fstack-clash-protection -fcf-protection -fno-omit-frame-pointer -mno-omit-leaf-frame-pointer -march=x86-64 -mtune=generic -O2 -pipe -fno-plt -fexceptions -Wp,-D_FORTIFY_SOURCE=3 -Wformat -Werror=format-security -fstack-clash-protection -fcf-protection -fno-omit-frame-pointer -mno-omit-leaf-frame-pointer -march=x86-64 -mtune=generic -O2 -pipe -fno-plt -fexceptions -Wp,-D_FORTIFY_SOURCE=3 -Wformat -Werror=format-security -fstack-clash-protection -fcf-protection -fno-omit-frame-pointer -mno-omit-leaf-frame-pointer -std=c11 -Werror=implicit-function-declaration -fvisibility=hidden -I./Include/internal -I. -I./Include -fPIC -DPy_BUILD_CORE_BUILTIN -c ./Modules/_io/iobase.c -o Modules/_io/iobase.o
- gcc -I./Modules/_io -DNDEBUG -g -fwrapv -O3 -Wall -march=x86-64 -mtune=generic -O2 -pipe -fno-plt -fexceptions -Wp,-D_FORTIFY_SOURCE=3 -Wformat -Werror=format-security -fstack-clash-protection -fcf-protection -fno-omit-frame-pointer -mno-omit-leaf-frame-pointer -march=x86-64 -mtune=generic -O2 -pipe -fno-plt -fexceptions -Wp,-D_FORTIFY_SOURCE=3 -Wformat -Werror=format-security -fstack-clash-protection -fcf-protection -fno-omit-frame-pointer -mno-omit-leaf-frame-pointer -march=x86-64 -mtune=generic -O2 -pipe -fno-plt -fexceptions -Wp,-D_FORTIFY_SOURCE=3 -Wformat -Werror=format-security -fstack-clash-protection -fcf-protection -fno-omit-frame-pointer -mno-omit-leaf-frame-pointer -std=c11 -Werror=implicit-function-declaration -fvisibility=hidden -I./Include/internal -I. -I./Include -fPIC -DPy_BUILD_CORE_BUILTIN -c ./Modules/_io/fileio.c -o Modules/_io/fileio.o
- gcc -I./Modules/_io -DNDEBUG -g -fwrapv -O3 -Wall -march=x86-64 -mtune=generic -O2 -pipe -fno-plt -fexceptions -Wp,-D_FORTIFY_SOURCE=3 -Wformat -Werror=format-security -fstack-clash-protection -fcf-protection -fno-omit-frame-pointer -mno-omit-leaf-frame-pointer -march=x86-64 -mtune=generic -O2 -pipe -fno-plt -fexceptions -Wp,-D_FORTIFY_SOURCE=3 -Wformat -Werror=format-security -fstack-clash-protection -fcf-protection -fno-omit-frame-pointer -mno-omit-leaf-frame-pointer -march=x86-64 -mtune=generic -O2 -pipe -fno-plt -fexceptions -Wp,-D_FORTIFY_SOURCE=3 -Wformat -Werror=format-security -fstack-clash-protection -fcf-protection -fno-omit-frame-pointer -mno-omit-leaf-frame-pointer -std=c11 -Werror=implicit-function-declaration -fvisibility=hidden -I./Include/internal -I. -I./Include -fPIC -DPy_BUILD_CORE_BUILTIN -c ./Modules/_io/bytesio.c -o Modules/_io/bytesio.o
- gcc -I./Modules/_io -DNDEBUG -g -fwrapv -O3 -Wall -march=x86-64 -mtune=generic -O2 -pipe -fno-plt -fexceptions -Wp,-D_FORTIFY_SOURCE=3 -Wformat -Werror=format-security -fstack-clash-protection -fcf-protection -fno-omit-frame-pointer -mno-omit-leaf-frame-pointer -march=x86-64 -mtune=generic -O2 -pipe -fno-plt -fexceptions -Wp,-D_FORTIFY_SOURCE=3 -Wformat -Werror=format-security -fstack-clash-protection -fcf-protection -fno-omit-frame-pointer -mno-omit-leaf-frame-pointer -march=x86-64 -mtune=generic -O2 -pipe -fno-plt -fexceptions -Wp,-D_FORTIFY_SOURCE=3 -Wformat -Werror=format-security -fstack-clash-protection -fcf-protection -fno-omit-frame-pointer -mno-omit-leaf-frame-pointer -std=c11 -Werror=implicit-function-declaration -fvisibility=hidden -I./Include/internal -I. -I./Include -fPIC -DPy_BUILD_CORE_BUILTIN -c ./Modules/_io/bufferedio.c -o Modules/_io/bufferedio.o
- gcc -I./Modules/_io -DNDEBUG -g -fwrapv -O3 -Wall -march=x86-64 -mtune=generic -O2 -pipe -fno-plt -fexceptions -Wp,-D_FORTIFY_SOURCE=3 -Wformat -Werror=format-security -fstack-clash-protection -fcf-protection -fno-omit-frame-pointer -mno-omit-leaf-frame-pointer -march=x86-64 -mtune=generic -O2 -pipe -fno-plt -fexceptions -Wp,-D_FORTIFY_SOURCE=3 -Wformat -Werror=format-security -fstack-clash-protection -fcf-protection -fno-omit-frame-pointer -mno-omit-leaf-frame-pointer -march=x86-64 -mtune=generic -O2 -pipe -fno-plt -fexceptions -Wp,-D_FORTIFY_SOURCE=3 -Wformat -Werror=format-security -fstack-clash-protection -fcf-protection -fno-omit-frame-pointer -mno-omit-leaf-frame-pointer -std=c11 -Werror=implicit-function-declaration -fvisibility=hidden -I./Include/internal -I. -I./Include -fPIC -DPy_BUILD_CORE_BUILTIN -c ./Modules/_io/textio.c -o Modules/_io/textio.o
- gcc -I./Modules/_io -DNDEBUG -g -fwrapv -O3 -Wall -march=x86-64 -mtune=generic -O2 -pipe -fno-plt -fexceptions -Wp,-D_FORTIFY_SOURCE=3 -Wformat -Werror=format-security -fstack-clash-protection -fcf-protection -fno-omit-frame-pointer -mno-omit-leaf-frame-pointer -march=x86-64 -mtune=generic -O2 -pipe -fno-plt -fexceptions -Wp,-D_FORTIFY_SOURCE=3 -Wformat -Werror=format-security -fstack-clash-protection -fcf-protection -fno-omit-frame-pointer -mno-omit-leaf-frame-pointer -march=x86-64 -mtune=generic -O2 -pipe -fno-plt -fexceptions -Wp,-D_FORTIFY_SOURCE=3 -Wformat -Werror=format-security -fstack-clash-protection -fcf-protection -fno-omit-frame-pointer -mno-omit-leaf-frame-pointer -std=c11 -Werror=implicit-function-declaration -fvisibility=hidden -I./Include/internal -I. -I./Include -fPIC -DPy_BUILD_CORE_BUILTIN -c ./Modules/_io/stringio.c -o Modules/_io/stringio.o
- gcc -DNDEBUG -g -fwrapv -O3 -Wall -march=x86-64 -mtune=generic -O2 -pipe -fno-plt -fexceptions -Wp,-D_FORTIFY_SOURCE=3 -Wformat -Werror=format-security -fstack-clash-protection -fcf-protection -fno-omit-frame-pointer -mno-omit-leaf-frame-pointer -march=x86-64 -mtune=generic -O2 -pipe -fno-plt -fexceptions -Wp,-D_FORTIFY_SOURCE=3 -Wformat -Werror=format-security -fstack-clash-protection -fcf-protection -fno-omit-frame-pointer -mno-omit-leaf-frame-pointer -march=x86-64 -mtune=generic -O2 -pipe -fno-plt -fexceptions -Wp,-D_FORTIFY_SOURCE=3 -Wformat -Werror=format-security -fstack-clash-protection -fcf-protection -fno-omit-frame-pointer -mno-omit-leaf-frame-pointer -std=c11 -Werror=implicit-function-declaration -fvisibility=hidden -I./Include/internal -I. -I./Include -fPIC -DPy_BUILD_CORE_BUILTIN -c ./Modules/itertoolsmodule.c -o Modules/itertoolsmodule.o
- gcc -DNDEBUG -g -fwrapv -O3 -Wall -march=x86-64 -mtune=generic -O2 -pipe -fno-plt -fexceptions -Wp,-D_FORTIFY_SOURCE=3 -Wformat -Werror=format-security -fstack-clash-protection -fcf-protection -fno-omit-frame-pointer -mno-omit-leaf-frame-pointer -march=x86-64 -mtune=generic -O2 -pipe -fno-plt -fexceptions -Wp,-D_FORTIFY_SOURCE=3 -Wformat -Werror=format-security -fstack-clash-protection -fcf-protection -fno-omit-frame-pointer -mno-omit-leaf-frame-pointer -march=x86-64 -mtune=generic -O2 -pipe -fno-plt -fexceptions -Wp,-D_FORTIFY_SOURCE=3 -Wformat -Werror=format-security -fstack-clash-protection -fcf-protection -fno-omit-frame-pointer -mno-omit-leaf-frame-pointer -std=c11 -Werror=implicit-function-declaration -fvisibility=hidden -I./Include/internal -I. -I./Include -fPIC -DPy_BUILD_CORE_BUILTIN -c ./Modules/_sre/sre.c -o Modules/_sre/sre.o
- gcc -DNDEBUG -g -fwrapv -O3 -Wall -march=x86-64 -mtune=generic -O2 -pipe -fno-plt -fexceptions -Wp,-D_FORTIFY_SOURCE=3 -Wformat -Werror=format-security -fstack-clash-protection -fcf-protection -fno-omit-frame-pointer -mno-omit-leaf-frame-pointer -march=x86-64 -mtune=generic -O2 -pipe -fno-plt -fexceptions -Wp,-D_FORTIFY_SOURCE=3 -Wformat -Werror=format-security -fstack-clash-protection -fcf-protection -fno-omit-frame-pointer -mno-omit-leaf-frame-pointer -march=x86-64 -mtune=generic -O2 -pipe -fno-plt -fexceptions -Wp,-D_FORTIFY_SOURCE=3 -Wformat -Werror=format-security -fstack-clash-protection -fcf-protection -fno-omit-frame-pointer -mno-omit-leaf-frame-pointer -std=c11 -Werror=implicit-function-declaration -fvisibility=hidden -I./Include/internal -I. -I./Include -fPIC -DPy_BUILD_CORE_BUILTIN -c ./Modules/_threadmodule.c -o Modules/_threadmodule.o
- gcc -DNDEBUG -g -fwrapv -O3 -Wall -march=x86-64 -mtune=generic -O2 -pipe -fno-plt -fexceptions -Wp,-D_FORTIFY_SOURCE=3 -Wformat -Werror=format-security -fstack-clash-protection -fcf-protection -fno-omit-frame-pointer -mno-omit-leaf-frame-pointer -march=x86-64 -mtune=generic -O2 -pipe -fno-plt -fexceptions -Wp,-D_FORTIFY_SOURCE=3 -Wformat -Werror=format-security -fstack-clash-protection -fcf-protection -fno-omit-frame-pointer -mno-omit-leaf-frame-pointer -march=x86-64 -mtune=generic -O2 -pipe -fno-plt -fexceptions -Wp,-D_FORTIFY_SOURCE=3 -Wformat -Werror=format-security -fstack-clash-protection -fcf-protection -fno-omit-frame-pointer -mno-omit-leaf-frame-pointer -std=c11 -Werror=implicit-function-declaration -fvisibility=hidden -I./Include/internal -I. -I./Include -fPIC -DPy_BUILD_CORE_BUILTIN -c ./Modules/timemodule.c -o Modules/timemodule.o
- gcc -DNDEBUG -g -fwrapv -O3 -Wall -march=x86-64 -mtune=generic -O2 -pipe -fno-plt -fexceptions -Wp,-D_FORTIFY_SOURCE=3 -Wformat -Werror=format-security -fstack-clash-protection -fcf-protection -fno-omit-frame-pointer -mno-omit-leaf-frame-pointer -march=x86-64 -mtune=generic -O2 -pipe -fno-plt -fexceptions -Wp,-D_FORTIFY_SOURCE=3 -Wformat -Werror=format-security -fstack-clash-protection -fcf-protection -fno-omit-frame-pointer -mno-omit-leaf-frame-pointer -march=x86-64 -mtune=generic -O2 -pipe -fno-plt -fexceptions -Wp,-D_FORTIFY_SOURCE=3 -Wformat -Werror=format-security -fstack-clash-protection -fcf-protection -fno-omit-frame-pointer -mno-omit-leaf-frame-pointer -std=c11 -Werror=implicit-function-declaration -fvisibility=hidden -I./Include/internal -I. -I./Include -fPIC -DPy_BUILD_CORE_BUILTIN -c ./Modules/_weakref.c -o Modules/_weakref.o
- gcc -DNDEBUG -g -fwrapv -O3 -Wall -march=x86-64 -mtune=generic -O2 -pipe -fno-plt -fexceptions -Wp,-D_FORTIFY_SOURCE=3 -Wformat -Werror=format-security -fstack-clash-protection -fcf-protection -fno-omit-frame-pointer -mno-omit-leaf-frame-pointer -march=x86-64 -mtune=generic -O2 -pipe -fno-plt -fexceptions -Wp,-D_FORTIFY_SOURCE=3 -Wformat -Werror=format-security -fstack-clash-protection -fcf-protection -fno-omit-frame-pointer -mno-omit-leaf-frame-pointer -march=x86-64 -mtune=generic -O2 -pipe -fno-plt -fexceptions -Wp,-D_FORTIFY_SOURCE=3 -Wformat -Werror=format-security -fstack-clash-protection -fcf-protection -fno-omit-frame-pointer -mno-omit-leaf-frame-pointer -std=c11 -Werror=implicit-function-declaration -fvisibility=hidden -I./Include/internal -I. -I./Include -fPIC -DPy_BUILD_CORE_BUILTIN -c ./Modules/_abc.c -o Modules/_abc.o
- gcc -DNDEBUG -g -fwrapv -O3 -Wall -march=x86-64 -mtune=generic -O2 -pipe -fno-plt -fexceptions -Wp,-D_FORTIFY_SOURCE=3 -Wformat -Werror=format-security -fstack-clash-protection -fcf-protection -fno-omit-frame-pointer -mno-omit-leaf-frame-pointer -march=x86-64 -mtune=generic -O2 -pipe -fno-plt -fexceptions -Wp,-D_FORTIFY_SOURCE=3 -Wformat -Werror=format-security -fstack-clash-protection -fcf-protection -fno-omit-frame-pointer -mno-omit-leaf-frame-pointer -march=x86-64 -mtune=generic -O2 -pipe -fno-plt -fexceptions -Wp,-D_FORTIFY_SOURCE=3 -Wformat -Werror=format-security -fstack-clash-protection -fcf-protection -fno-omit-frame-pointer -mno-omit-leaf-frame-pointer -std=c11 -Werror=implicit-function-declaration -fvisibility=hidden -I./Include/internal -I. -I./Include -fPIC -DPy_BUILD_CORE_BUILTIN -c ./Modules/_functoolsmodule.c -o Modules/_functoolsmodule.o
- gcc -DNDEBUG -g -fwrapv -O3 -Wall -march=x86-64 -mtune=generic -O2 -pipe -fno-plt -fexceptions -Wp,-D_FORTIFY_SOURCE=3 -Wformat -Werror=format-security -fstack-clash-protection -fcf-protection -fno-omit-frame-pointer -mno-omit-leaf-frame-pointer -march=x86-64 -mtune=generic -O2 -pipe -fno-plt -fexceptions -Wp,-D_FORTIFY_SOURCE=3 -Wformat -Werror=format-security -fstack-clash-protection -fcf-protection -fno-omit-frame-pointer -mno-omit-leaf-frame-pointer -march=x86-64 -mtune=generic -O2 -pipe -fno-plt -fexceptions -Wp,-D_FORTIFY_SOURCE=3 -Wformat -Werror=format-security -fstack-clash-protection -fcf-protection -fno-omit-frame-pointer -mno-omit-leaf-frame-pointer -std=c11 -Werror=implicit-function-declaration -fvisibility=hidden -I./Include/internal -I. -I./Include -fPIC -DPy_BUILD_CORE_BUILTIN -c ./Modules/_localemodule.c -o Modules/_localemodule.o
- gcc -DNDEBUG -g -fwrapv -O3 -Wall -march=x86-64 -mtune=generic -O2 -pipe -fno-plt -fexceptions -Wp,-D_FORTIFY_SOURCE=3 -Wformat -Werror=format-security -fstack-clash-protection -fcf-protection -fno-omit-frame-pointer -mno-omit-leaf-frame-pointer -march=x86-64 -mtune=generic -O2 -pipe -fno-plt -fexceptions -Wp,-D_FORTIFY_SOURCE=3 -Wformat -Werror=format-security -fstack-clash-protection -fcf-protection -fno-omit-frame-pointer -mno-omit-leaf-frame-pointer -march=x86-64 -mtune=generic -O2 -pipe -fno-plt -fexceptions -Wp,-D_FORTIFY_SOURCE=3 -Wformat -Werror=format-security -fstack-clash-protection -fcf-protection -fno-omit-frame-pointer -mno-omit-leaf-frame-pointer -std=c11 -Werror=implicit-function-declaration -fvisibility=hidden -I./Include/internal -I. -I./Include -fPIC -DPy_BUILD_CORE_BUILTIN -c ./Modules/_operator.c -o Modules/_operator.o
- gcc -DNDEBUG -g -fwrapv -O3 -Wall -march=x86-64 -mtune=generic -O2 -pipe -fno-plt -fexceptions -Wp,-D_FORTIFY_SOURCE=3 -Wformat -Werror=format-security -fstack-clash-protection -fcf-protection -fno-omit-frame-pointer -mno-omit-leaf-frame-pointer -march=x86-64 -mtune=generic -O2 -pipe -fno-plt -fexceptions -Wp,-D_FORTIFY_SOURCE=3 -Wformat -Werror=format-security -fstack-clash-protection -fcf-protection -fno-omit-frame-pointer -mno-omit-leaf-frame-pointer -march=x86-64 -mtune=generic -O2 -pipe -fno-plt -fexceptions -Wp,-D_FORTIFY_SOURCE=3 -Wformat -Werror=format-security -fstack-clash-protection -fcf-protection -fno-omit-frame-pointer -mno-omit-leaf-frame-pointer -std=c11 -Werror=implicit-function-declaration -fvisibility=hidden -I./Include/internal -I. -I./Include -fPIC -DPy_BUILD_CORE_BUILTIN -c ./Modules/_stat.c -o Modules/_stat.o
- gcc -DNDEBUG -g -fwrapv -O3 -Wall -march=x86-64 -mtune=generic -O2 -pipe -fno-plt -fexceptions -Wp,-D_FORTIFY_SOURCE=3 -Wformat -Werror=format-security -fstack-clash-protection -fcf-protection -fno-omit-frame-pointer -mno-omit-leaf-frame-pointer -march=x86-64 -mtune=generic -O2 -pipe -fno-plt -fexceptions -Wp,-D_FORTIFY_SOURCE=3 -Wformat -Werror=format-security -fstack-clash-protection -fcf-protection -fno-omit-frame-pointer -mno-omit-leaf-frame-pointer -march=x86-64 -mtune=generic -O2 -pipe -fno-plt -fexceptions -Wp,-D_FORTIFY_SOURCE=3 -Wformat -Werror=format-security -fstack-clash-protection -fcf-protection -fno-omit-frame-pointer -mno-omit-leaf-frame-pointer -std=c11 -Werror=implicit-function-declaration -fvisibility=hidden -I./Include/internal -I. -I./Include -fPIC -DPy_BUILD_CORE_BUILTIN -c ./Modules/symtablemodule.c -o Modules/symtablemodule.o
- gcc -DNDEBUG -g -fwrapv -O3 -Wall -march=x86-64 -mtune=generic -O2 -pipe -fno-plt -fexceptions -Wp,-D_FORTIFY_SOURCE=3 -Wformat -Werror=format-security -fstack-clash-protection -fcf-protection -fno-omit-frame-pointer -mno-omit-leaf-frame-pointer -march=x86-64 -mtune=generic -O2 -pipe -fno-plt -fexceptions -Wp,-D_FORTIFY_SOURCE=3 -Wformat -Werror=format-security -fstack-clash-protection -fcf-protection -fno-omit-frame-pointer -mno-omit-leaf-frame-pointer -march=x86-64 -mtune=generic -O2 -pipe -fno-plt -fexceptions -Wp,-D_FORTIFY_SOURCE=3 -Wformat -Werror=format-security -fstack-clash-protection -fcf-protection -fno-omit-frame-pointer -mno-omit-leaf-frame-pointer -std=c11 -Werror=implicit-function-declaration -fvisibility=hidden -I./Include/internal -I. -I./Include -fPIC -DPy_BUILD_CORE_BUILTIN -c ./Modules/pwdmodule.c -o Modules/pwdmodule.o
- gcc -DNDEBUG -g -fwrapv -O3 -Wall -march=x86-64 -mtune=generic -O2 -pipe -fno-plt -fexceptions -Wp,-D_FORTIFY_SOURCE=3 -Wformat -Werror=format-security -fstack-clash-protection -fcf-protection -fno-omit-frame-pointer -mno-omit-leaf-frame-pointer -march=x86-64 -mtune=generic -O2 -pipe -fno-plt -fexceptions -Wp,-D_FORTIFY_SOURCE=3 -Wformat -Werror=format-security -fstack-clash-protection -fcf-protection -fno-omit-frame-pointer -mno-omit-leaf-frame-pointer -march=x86-64 -mtune=generic -O2 -pipe -fno-plt -fexceptions -Wp,-D_FORTIFY_SOURCE=3 -Wformat -Werror=format-security -fstack-clash-protection -fcf-protection -fno-omit-frame-pointer -mno-omit-leaf-frame-pointer -std=c11 -Werror=implicit-function-declaration -fvisibility=hidden -I./Include/internal -I. -I./Include -fPIC -DPy_BUILD_CORE_BUILTIN -c ./Modules/xxsubtype.c -o Modules/xxsubtype.o
- gcc -c -DNDEBUG -g -fwrapv -O3 -Wall -march=x86-64 -mtune=generic -O2 -pipe -fno-plt -fexceptions -Wp,-D_FORTIFY_SOURCE=3 -Wformat -Werror=format-security -fstack-clash-protection -fcf-protection -fno-omit-frame-pointer -mno-omit-leaf-frame-pointer -march=x86-64 -mtune=generic -O2 -pipe -fno-plt -fexceptions -Wp,-D_FORTIFY_SOURCE=3 -Wformat -Werror=format-security -fstack-clash-protection -fcf-protection -fno-omit-frame-pointer -mno-omit-leaf-frame-pointer -march=x86-64 -mtune=generic -O2 -pipe -fno-plt -fexceptions -Wp,-D_FORTIFY_SOURCE=3 -Wformat -Werror=format-security -fstack-clash-protection -fcf-protection -fno-omit-frame-pointer -mno-omit-leaf-frame-pointer -std=c11 -Werror=implicit-function-declaration -fvisibility=hidden -I./Include/internal -I. -I./Include -fPIC -DPy_BUILD_CORE -o Programs/_freeze_module.o Programs/_freeze_module.c
- gcc -c -DNDEBUG -g -fwrapv -O3 -Wall -march=x86-64 -mtune=generic -O2 -pipe -fno-plt -fexceptions -Wp,-D_FORTIFY_SOURCE=3 -Wformat -Werror=format-security -fstack-clash-protection -fcf-protection -fno-omit-frame-pointer -mno-omit-leaf-frame-pointer -march=x86-64 -mtune=generic -O2 -pipe -fno-plt -fexceptions -Wp,-D_FORTIFY_SOURCE=3 -Wformat -Werror=format-security -fstack-clash-protection -fcf-protection -fno-omit-frame-pointer -mno-omit-leaf-frame-pointer -march=x86-64 -mtune=generic -O2 -pipe -fno-plt -fexceptions -Wp,-D_FORTIFY_SOURCE=3 -Wformat -Werror=format-security -fstack-clash-protection -fcf-protection -fno-omit-frame-pointer -mno-omit-leaf-frame-pointer -std=c11 -Werror=implicit-function-declaration -fvisibility=hidden -I./Include/internal -I. -I./Include -fPIC -DPy_BUILD_CORE -o Modules/getpath_noop.o Modules/getpath_noop.c
- sed -e "s,@EXENAME@,/usr/bin/python3.11," < ./Misc/python-config.in >python-config.py
- LC_ALL=C sed -e 's,\$(\([A-Za-z0-9_]*\)),\$\{\1\},g' < Misc/python-config.sh >python-config
- gcc -c -DNDEBUG -g -fwrapv -O3 -Wall -march=x86-64 -mtune=generic -O2 -pipe -fno-plt -fexceptions -Wp,-D_FORTIFY_SOURCE=3 -Wformat -Werror=format-security -fstack-clash-protection -fcf-protection -fno-omit-frame-pointer -mno-omit-leaf-frame-pointer -march=x86-64 -mtune=generic -O2 -pipe -fno-plt -fexceptions -Wp,-D_FORTIFY_SOURCE=3 -Wformat -Werror=format-security -fstack-clash-protection -fcf-protection -fno-omit-frame-pointer -mno-omit-leaf-frame-pointer -march=x86-64 -mtune=generic -O2 -pipe -fno-plt -fexceptions -Wp,-D_FORTIFY_SOURCE=3 -Wformat -Werror=format-security -fstack-clash-protection -fcf-protection -fno-omit-frame-pointer -mno-omit-leaf-frame-pointer -std=c11 -Werror=implicit-function-declaration -fvisibility=hidden -I./Include/internal -I. -I./Include -fPIC -DPy_BUILD_CORE \
- -DGITVERSION="\"`LC_ALL=C `\"" \
- -DGITTAG="\"`LC_ALL=C `\"" \
- -DGITBRANCH="\"`LC_ALL=C `\"" \
- -o Modules/getbuildinfo.o ./Modules/getbuildinfo.c
- gcc -Wl,-O1 -Wl,--sort-common -Wl,--as-needed -Wl,-z,relro -Wl,-z,now -Wl,-z,pack-relative-relocs -Wl,-O1 -Wl,--sort-common -Wl,--as-needed -Wl,-z,relro -Wl,-z,now -Wl,-z,pack-relative-relocs -o Programs/_freeze_module Programs/_freeze_module.o Modules/getpath_noop.o Modules/getbuildinfo.o Parser/token.o Parser/pegen.o Parser/pegen_errors.o Parser/action_helpers.o Parser/parser.o Parser/string_parser.o Parser/peg_api.o Parser/myreadline.o Parser/tokenizer.o Objects/abstract.o Objects/accu.o Objects/boolobject.o Objects/bytes_methods.o Objects/bytearrayobject.o Objects/bytesobject.o Objects/call.o Objects/capsule.o Objects/cellobject.o Objects/classobject.o Objects/codeobject.o Objects/complexobject.o Objects/descrobject.o Objects/enumobject.o Objects/exceptions.o Objects/genericaliasobject.o Objects/genobject.o Objects/fileobject.o Objects/floatobject.o Objects/frameobject.o Objects/funcobject.o Objects/interpreteridobject.o Objects/iterobject.o Objects/listobject.o Objects/longobject.o Objects/dictobject.o Objects/odictobject.o Objects/memoryobject.o Objects/methodobject.o Objects/moduleobject.o Objects/namespaceobject.o Objects/object.o Objects/obmalloc.o Objects/picklebufobject.o Objects/rangeobject.o Objects/setobject.o Objects/sliceobject.o Objects/structseq.o Objects/tupleobject.o Objects/typeobject.o Objects/unicodeobject.o Objects/unicodectype.o Objects/unionobject.o Objects/weakrefobject.o Python/_warnings.o Python/Python-ast.o Python/Python-tokenize.o Python/asdl.o Python/ast.o Python/ast_opt.o Python/ast_unparse.o Python/bltinmodule.o Python/ceval.o Python/codecs.o Python/compile.o Python/context.o Python/dynamic_annotations.o Python/errors.o Python/frame.o Python/frozenmain.o Python/future.o Python/getargs.o Python/getcompiler.o Python/getcopyright.o Python/getplatform.o Python/getversion.o Python/hamt.o Python/hashtable.o Python/import.o Python/importdl.o Python/initconfig.o Python/marshal.o Python/modsupport.o Python/mysnprintf.o Python/mystrtoul.o Python/pathconfig.o Python/preconfig.o Python/pyarena.o Python/pyctype.o Python/pyfpe.o Python/pyhash.o Python/pylifecycle.o Python/pymath.o Python/pystate.o Python/pythonrun.o Python/pytime.o Python/bootstrap_hash.o Python/specialize.o Python/structmember.o Python/symtable.o Python/sysmodule.o Python/thread.o Python/traceback.o Python/getopt.o Python/pystrcmp.o Python/pystrtod.o Python/pystrhex.o Python/dtoa.o Python/formatter_unicode.o Python/fileutils.o Python/suggestions.o Python/dynload_shlib.o Modules/config.o Modules/main.o Modules/gcmodule.o Modules/atexitmodule.o Modules/faulthandler.o Modules/posixmodule.o Modules/signalmodule.o Modules/_tracemalloc.o Modules/_codecsmodule.o Modules/_collectionsmodule.o Modules/errnomodule.o Modules/_io/_iomodule.o Modules/_io/iobase.o Modules/_io/fileio.o Modules/_io/bytesio.o Modules/_io/bufferedio.o Modules/_io/textio.o Modules/_io/stringio.o Modules/itertoolsmodule.o Modules/_sre/sre.o Modules/_threadmodule.o Modules/timemodule.o Modules/_weakref.o Modules/_abc.o Modules/_functoolsmodule.o Modules/_localemodule.o Modules/_operator.o Modules/_stat.o Modules/symtablemodule.o Modules/pwdmodule.o Modules/xxsubtype.o -ldl -lm
- ./Programs/_freeze_module importlib._bootstrap ./Lib/importlib/_bootstrap.py Python/frozen_modules/importlib._bootstrap.h
- ./Programs/_freeze_module importlib._bootstrap_external ./Lib/importlib/_bootstrap_external.py Python/frozen_modules/importlib._bootstrap_external.h
- ./Programs/_freeze_module getpath ./Modules/getpath.py Python/frozen_modules/getpath.h
- ./Programs/_freeze_module zipimport ./Lib/zipimport.py Python/frozen_modules/zipimport.h
- gcc -c -DNDEBUG -g -fwrapv -O3 -Wall -march=x86-64 -mtune=generic -O2 -pipe -fno-plt -fexceptions -Wp,-D_FORTIFY_SOURCE=3 -Wformat -Werror=format-security -fstack-clash-protection -fcf-protection -fno-omit-frame-pointer -mno-omit-leaf-frame-pointer -march=x86-64 -mtune=generic -O2 -pipe -fno-plt -fexceptions -Wp,-D_FORTIFY_SOURCE=3 -Wformat -Werror=format-security -fstack-clash-protection -fcf-protection -fno-omit-frame-pointer -mno-omit-leaf-frame-pointer -march=x86-64 -mtune=generic -O2 -pipe -fno-plt -fexceptions -Wp,-D_FORTIFY_SOURCE=3 -Wformat -Werror=format-security -fstack-clash-protection -fcf-protection -fno-omit-frame-pointer -mno-omit-leaf-frame-pointer -std=c11 -Werror=implicit-function-declaration -fvisibility=hidden -I./Include/internal -I. -I./Include -fPIC -DPy_BUILD_CORE -o Programs/_bootstrap_python.o Programs/_bootstrap_python.c
- gcc -c -DNDEBUG -g -fwrapv -O3 -Wall -march=x86-64 -mtune=generic -O2 -pipe -fno-plt -fexceptions -Wp,-D_FORTIFY_SOURCE=3 -Wformat -Werror=format-security -fstack-clash-protection -fcf-protection -fno-omit-frame-pointer -mno-omit-leaf-frame-pointer -march=x86-64 -mtune=generic -O2 -pipe -fno-plt -fexceptions -Wp,-D_FORTIFY_SOURCE=3 -Wformat -Werror=format-security -fstack-clash-protection -fcf-protection -fno-omit-frame-pointer -mno-omit-leaf-frame-pointer -march=x86-64 -mtune=generic -O2 -pipe -fno-plt -fexceptions -Wp,-D_FORTIFY_SOURCE=3 -Wformat -Werror=format-security -fstack-clash-protection -fcf-protection -fno-omit-frame-pointer -mno-omit-leaf-frame-pointer -std=c11 -Werror=implicit-function-declaration -fvisibility=hidden -I./Include/internal -I. -I./Include -fPIC -DPy_BUILD_CORE -DPYTHONPATH='""' \
- -DPREFIX='"/usr"' \
- -DEXEC_PREFIX='"/usr"' \
- -DVERSION='"3.11"' \
- -DVPATH='""' \
- -DPLATLIBDIR='"lib"' \
- -DPYTHONFRAMEWORK='""' \
- -o Modules/getpath.o ./Modules/getpath.c
- gcc -Wl,-O1 -Wl,--sort-common -Wl,--as-needed -Wl,-z,relro -Wl,-z,now -Wl,-z,pack-relative-relocs -Wl,-O1 -Wl,--sort-common -Wl,--as-needed -Wl,-z,relro -Wl,-z,now -Wl,-z,pack-relative-relocs -o _bootstrap_python Modules/getbuildinfo.o Parser/token.o Parser/pegen.o Parser/pegen_errors.o Parser/action_helpers.o Parser/parser.o Parser/string_parser.o Parser/peg_api.o Parser/myreadline.o Parser/tokenizer.o Objects/abstract.o Objects/accu.o Objects/boolobject.o Objects/bytes_methods.o Objects/bytearrayobject.o Objects/bytesobject.o Objects/call.o Objects/capsule.o Objects/cellobject.o Objects/classobject.o Objects/codeobject.o Objects/complexobject.o Objects/descrobject.o Objects/enumobject.o Objects/exceptions.o Objects/genericaliasobject.o Objects/genobject.o Objects/fileobject.o Objects/floatobject.o Objects/frameobject.o Objects/funcobject.o Objects/interpreteridobject.o Objects/iterobject.o Objects/listobject.o Objects/longobject.o Objects/dictobject.o Objects/odictobject.o Objects/memoryobject.o Objects/methodobject.o Objects/moduleobject.o Objects/namespaceobject.o Objects/object.o Objects/obmalloc.o Objects/picklebufobject.o Objects/rangeobject.o Objects/setobject.o Objects/sliceobject.o Objects/structseq.o Objects/tupleobject.o Objects/typeobject.o Objects/unicodeobject.o Objects/unicodectype.o Objects/unionobject.o Objects/weakrefobject.o Python/_warnings.o Python/Python-ast.o Python/Python-tokenize.o Python/asdl.o Python/ast.o Python/ast_opt.o Python/ast_unparse.o Python/bltinmodule.o Python/ceval.o Python/codecs.o Python/compile.o Python/context.o Python/dynamic_annotations.o Python/errors.o Python/frame.o Python/frozenmain.o Python/future.o Python/getargs.o Python/getcompiler.o Python/getcopyright.o Python/getplatform.o Python/getversion.o Python/hamt.o Python/hashtable.o Python/import.o Python/importdl.o Python/initconfig.o Python/marshal.o Python/modsupport.o Python/mysnprintf.o Python/mystrtoul.o Python/pathconfig.o Python/preconfig.o Python/pyarena.o Python/pyctype.o Python/pyfpe.o Python/pyhash.o Python/pylifecycle.o Python/pymath.o Python/pystate.o Python/pythonrun.o Python/pytime.o Python/bootstrap_hash.o Python/specialize.o Python/structmember.o Python/symtable.o Python/sysmodule.o Python/thread.o Python/traceback.o Python/getopt.o Python/pystrcmp.o Python/pystrtod.o Python/pystrhex.o Python/dtoa.o Python/formatter_unicode.o Python/fileutils.o Python/suggestions.o Python/dynload_shlib.o Modules/config.o Modules/main.o Modules/gcmodule.o Modules/atexitmodule.o Modules/faulthandler.o Modules/posixmodule.o Modules/signalmodule.o Modules/_tracemalloc.o Modules/_codecsmodule.o Modules/_collectionsmodule.o Modules/errnomodule.o Modules/_io/_iomodule.o Modules/_io/iobase.o Modules/_io/fileio.o Modules/_io/bytesio.o Modules/_io/bufferedio.o Modules/_io/textio.o Modules/_io/stringio.o Modules/itertoolsmodule.o Modules/_sre/sre.o Modules/_threadmodule.o Modules/timemodule.o Modules/_weakref.o Modules/_abc.o Modules/_functoolsmodule.o Modules/_localemodule.o Modules/_operator.o Modules/_stat.o Modules/symtablemodule.o Modules/pwdmodule.o Modules/xxsubtype.o \
- Programs/_bootstrap_python.o Modules/getpath.o -ldl -lm
- ./_bootstrap_python ./Programs/_freeze_module.py abc ./Lib/abc.py Python/frozen_modules/abc.h
- ./_bootstrap_python ./Programs/_freeze_module.py codecs ./Lib/codecs.py Python/frozen_modules/codecs.h
- ./_bootstrap_python ./Programs/_freeze_module.py io ./Lib/io.py Python/frozen_modules/io.h
- ./_bootstrap_python ./Programs/_freeze_module.py _collections_abc ./Lib/_collections_abc.py Python/frozen_modules/_collections_abc.h
- ./_bootstrap_python ./Programs/_freeze_module.py _sitebuiltins ./Lib/_sitebuiltins.py Python/frozen_modules/_sitebuiltins.h
- ./_bootstrap_python ./Programs/_freeze_module.py genericpath ./Lib/genericpath.py Python/frozen_modules/genericpath.h
- ./_bootstrap_python ./Programs/_freeze_module.py ntpath ./Lib/ntpath.py Python/frozen_modules/ntpath.h
- ./_bootstrap_python ./Programs/_freeze_module.py posixpath ./Lib/posixpath.py Python/frozen_modules/posixpath.h
- ./_bootstrap_python ./Programs/_freeze_module.py os ./Lib/os.py Python/frozen_modules/os.h
- ./_bootstrap_python ./Programs/_freeze_module.py site ./Lib/site.py Python/frozen_modules/site.h
- ./_bootstrap_python ./Programs/_freeze_module.py stat ./Lib/stat.py Python/frozen_modules/stat.h
- ./_bootstrap_python ./Programs/_freeze_module.py importlib.util ./Lib/importlib/util.py Python/frozen_modules/importlib.util.h
- ./_bootstrap_python ./Programs/_freeze_module.py importlib.machinery ./Lib/importlib/machinery.py Python/frozen_modules/importlib.machinery.h
- ./_bootstrap_python ./Programs/_freeze_module.py runpy ./Lib/runpy.py Python/frozen_modules/runpy.h
- ./_bootstrap_python ./Programs/_freeze_module.py __hello__ ./Lib/__hello__.py Python/frozen_modules/__hello__.h
- ./_bootstrap_python ./Programs/_freeze_module.py __phello__ ./Lib/__phello__/__init__.py Python/frozen_modules/__phello__.h
- ./_bootstrap_python ./Programs/_freeze_module.py __phello__.ham ./Lib/__phello__/ham/__init__.py Python/frozen_modules/__phello__.ham.h
- ./_bootstrap_python ./Programs/_freeze_module.py __phello__.ham.eggs ./Lib/__phello__/ham/eggs.py Python/frozen_modules/__phello__.ham.eggs.h
- ./_bootstrap_python ./Programs/_freeze_module.py __phello__.spam ./Lib/__phello__/spam.py Python/frozen_modules/__phello__.spam.h
- ./_bootstrap_python ./Programs/_freeze_module.py frozen_only ./Tools/freeze/flag.py Python/frozen_modules/frozen_only.h
- ./_bootstrap_python ./Tools/scripts/deepfreeze.py \
- Python/frozen_modules/importlib._bootstrap.h:importlib._bootstrap \
- Python/frozen_modules/importlib._bootstrap_external.h:importlib._bootstrap_external \
- Python/frozen_modules/zipimport.h:zipimport \
- Python/frozen_modules/abc.h:abc \
- Python/frozen_modules/codecs.h:codecs \
- Python/frozen_modules/io.h:io \
- Python/frozen_modules/_collections_abc.h:_collections_abc \
- Python/frozen_modules/_sitebuiltins.h:_sitebuiltins \
- Python/frozen_modules/genericpath.h:genericpath \
- Python/frozen_modules/ntpath.h:ntpath \
- Python/frozen_modules/posixpath.h:posixpath \
- Python/frozen_modules/os.h:os \
- Python/frozen_modules/site.h:site \
- Python/frozen_modules/stat.h:stat \
- Python/frozen_modules/importlib.util.h:importlib.util \
- Python/frozen_modules/importlib.machinery.h:importlib.machinery \
- Python/frozen_modules/runpy.h:runpy \
- Python/frozen_modules/__hello__.h:__hello__ \
- Python/frozen_modules/__phello__.h:__phello__ \
- Python/frozen_modules/__phello__.ham.h:__phello__.ham \
- Python/frozen_modules/__phello__.ham.eggs.h:__phello__.ham.eggs \
- Python/frozen_modules/__phello__.spam.h:__phello__.spam \
- Python/frozen_modules/frozen_only.h:frozen_only \
- -o Python/deepfreeze/deepfreeze.c
- gcc -c -DNDEBUG -g -fwrapv -O3 -Wall -march=x86-64 -mtune=generic -O2 -pipe -fno-plt -fexceptions -Wp,-D_FORTIFY_SOURCE=3 -Wformat -Werror=format-security -fstack-clash-protection -fcf-protection -fno-omit-frame-pointer -mno-omit-leaf-frame-pointer -march=x86-64 -mtune=generic -O2 -pipe -fno-plt -fexceptions -Wp,-D_FORTIFY_SOURCE=3 -Wformat -Werror=format-security -fstack-clash-protection -fcf-protection -fno-omit-frame-pointer -mno-omit-leaf-frame-pointer -march=x86-64 -mtune=generic -O2 -pipe -fno-plt -fexceptions -Wp,-D_FORTIFY_SOURCE=3 -Wformat -Werror=format-security -fstack-clash-protection -fcf-protection -fno-omit-frame-pointer -mno-omit-leaf-frame-pointer -std=c11 -Werror=implicit-function-declaration -fvisibility=hidden -I./Include/internal -I. -I./Include -fPIC -DPy_BUILD_CORE -o Python/frozen.o Python/frozen.c
- gcc -c -DNDEBUG -g -fwrapv -O3 -Wall -march=x86-64 -mtune=generic -O2 -pipe -fno-plt -fexceptions -Wp,-D_FORTIFY_SOURCE=3 -Wformat -Werror=format-security -fstack-clash-protection -fcf-protection -fno-omit-frame-pointer -mno-omit-leaf-frame-pointer -march=x86-64 -mtune=generic -O2 -pipe -fno-plt -fexceptions -Wp,-D_FORTIFY_SOURCE=3 -Wformat -Werror=format-security -fstack-clash-protection -fcf-protection -fno-omit-frame-pointer -mno-omit-leaf-frame-pointer -march=x86-64 -mtune=generic -O2 -pipe -fno-plt -fexceptions -Wp,-D_FORTIFY_SOURCE=3 -Wformat -Werror=format-security -fstack-clash-protection -fcf-protection -fno-omit-frame-pointer -mno-omit-leaf-frame-pointer -std=c11 -Werror=implicit-function-declaration -fvisibility=hidden -I./Include/internal -I. -I./Include -fPIC -DPy_BUILD_CORE -o Python/deepfreeze/deepfreeze.o Python/deepfreeze/deepfreeze.c
- rm -f libpython3.11.a
- if test libpython3.11.so.1.0 != libpython3.11.so; then \
- gcc -shared -Wl,-O1 -Wl,--sort-common -Wl,--as-needed -Wl,-z,relro -Wl,-z,now -Wl,-z,pack-relative-relocs -Wl,-O1 -Wl,--sort-common -Wl,--as-needed -Wl,-z,relro -Wl,-z,now -Wl,-z,pack-relative-relocs -Wl,-hlibpython3.11.so.1.0 -o libpython3.11.so.1.0 Modules/getbuildinfo.o Parser/token.o Parser/pegen.o Parser/pegen_errors.o Parser/action_helpers.o Parser/parser.o Parser/string_parser.o Parser/peg_api.o Parser/myreadline.o Parser/tokenizer.o Objects/abstract.o Objects/accu.o Objects/boolobject.o Objects/bytes_methods.o Objects/bytearrayobject.o Objects/bytesobject.o Objects/call.o Objects/capsule.o Objects/cellobject.o Objects/classobject.o Objects/codeobject.o Objects/complexobject.o Objects/descrobject.o Objects/enumobject.o Objects/exceptions.o Objects/genericaliasobject.o Objects/genobject.o Objects/fileobject.o Objects/floatobject.o Objects/frameobject.o Objects/funcobject.o Objects/interpreteridobject.o Objects/iterobject.o Objects/listobject.o Objects/longobject.o Objects/dictobject.o Objects/odictobject.o Objects/memoryobject.o Objects/methodobject.o Objects/moduleobject.o Objects/namespaceobject.o Objects/object.o Objects/obmalloc.o Objects/picklebufobject.o Objects/rangeobject.o Objects/setobject.o Objects/sliceobject.o Objects/structseq.o Objects/tupleobject.o Objects/typeobject.o Objects/unicodeobject.o Objects/unicodectype.o Objects/unionobject.o Objects/weakrefobject.o Python/_warnings.o Python/Python-ast.o Python/Python-tokenize.o Python/asdl.o Python/ast.o Python/ast_opt.o Python/ast_unparse.o Python/bltinmodule.o Python/ceval.o Python/codecs.o Python/compile.o Python/context.o Python/dynamic_annotations.o Python/errors.o Python/frame.o Python/frozenmain.o Python/future.o Python/getargs.o Python/getcompiler.o Python/getcopyright.o Python/getplatform.o Python/getversion.o Python/hamt.o Python/hashtable.o Python/import.o Python/importdl.o Python/initconfig.o Python/marshal.o Python/modsupport.o Python/mysnprintf.o Python/mystrtoul.o Python/pathconfig.o Python/preconfig.o Python/pyarena.o Python/pyctype.o Python/pyfpe.o Python/pyhash.o Python/pylifecycle.o Python/pymath.o Python/pystate.o Python/pythonrun.o Python/pytime.o Python/bootstrap_hash.o Python/specialize.o Python/structmember.o Python/symtable.o Python/sysmodule.o Python/thread.o Python/traceback.o Python/getopt.o Python/pystrcmp.o Python/pystrtod.o Python/pystrhex.o Python/dtoa.o Python/formatter_unicode.o Python/fileutils.o Python/suggestions.o Python/dynload_shlib.o Modules/config.o Modules/main.o Modules/gcmodule.o Modules/atexitmodule.o Modules/faulthandler.o Modules/posixmodule.o Modules/signalmodule.o Modules/_tracemalloc.o Modules/_codecsmodule.o Modules/_collectionsmodule.o Modules/errnomodule.o Modules/_io/_iomodule.o Modules/_io/iobase.o Modules/_io/fileio.o Modules/_io/bytesio.o Modules/_io/bufferedio.o Modules/_io/textio.o Modules/_io/stringio.o Modules/itertoolsmodule.o Modules/_sre/sre.o Modules/_threadmodule.o Modules/timemodule.o Modules/_weakref.o Modules/_abc.o Modules/_functoolsmodule.o Modules/_localemodule.o Modules/_operator.o Modules/_stat.o Modules/symtablemodule.o Modules/pwdmodule.o Modules/xxsubtype.o Python/deepfreeze/deepfreeze.o Modules/getpath.o Python/frozen.o -ldl -lm; \
- ln -f libpython3.11.so.1.0 libpython3.11.so; \
- else \
- gcc -shared -Wl,-O1 -Wl,--sort-common -Wl,--as-needed -Wl,-z,relro -Wl,-z,now -Wl,-z,pack-relative-relocs -Wl,-O1 -Wl,--sort-common -Wl,--as-needed -Wl,-z,relro -Wl,-z,now -Wl,-z,pack-relative-relocs -o libpython3.11.so Modules/getbuildinfo.o Parser/token.o Parser/pegen.o Parser/pegen_errors.o Parser/action_helpers.o Parser/parser.o Parser/string_parser.o Parser/peg_api.o Parser/myreadline.o Parser/tokenizer.o Objects/abstract.o Objects/accu.o Objects/boolobject.o Objects/bytes_methods.o Objects/bytearrayobject.o Objects/bytesobject.o Objects/call.o Objects/capsule.o Objects/cellobject.o Objects/classobject.o Objects/codeobject.o Objects/complexobject.o Objects/descrobject.o Objects/enumobject.o Objects/exceptions.o Objects/genericaliasobject.o Objects/genobject.o Objects/fileobject.o Objects/floatobject.o Objects/frameobject.o Objects/funcobject.o Objects/interpreteridobject.o Objects/iterobject.o Objects/listobject.o Objects/longobject.o Objects/dictobject.o Objects/odictobject.o Objects/memoryobject.o Objects/methodobject.o Objects/moduleobject.o Objects/namespaceobject.o Objects/object.o Objects/obmalloc.o Objects/picklebufobject.o Objects/rangeobject.o Objects/setobject.o Objects/sliceobject.o Objects/structseq.o Objects/tupleobject.o Objects/typeobject.o Objects/unicodeobject.o Objects/unicodectype.o Objects/unionobject.o Objects/weakrefobject.o Python/_warnings.o Python/Python-ast.o Python/Python-tokenize.o Python/asdl.o Python/ast.o Python/ast_opt.o Python/ast_unparse.o Python/bltinmodule.o Python/ceval.o Python/codecs.o Python/compile.o Python/context.o Python/dynamic_annotations.o Python/errors.o Python/frame.o Python/frozenmain.o Python/future.o Python/getargs.o Python/getcompiler.o Python/getcopyright.o Python/getplatform.o Python/getversion.o Python/hamt.o Python/hashtable.o Python/import.o Python/importdl.o Python/initconfig.o Python/marshal.o Python/modsupport.o Python/mysnprintf.o Python/mystrtoul.o Python/pathconfig.o Python/preconfig.o Python/pyarena.o Python/pyctype.o Python/pyfpe.o Python/pyhash.o Python/pylifecycle.o Python/pymath.o Python/pystate.o Python/pythonrun.o Python/pytime.o Python/bootstrap_hash.o Python/specialize.o Python/structmember.o Python/symtable.o Python/sysmodule.o Python/thread.o Python/traceback.o Python/getopt.o Python/pystrcmp.o Python/pystrtod.o Python/pystrhex.o Python/dtoa.o Python/formatter_unicode.o Python/fileutils.o Python/suggestions.o Python/dynload_shlib.o Modules/config.o Modules/main.o Modules/gcmodule.o Modules/atexitmodule.o Modules/faulthandler.o Modules/posixmodule.o Modules/signalmodule.o Modules/_tracemalloc.o Modules/_codecsmodule.o Modules/_collectionsmodule.o Modules/errnomodule.o Modules/_io/_iomodule.o Modules/_io/iobase.o Modules/_io/fileio.o Modules/_io/bytesio.o Modules/_io/bufferedio.o Modules/_io/textio.o Modules/_io/stringio.o Modules/itertoolsmodule.o Modules/_sre/sre.o Modules/_threadmodule.o Modules/timemodule.o Modules/_weakref.o Modules/_abc.o Modules/_functoolsmodule.o Modules/_localemodule.o Modules/_operator.o Modules/_stat.o Modules/symtablemodule.o Modules/pwdmodule.o Modules/xxsubtype.o Python/deepfreeze/deepfreeze.o Modules/getpath.o Python/frozen.o -ldl -lm; \
- fi
- ar rcs libpython3.11.a Modules/getbuildinfo.o Parser/token.o Parser/pegen.o Parser/pegen_errors.o Parser/action_helpers.o Parser/parser.o Parser/string_parser.o Parser/peg_api.o Parser/myreadline.o Parser/tokenizer.o Objects/abstract.o Objects/accu.o Objects/boolobject.o Objects/bytes_methods.o Objects/bytearrayobject.o Objects/bytesobject.o Objects/call.o Objects/capsule.o Objects/cellobject.o Objects/classobject.o Objects/codeobject.o Objects/complexobject.o Objects/descrobject.o Objects/enumobject.o Objects/exceptions.o Objects/genericaliasobject.o Objects/genobject.o Objects/fileobject.o Objects/floatobject.o Objects/frameobject.o Objects/funcobject.o Objects/interpreteridobject.o Objects/iterobject.o Objects/listobject.o Objects/longobject.o Objects/dictobject.o Objects/odictobject.o Objects/memoryobject.o Objects/methodobject.o Objects/moduleobject.o Objects/namespaceobject.o Objects/object.o Objects/obmalloc.o Objects/picklebufobject.o Objects/rangeobject.o Objects/setobject.o Objects/sliceobject.o Objects/structseq.o Objects/tupleobject.o Objects/typeobject.o Objects/unicodeobject.o Objects/unicodectype.o Objects/unionobject.o Objects/weakrefobject.o Python/_warnings.o Python/Python-ast.o Python/Python-tokenize.o Python/asdl.o Python/ast.o Python/ast_opt.o Python/ast_unparse.o Python/bltinmodule.o Python/ceval.o Python/codecs.o Python/compile.o Python/context.o Python/dynamic_annotations.o Python/errors.o Python/frame.o Python/frozenmain.o Python/future.o Python/getargs.o Python/getcompiler.o Python/getcopyright.o Python/getplatform.o Python/getversion.o Python/hamt.o Python/hashtable.o Python/import.o Python/importdl.o Python/initconfig.o Python/marshal.o Python/modsupport.o Python/mysnprintf.o Python/mystrtoul.o Python/pathconfig.o Python/preconfig.o Python/pyarena.o Python/pyctype.o Python/pyfpe.o Python/pyhash.o Python/pylifecycle.o Python/pymath.o Python/pystate.o Python/pythonrun.o Python/pytime.o Python/bootstrap_hash.o Python/specialize.o Python/structmember.o Python/symtable.o Python/sysmodule.o Python/thread.o Python/traceback.o Python/getopt.o Python/pystrcmp.o Python/pystrtod.o Python/pystrhex.o Python/dtoa.o Python/formatter_unicode.o Python/fileutils.o Python/suggestions.o Python/dynload_shlib.o Modules/config.o Modules/main.o Modules/gcmodule.o Modules/atexitmodule.o Modules/faulthandler.o Modules/posixmodule.o Modules/signalmodule.o Modules/_tracemalloc.o Modules/_codecsmodule.o Modules/_collectionsmodule.o Modules/errnomodule.o Modules/_io/_iomodule.o Modules/_io/iobase.o Modules/_io/fileio.o Modules/_io/bytesio.o Modules/_io/bufferedio.o Modules/_io/textio.o Modules/_io/stringio.o Modules/itertoolsmodule.o Modules/_sre/sre.o Modules/_threadmodule.o Modules/timemodule.o Modules/_weakref.o Modules/_abc.o Modules/_functoolsmodule.o Modules/_localemodule.o Modules/_operator.o Modules/_stat.o Modules/symtablemodule.o Modules/pwdmodule.o Modules/xxsubtype.o Python/deepfreeze/deepfreeze.o Modules/getpath.o Python/frozen.o
- gcc -shared -Wl,-O1 -Wl,--sort-common -Wl,--as-needed -Wl,-z,relro -Wl,-z,now -Wl,-z,pack-relative-relocs -Wl,-O1 -Wl,--sort-common -Wl,--as-needed -Wl,-z,relro -Wl,-z,now -Wl,-z,pack-relative-relocs -Wl,--no-as-needed -o libpython3.so -Wl,-hlibpython3.so libpython3.11.so
- gcc -Wl,-O1 -Wl,--sort-common -Wl,--as-needed -Wl,-z,relro -Wl,-z,now -Wl,-z,pack-relative-relocs -Wl,-O1 -Wl,--sort-common -Wl,--as-needed -Wl,-z,relro -Wl,-z,now -Wl,-z,pack-relative-relocs -Xlinker -export-dynamic -o python Programs/python.o -L. -lpython3.11 -ldl -lm
- gcc -Wl,-O1 -Wl,--sort-common -Wl,--as-needed -Wl,-z,relro -Wl,-z,now -Wl,-z,pack-relative-relocs -Wl,-O1 -Wl,--sort-common -Wl,--as-needed -Wl,-z,relro -Wl,-z,now -Wl,-z,pack-relative-relocs -Xlinker -export-dynamic -o Programs/_testembed Programs/_testembed.o -L. -lpython3.11 -ldl -lm
- /usr/bin/ld: Programs/_testembed.o: in function `config_set_string':
- /mnt/Linux Files/Invoke-manual/python311/src/Python-3.11.14/./Programs/_testembed.c:56:(.text+0x93): undefined reference to `__gcov_time_profiler_counter'
- /usr/bin/ld: Programs/_testembed.o: in function `init_from_config_clear':
- /mnt/Linux Files/Invoke-manual/python311/src/Python-3.11.14/./Programs/_testembed.c:73:(.text+0x19b): undefined reference to `__gcov_time_profiler_counter'
- /usr/bin/ld: Programs/_testembed.o: in function `_testembed_Py_InitializeFromConfig':
- /mnt/Linux Files/Invoke-manual/python311/src/Python-3.11.14/./Programs/_testembed.c:82:(.text+0x283): undefined reference to `__gcov_time_profiler_counter'
- /usr/bin/ld: Programs/_testembed.o: in function `config_set_argv':
- LD_LIBRARY_PATH=/mnt/Linux Files/Invoke-manual/python311/src/Python-3.11.14 ./python -E -S -m sysconfig --generate-posix-vars ;\
- if test $? -ne 0 ; then \
- echo "generate-posix-vars failed" ; \
- rm -f ./pybuilddir.txt ; \
- exit 1 ; \
- fi
- /mnt/Linux Files/Invoke-manual/python311/src/Python-3.11.14/./Programs/_testembed.c:456:(.text+0x333): undefined reference to `__gcov_time_profiler_counter'
- /usr/bin/ld: Programs/_testembed.o: in function `set_all_env_vars':
- /mnt/Linux Files/Invoke-manual/python311/src/Python-3.11.14/./Programs/_testembed.c:783:(.text+0x583): undefined reference to `__gcov_time_profiler_counter'
- /usr/bin/ld: Programs/_testembed.o:/mnt/Linux Files/Invoke-manual/python311/src/Python-3.11.14/./Programs/_testembed.c:783: more undefined references to `__gcov_time_profiler_counter' follow
- /usr/bin/ld: Programs/_testembed.o: in function `free_wrapper':
- /mnt/Linux Files/Invoke-manual/python311/src/Python-3.11.14/./Programs/_testembed.c:2005:(.text+0x8fb): undefined reference to `__gcov_indirect_call'
- /usr/bin/ld: /mnt/Linux Files/Invoke-manual/python311/src/Python-3.11.14/./Programs/_testembed.c:2007:(.text+0x923): undefined reference to `__gcov_indirect_call'
- /usr/bin/ld: /mnt/Linux Files/Invoke-manual/python311/src/Python-3.11.14/./Programs/_testembed.c:2008:(.text+0x976): undefined reference to `__gcov_indirect_call_profiler_v4'
- /usr/bin/ld: /mnt/Linux Files/Invoke-manual/python311/src/Python-3.11.14/./Programs/_testembed.c:2008:(.text+0x983): undefined reference to `__gcov_time_profiler_counter'
- /usr/bin/ld: Programs/_testembed.o: in function `realloc_wrapper':
- /mnt/Linux Files/Invoke-manual/python311/src/Python-3.11.14/./Programs/_testembed.c:1998:(.text+0x9bc): undefined reference to `__gcov_indirect_call'
- /usr/bin/ld: /mnt/Linux Files/Invoke-manual/python311/src/Python-3.11.14/./Programs/_testembed.c:2000:(.text+0x9e4): undefined reference to `__gcov_indirect_call'
- /usr/bin/ld: /mnt/Linux Files/Invoke-manual/python311/src/Python-3.11.14/./Programs/_testembed.c:2001:(.text+0xa36): undefined reference to `__gcov_indirect_call_profiler_v4'
- /usr/bin/ld: /mnt/Linux Files/Invoke-manual/python311/src/Python-3.11.14/./Programs/_testembed.c:2001:(.text+0xa43): undefined reference to `__gcov_time_profiler_counter'
- /usr/bin/ld: Programs/_testembed.o: in function `calloc_wrapper':
- /mnt/Linux Files/Invoke-manual/python311/src/Python-3.11.14/./Programs/_testembed.c:1991:(.text+0xa7c): undefined reference to `__gcov_indirect_call'
- /usr/bin/ld: /mnt/Linux Files/Invoke-manual/python311/src/Python-3.11.14/./Programs/_testembed.c:1993:(.text+0xaa4): undefined reference to `__gcov_indirect_call'
- /usr/bin/ld: /mnt/Linux Files/Invoke-manual/python311/src/Python-3.11.14/./Programs/_testembed.c:1994:(.text+0xaf6): undefined reference to `__gcov_indirect_call_profiler_v4'
- /usr/bin/ld: /mnt/Linux Files/Invoke-manual/python311/src/Python-3.11.14/./Programs/_testembed.c:1994:(.text+0xb03): undefined reference to `__gcov_time_profiler_counter'
- /usr/bin/ld: Programs/_testembed.o: in function `malloc_wrapper':
- /mnt/Linux Files/Invoke-manual/python311/src/Python-3.11.14/./Programs/_testembed.c:1981:(.text+0xb64): undefined reference to `__gcov_indirect_call'
- /usr/bin/ld: /mnt/Linux Files/Invoke-manual/python311/src/Python-3.11.14/./Programs/_testembed.c:1986:(.text+0xc33): undefined reference to `__gcov_indirect_call'
- /usr/bin/ld: /mnt/Linux Files/Invoke-manual/python311/src/Python-3.11.14/./Programs/_testembed.c:1987:(.text+0xc8e): undefined reference to `__gcov_indirect_call_profiler_v4'
- /usr/bin/ld: /mnt/Linux Files/Invoke-manual/python311/src/Python-3.11.14/./Programs/_testembed.c:1987:(.text+0xca3): undefined reference to `__gcov_time_profiler_counter'
- /usr/bin/ld: /mnt/Linux Files/Invoke-manual/python311/src/Python-3.11.14/./Programs/_testembed.c:1987:(.text+0xcc3): undefined reference to `__gcov_time_profiler_counter'
- /usr/bin/ld: Programs/_testembed.o: in function `test_repeated_init_and_inittab':
- /mnt/Linux Files/Invoke-manual/python311/src/Python-3.11.14/./Programs/_testembed.c:1945:(.text+0xd34): undefined reference to `__gcov_indirect_call'
- /usr/bin/ld: /mnt/Linux Files/Invoke-manual/python311/src/Python-3.11.14/./Programs/_testembed.c:1974:(.text+0xe66): undefined reference to `__gcov_indirect_call_profiler_v4'
- /usr/bin/ld: /mnt/Linux Files/Invoke-manual/python311/src/Python-3.11.14/./Programs/_testembed.c:1974:(.text+0xe73): undefined reference to `__gcov_time_profiler_counter'
- /usr/bin/ld: Programs/_testembed.o: in function `test_frozenmain':
- /mnt/Linux Files/Invoke-manual/python311/src/Python-3.11.14/./Programs/_testembed.c:1927:(.text+0xf0f): undefined reference to `__gcov_indirect_call'
- /usr/bin/ld: /mnt/Linux Files/Invoke-manual/python311/src/Python-3.11.14/./Programs/_testembed.c:1941:(.text+0xfbe): undefined reference to `__gcov_indirect_call_profiler_v4'
- /usr/bin/ld: /mnt/Linux Files/Invoke-manual/python311/src/Python-3.11.14/./Programs/_testembed.c:1941:(.text+0xfd3): undefined reference to `__gcov_time_profiler_counter'
- /usr/bin/ld: Programs/_testembed.o: in function `test_unicode_id_init':
- /mnt/Linux Files/Invoke-manual/python311/src/Python-3.11.14/./Programs/_testembed.c:1889:(.text+0x1013): undefined reference to `__gcov_indirect_call'
- /usr/bin/ld: /mnt/Linux Files/Invoke-manual/python311/src/Python-3.11.14/./Programs/_testembed.c:1900:(.text+0x113e): undefined reference to `__gcov_indirect_call_profiler_v4'
- /usr/bin/ld: /mnt/Linux Files/Invoke-manual/python311/src/Python-3.11.14/./Programs/_testembed.c:1900:(.text+0x1153): undefined reference to `__gcov_time_profiler_counter'
- /usr/bin/ld: Programs/_testembed.o: in function `test_get_argc_argv':
- /mnt/Linux Files/Invoke-manual/python311/src/Python-3.11.14/./Programs/_testembed.c:1808:(.text+0x1193): undefined reference to `__gcov_indirect_call'
- /usr/bin/ld: /mnt/Linux Files/Invoke-manual/python311/src/Python-3.11.14/./Programs/_testembed.c:1841:(.text+0x14e3): undefined reference to `__gcov_time_profiler_counter'
- /usr/bin/ld: /mnt/Linux Files/Invoke-manual/python311/src/Python-3.11.14/./Programs/_testembed.c:1841:(.text+0x150e): undefined reference to `__gcov_indirect_call_profiler_v4'
- /usr/bin/ld: Programs/_testembed.o: in function `test_run_main':
- /mnt/Linux Files/Invoke-manual/python311/src/Python-3.11.14/./Programs/_testembed.c:1777:(.text+0x1593): undefined reference to `__gcov_indirect_call'
- /usr/bin/ld: /mnt/Linux Files/Invoke-manual/python311/src/Python-3.11.14/./Programs/_testembed.c:1790:(.text+0x1696): undefined reference to `__gcov_indirect_call_profiler_v4'
- /usr/bin/ld: /mnt/Linux Files/Invoke-manual/python311/src/Python-3.11.14/./Programs/_testembed.c:1790:(.text+0x16a3): undefined reference to `__gcov_time_profiler_counter'
- /usr/bin/ld: Programs/_testembed.o: in function `test_run_main_loop':
- /mnt/Linux Files/Invoke-manual/python311/src/Python-3.11.14/./Programs/_testembed.c:1794:(.text+0x16e1): undefined reference to `__gcov_indirect_call'
- /usr/bin/ld: /mnt/Linux Files/Invoke-manual/python311/src/Python-3.11.14/./Programs/_testembed.c:1804:(.text+0x1743): undefined reference to `__gcov_time_profiler_counter'
- /usr/bin/ld: /mnt/Linux Files/Invoke-manual/python311/src/Python-3.11.14/./Programs/_testembed.c:1804:(.text+0x176e): undefined reference to `__gcov_indirect_call_profiler_v4'
- /usr/bin/ld: Programs/_testembed.o: in function `test_init_main':
- /mnt/Linux Files/Invoke-manual/python311/src/Python-3.11.14/./Programs/_testembed.c:1750:(.text+0x17a3): undefined reference to `__gcov_indirect_call'
- /usr/bin/ld: /mnt/Linux Files/Invoke-manual/python311/src/Python-3.11.14/./Programs/_testembed.c:1773:(.text+0x193e): undefined reference to `__gcov_indirect_call_profiler_v4'
- /usr/bin/ld: /mnt/Linux Files/Invoke-manual/python311/src/Python-3.11.14/./Programs/_testembed.c:1773:(.text+0x1953): undefined reference to `__gcov_time_profiler_counter'
- /usr/bin/ld: /mnt/Linux Files/Invoke-manual/python311/src/Python-3.11.14/./Programs/_testembed.c:1773:(.text+0x1973): undefined reference to `__gcov_time_profiler_counter'
- /usr/bin/ld: Programs/_testembed.o: in function `test_init_set_config':
- /mnt/Linux Files/Invoke-manual/python311/src/Python-3.11.14/./Programs/_testembed.c:1695:(.text+0x1a03): undefined reference to `__gcov_indirect_call'
- /usr/bin/ld: /mnt/Linux Files/Invoke-manual/python311/src/Python-3.11.14/./Programs/_testembed.c:1719:(.text+0x1bae): undefined reference to `__gcov_indirect_call_profiler_v4'
- /usr/bin/ld: /mnt/Linux Files/Invoke-manual/python311/src/Python-3.11.14/./Programs/_testembed.c:1719:(.text+0x1bc3): undefined reference to `__gcov_time_profiler_counter'
- /usr/bin/ld: /mnt/Linux Files/Invoke-manual/python311/src/Python-3.11.14/./Programs/_testembed.c:1719:(.text+0x1be3): undefined reference to `__gcov_time_profiler_counter'
- /usr/bin/ld: Programs/_testembed.o: in function `test_init_warnoptions':
- /mnt/Linux Files/Invoke-manual/python311/src/Python-3.11.14/./Programs/_testembed.c:1621:(.text+0x1cc7): undefined reference to `__gcov_indirect_call'
- /usr/bin/ld: /mnt/Linux Files/Invoke-manual/python311/src/Python-3.11.14/./Programs/_testembed.c:1670:(.text+0x1f9e): undefined reference to `__gcov_indirect_call_profiler_v4'
- /usr/bin/ld: /mnt/Linux Files/Invoke-manual/python311/src/Python-3.11.14/./Programs/_testembed.c:1670:(.text+0x1fb3): undefined reference to `__gcov_time_profiler_counter'
- /usr/bin/ld: Programs/_testembed.o: in function `test_init_sys_add':
- /mnt/Linux Files/Invoke-manual/python311/src/Python-3.11.14/./Programs/_testembed.c:1451:(.text+0x2085): undefined reference to `__gcov_indirect_call'
- /usr/bin/ld: /mnt/Linux Files/Invoke-manual/python311/src/Python-3.11.14/./Programs/_testembed.c:1492:(.text+0x22ae): undefined reference to `__gcov_indirect_call_profiler_v4'
- /usr/bin/ld: /mnt/Linux Files/Invoke-manual/python311/src/Python-3.11.14/./Programs/_testembed.c:1492:(.text+0x22c3): undefined reference to `__gcov_time_profiler_counter'
- /usr/bin/ld: Programs/_testembed.o: in function `test_init_read_set':
- /mnt/Linux Files/Invoke-manual/python311/src/Python-3.11.14/./Programs/_testembed.c:1408:(.text+0x2367): undefined reference to `__gcov_indirect_call'
- /usr/bin/ld: /mnt/Linux Files/Invoke-manual/python311/src/Python-3.11.14/./Programs/_testembed.c:1447:(.text+0x259e): undefined reference to `__gcov_indirect_call_profiler_v4'
- /usr/bin/ld: /mnt/Linux Files/Invoke-manual/python311/src/Python-3.11.14/./Programs/_testembed.c:1447:(.text+0x25b3): undefined reference to `__gcov_time_profiler_counter'
- /usr/bin/ld: Programs/_testembed.o: in function `test_audit_run_file':
- /mnt/Linux Files/Invoke-manual/python311/src/Python-3.11.14/./Programs/_testembed.c:1352:(.text+0x265f): undefined reference to `__gcov_indirect_call'
- /usr/bin/ld: /mnt/Linux Files/Invoke-manual/python311/src/Python-3.11.14/./Programs/_testembed.c:1360:(.text+0x271e): undefined reference to `__gcov_indirect_call_profiler_v4'
- /usr/bin/ld: /mnt/Linux Files/Invoke-manual/python311/src/Python-3.11.14/./Programs/_testembed.c:1360:(.text+0x2733): undefined reference to `__gcov_time_profiler_counter'
- /usr/bin/ld: Programs/_testembed.o: in function `test_audit_run_command':
- /mnt/Linux Files/Invoke-manual/python311/src/Python-3.11.14/./Programs/_testembed.c:1341:(.text+0x277f): undefined reference to `__gcov_indirect_call'
- /usr/bin/ld: /mnt/Linux Files/Invoke-manual/python311/src/Python-3.11.14/./Programs/_testembed.c:1349:(.text+0x2846): undefined reference to `__gcov_indirect_call_profiler_v4'
- /usr/bin/ld: /mnt/Linux Files/Invoke-manual/python311/src/Python-3.11.14/./Programs/_testembed.c:1349:(.text+0x2853): undefined reference to `__gcov_time_profiler_counter'
- /usr/bin/ld: Programs/_testembed.o: in function `_audit_hook_run':
- /mnt/Linux Files/Invoke-manual/python311/src/Python-3.11.14/./Programs/_testembed.c:1321:(.text+0x289e): undefined reference to `__gcov_indirect_call'
- /usr/bin/ld: /mnt/Linux Files/Invoke-manual/python311/src/Python-3.11.14/./Programs/_testembed.c:1338:(.text+0x293b): undefined reference to `__gcov_time_profiler_counter'
- /usr/bin/ld: /mnt/Linux Files/Invoke-manual/python311/src/Python-3.11.14/./Programs/_testembed.c:1338:(.text+0x2966): undefined reference to `__gcov_indirect_call_profiler_v4'
- /usr/bin/ld: Programs/_testembed.o: in function `test_audit_subinterpreter':
- /mnt/Linux Files/Invoke-manual/python311/src/Python-3.11.14/./Programs/_testembed.c:1297:(.text+0x2a0c): undefined reference to `__gcov_indirect_call'
- /usr/bin/ld: /mnt/Linux Files/Invoke-manual/python311/src/Python-3.11.14/./Programs/_testembed.c:1313:(.text+0x2ae3): undefined reference to `__gcov_time_profiler_counter'
- /usr/bin/ld: /mnt/Linux Files/Invoke-manual/python311/src/Python-3.11.14/./Programs/_testembed.c:1313:(.text+0x2b0e): undefined reference to `__gcov_indirect_call_profiler_v4'
- /usr/bin/ld: Programs/_testembed.o: in function `_audit_subinterpreter_hook':
- /mnt/Linux Files/Invoke-manual/python311/src/Python-3.11.14/./Programs/_testembed.c:1288:(.text+0x2b34): undefined reference to `__gcov_indirect_call'
- /usr/bin/ld: /mnt/Linux Files/Invoke-manual/python311/src/Python-3.11.14/./Programs/_testembed.c:1294:(.text+0x2bbe): undefined reference to `__gcov_indirect_call_profiler_v4'
- /usr/bin/ld: /mnt/Linux Files/Invoke-manual/python311/src/Python-3.11.14/./Programs/_testembed.c:1294:(.text+0x2bcb): undefined reference to `__gcov_time_profiler_counter'
- /usr/bin/ld: Programs/_testembed.o: in function `_audit_hook':
- /mnt/Linux Files/Invoke-manual/python311/src/Python-3.11.14/./Programs/_testembed.c:1222:(.text+0x2c0e): undefined reference to `__gcov_indirect_call'
- /usr/bin/ld: /mnt/Linux Files/Invoke-manual/python311/src/Python-3.11.14/./Programs/_testembed.c:1226:(.text+0x2d0e): undefined reference to `__gcov_indirect_call_profiler_v4'
- /usr/bin/ld: /mnt/Linux Files/Invoke-manual/python311/src/Python-3.11.14/./Programs/_testembed.c:1226:(.text+0x2d23): undefined reference to `__gcov_time_profiler_counter'
- /usr/bin/ld: Programs/_testembed.o: in function `test_open_code_hook':
- /mnt/Linux Files/Invoke-manual/python311/src/Python-3.11.14/./Programs/_testembed.c:1163:(.text+0x2d90): undefined reference to `__gcov_indirect_call'
- /usr/bin/ld: /mnt/Linux Files/Invoke-manual/python311/src/Python-3.11.14/./Programs/_testembed.c:1186:(.text+0x300e): undefined reference to `__gcov_indirect_call_profiler_v4'
- /usr/bin/ld: /mnt/Linux Files/Invoke-manual/python311/src/Python-3.11.14/./Programs/_testembed.c:1186:(.text+0x3023): undefined reference to `__gcov_time_profiler_counter'
- /usr/bin/ld: Programs/_testembed.o: in function `_open_code_hook':
- /mnt/Linux Files/Invoke-manual/python311/src/Python-3.11.14/./Programs/_testembed.c:1151:(.text+0x3175): undefined reference to `__gcov_indirect_call'
- /usr/bin/ld: /mnt/Linux Files/Invoke-manual/python311/src/Python-3.11.14/./Programs/_testembed.c:1160:(.text+0x3233): undefined reference to `__gcov_time_profiler_counter'
- /usr/bin/ld: /mnt/Linux Files/Invoke-manual/python311/src/Python-3.11.14/./Programs/_testembed.c:1160:(.text+0x325e): undefined reference to `__gcov_indirect_call_profiler_v4'
- /usr/bin/ld: Programs/_testembed.o: in function `test_init_dev_mode':
- /mnt/Linux Files/Invoke-manual/python311/src/Python-3.11.14/./Programs/_testembed.c:1135:(.text+0x32a3): undefined reference to `__gcov_indirect_call'
- /usr/bin/ld: /mnt/Linux Files/Invoke-manual/python311/src/Python-3.11.14/./Programs/_testembed.c:1148:(.text+0x339e): undefined reference to `__gcov_indirect_call_profiler_v4'
- /usr/bin/ld: /mnt/Linux Files/Invoke-manual/python311/src/Python-3.11.14/./Programs/_testembed.c:1148:(.text+0x33b3): undefined reference to `__gcov_time_profiler_counter'
- /usr/bin/ld: Programs/_testembed.o: in function `test_init_dont_configure_locale':
- /mnt/Linux Files/Invoke-manual/python311/src/Python-3.11.14/./Programs/_testembed.c:1109:(.text+0x3403): undefined reference to `__gcov_indirect_call'
- /usr/bin/ld: /mnt/Linux Files/Invoke-manual/python311/src/Python-3.11.14/./Programs/_testembed.c:1131:(.text+0x354e): undefined reference to `__gcov_indirect_call_profiler_v4'
- /usr/bin/ld: /mnt/Linux Files/Invoke-manual/python311/src/Python-3.11.14/./Programs/_testembed.c:1131:(.text+0x3563): undefined reference to `__gcov_time_profiler_counter'
- /usr/bin/ld: Programs/_testembed.o: in function `test_preinit_parse_argv':
- /mnt/Linux Files/Invoke-manual/python311/src/Python-3.11.14/./Programs/_testembed.c:965:(.text+0x35e3): undefined reference to `__gcov_indirect_call'
- /usr/bin/ld: /mnt/Linux Files/Invoke-manual/python311/src/Python-3.11.14/./Programs/_testembed.c:979:(.text+0x370e): undefined reference to `__gcov_indirect_call_profiler_v4'
- /usr/bin/ld: /mnt/Linux Files/Invoke-manual/python311/src/Python-3.11.14/./Programs/_testembed.c:979:(.text+0x3723): undefined reference to `__gcov_time_profiler_counter'
- /usr/bin/ld: Programs/_testembed.o: in function `test_preinit_dont_parse_argv':
- /mnt/Linux Files/Invoke-manual/python311/src/Python-3.11.14/./Programs/_testembed.c:927:(.text+0x37b1): undefined reference to `__gcov_indirect_call'
- /usr/bin/ld: /mnt/Linux Files/Invoke-manual/python311/src/Python-3.11.14/./Programs/_testembed.c:961:(.text+0x3976): undefined reference to `__gcov_indirect_call_profiler_v4'
- /usr/bin/ld: /mnt/Linux Files/Invoke-manual/python311/src/Python-3.11.14/./Programs/_testembed.c:961:(.text+0x3983): undefined reference to `__gcov_time_profiler_counter'
- /usr/bin/ld: Programs/_testembed.o: in function `test_preinit_isolated2':
- /mnt/Linux Files/Invoke-manual/python311/src/Python-3.11.14/./Programs/_testembed.c:898:(.text+0x3a03): undefined reference to `__gcov_indirect_call'
- /usr/bin/ld: /mnt/Linux Files/Invoke-manual/python311/src/Python-3.11.14/./Programs/_testembed.c:923:(.text+0x3b5e): undefined reference to `__gcov_indirect_call_profiler_v4'
- /usr/bin/ld: /mnt/Linux Files/Invoke-manual/python311/src/Python-3.11.14/./Programs/_testembed.c:923:(.text+0x3b73): undefined reference to `__gcov_time_profiler_counter'
- /usr/bin/ld: Programs/_testembed.o: in function `test_preinit_isolated1':
- /mnt/Linux Files/Invoke-manual/python311/src/Python-3.11.14/./Programs/_testembed.c:872:(.text+0x3bf3): undefined reference to `__gcov_indirect_call'
- /usr/bin/ld: /mnt/Linux Files/Invoke-manual/python311/src/Python-3.11.14/./Programs/_testembed.c:893:(.text+0x3d36): undefined reference to `__gcov_indirect_call_profiler_v4'
- /usr/bin/ld: /mnt/Linux Files/Invoke-manual/python311/src/Python-3.11.14/./Programs/_testembed.c:893:(.text+0x3d43): undefined reference to `__gcov_time_profiler_counter'
- /usr/bin/ld: Programs/_testembed.o: in function `test_init_isolated_flag':
- /mnt/Linux Files/Invoke-manual/python311/src/Python-3.11.14/./Programs/_testembed.c:848:(.text+0x3dc3): undefined reference to `__gcov_indirect_call'
- /usr/bin/ld: /mnt/Linux Files/Invoke-manual/python311/src/Python-3.11.14/./Programs/_testembed.c:867:(.text+0x3ec6): undefined reference to `__gcov_indirect_call_profiler_v4'
- /usr/bin/ld: /mnt/Linux Files/Invoke-manual/python311/src/Python-3.11.14/./Programs/_testembed.c:867:(.text+0x3ed3): undefined reference to `__gcov_time_profiler_counter'
- /usr/bin/ld: Programs/_testembed.o: in function `test_init_env_dev_mode_alloc':
- /mnt/Linux Files/Invoke-manual/python311/src/Python-3.11.14/./Programs/_testembed.c:835:(.text+0x3f0c): undefined reference to `__gcov_indirect_call'
- /usr/bin/ld: /mnt/Linux Files/Invoke-manual/python311/src/Python-3.11.14/./Programs/_testembed.c:844:(.text+0x3ffe): undefined reference to `__gcov_indirect_call_profiler_v4'
- /usr/bin/ld: /mnt/Linux Files/Invoke-manual/python311/src/Python-3.11.14/./Programs/_testembed.c:844:(.text+0x4013): undefined reference to `__gcov_time_profiler_counter'
- /usr/bin/ld: /mnt/Linux Files/Invoke-manual/python311/src/Python-3.11.14/./Programs/_testembed.c:844:(.text+0x4033): undefined reference to `__gcov_time_profiler_counter'
- /usr/bin/ld: Programs/_testembed.o: in function `test_init_python_env':
- /mnt/Linux Files/Invoke-manual/python311/src/Python-3.11.14/./Programs/_testembed.c:799:(.text+0x4073): undefined reference to `__gcov_indirect_call'
- /usr/bin/ld: /mnt/Linux Files/Invoke-manual/python311/src/Python-3.11.14/./Programs/_testembed.c:811:(.text+0x4146): undefined reference to `__gcov_indirect_call_profiler_v4'
- /usr/bin/ld: /mnt/Linux Files/Invoke-manual/python311/src/Python-3.11.14/./Programs/_testembed.c:811:(.text+0x4153): undefined reference to `__gcov_time_profiler_counter'
- /usr/bin/ld: /bin/sh: line 1: Files/Invoke-manual/python311/src/Python-3.11.14: No such file or directory
- Programs/_testembed.o: in function `test_init_compat_env':
- /mnt/Linux Files/Invoke-manual/python311/src/Python-3.11.14/./Programs/_testembed.c:787:(.text+0x418c): undefined reference to `__gcov_indirect_call'
- /usr/bin/ld: /mnt/Linux Files/Invoke-manual/python311/src/Python-3.11.14/./Programs/_testembed.c:795:(.text+0x420e): undefined reference to `__gcov_indirect_call_profiler_v4'
- /usr/bin/ld: /mnt/Linux Files/Invoke-manual/python311/src/Python-3.11.14/./Programs/_testembed.c:795:(.text+0x421b): undefined reference to `__gcov_time_profiler_counter'
- /usr/bin/ld: Programs/_testembed.o: in function `test_init_from_config':
- /mnt/Linux Files/Invoke-manual/python311/src/Python-3.11.14/./Programs/_testembed.c:559:(.text+0x4267): undefined reference to `__gcov_indirect_call'
- /usr/bin/ld: /mnt/Linux Files/Invoke-manual/python311/src/Python-3.11.14/./Programs/_testembed.c:714:(.text+0x48ae): undefined reference to `__gcov_indirect_call_profiler_v4'
- /usr/bin/ld: /mnt/Linux Files/Invoke-manual/python311/src/Python-3.11.14/./Programs/_testembed.c:714:(.text+0x48c3): undefined reference to `__gcov_time_profiler_counter'
- /usr/bin/ld: Programs/_testembed.o: in function `test_init_global_config':
- /mnt/Linux Files/Invoke-manual/python311/src/Python-3.11.14/./Programs/_testembed.c:510:(.text+0x495c): undefined reference to `__gcov_indirect_call'
- /usr/bin/ld: /mnt/Linux Files/Invoke-manual/python311/src/Python-3.11.14/./Programs/_testembed.c:555:(.text+0x4b16): undefined reference to `__gcov_indirect_call_profiler_v4'
- /usr/bin/ld: /mnt/Linux Files/Invoke-manual/python311/src/Python-3.11.14/./Programs/_testembed.c:555:(.text+0x4b23): undefined reference to `__gcov_time_profiler_counter'
- /usr/bin/ld: generate-posix-vars failed
- Programs/_testembed.o: in function `test_init_initialize_config':
- /mnt/Linux Files/Invoke-manual/python311/src/Python-3.11.14/./Programs/_testembed.c:441:(.text+0x4b4c): undefined reference to `__gcov_indirect_call'
- /usr/bin/ld: /mnt/Linux Files/Invoke-manual/python311/src/Python-3.11.14/./Programs/_testembed.c:446:(.text+0x4bbe): undefined reference to `__gcov_indirect_call_profiler_v4'
- /usr/bin/ld: /mnt/Linux Files/Invoke-manual/python311/src/Python-3.11.14/./Programs/_testembed.c:446:(.text+0x4bcb): undefined reference to `__gcov_time_profiler_counter'
- /usr/bin/ld: Programs/_testembed.o: in function `test_initialize_pymain':
- /mnt/Linux Files/Invoke-manual/python311/src/Python-3.11.14/./Programs/_testembed.c:413:(.text+0x4c0f): undefined reference to `__gcov_indirect_call'
- /usr/bin/ld: /mnt/Linux Files/Invoke-manual/python311/src/Python-3.11.14/./Programs/_testembed.c:427:(.text+0x4cce): undefined reference to `__gcov_indirect_call_profiler_v4'
- /usr/bin/ld: /mnt/Linux Files/Invoke-manual/python311/src/Python-3.11.14/./Programs/_testembed.c:427:(.text+0x4ce3): undefined reference to `__gcov_time_profiler_counter'
- /usr/bin/ld: Programs/_testembed.o: in function `test_initialize_twice':
- /mnt/Linux Files/Invoke-manual/python311/src/Python-3.11.14/./Programs/_testembed.c:400:(.text+0x4d1c): undefined reference to `__gcov_indirect_call'
- /usr/bin/ld: /mnt/Linux Files/Invoke-manual/python311/src/Python-3.11.14/./Programs/_testembed.c:410:(.text+0x4d7e): undefined reference to `__gcov_indirect_call_profiler_v4'
- /usr/bin/ld: /mnt/Linux Files/Invoke-manual/python311/src/Python-3.11.14/./Programs/_testembed.c:410:(.text+0x4d8b): undefined reference to `__gcov_time_profiler_counter'
- /usr/bin/ld: Programs/_testembed.o: in function `bpo20891_thread':
- /mnt/Linux Files/Invoke-manual/python311/src/Python-3.11.14/./Programs/_testembed.c:351:(.text+0x4dc2): undefined reference to `__gcov_indirect_call'
- /usr/bin/ld: /mnt/Linux Files/Invoke-manual/python311/src/Python-3.11.14/./Programs/_testembed.c:363:(.text+0x4e46): undefined reference to `__gcov_indirect_call_profiler_v4'
- /usr/bin/ld: /mnt/Linux Files/Invoke-manual/python311/src/Python-3.11.14/./Programs/_testembed.c:363:(.text+0x4e53): undefined reference to `__gcov_time_profiler_counter'
- /usr/bin/ld: /mnt/Linux Files/Invoke-manual/python311/src/Python-3.11.14/./Programs/_testembed.c:357:(.text+0x4ed6): undefined reference to `__gcov_time_profiler_counter'
- /usr/bin/ld: Programs/_testembed.o: in function `test_pre_initialization_sys_options':
- /mnt/Linux Files/Invoke-manual/python311/src/Python-3.11.14/./Programs/_testembed.c:299:(.text+0x4f03): undefined reference to `__gcov_indirect_call'
- /usr/bin/ld: /mnt/Linux Files/Invoke-manual/python311/src/Python-3.11.14/./Programs/_testembed.c:346:(.text+0x51ee): undefined reference to `__gcov_indirect_call_profiler_v4'
- /usr/bin/ld: /mnt/Linux Files/Invoke-manual/python311/src/Python-3.11.14/./Programs/_testembed.c:346:(.text+0x5203): undefined reference to `__gcov_time_profiler_counter'
- /usr/bin/ld: Programs/_testembed.o: in function `test_pre_initialization_api':
- /mnt/Linux Files/Invoke-manual/python311/src/Python-3.11.14/./Programs/_testembed.c:269:(.text+0x522f): undefined reference to `__gcov_indirect_call'
- /usr/bin/ld: /mnt/Linux Files/Invoke-manual/python311/src/Python-3.11.14/./Programs/_testembed.c:294:(.text+0x5416): undefined reference to `__gcov_indirect_call_profiler_v4'
- /usr/bin/ld: /mnt/Linux Files/Invoke-manual/python311/src/Python-3.11.14/./Programs/_testembed.c:294:(.text+0x5423): undefined reference to `__gcov_time_profiler_counter'
- /usr/bin/ld: Programs/_testembed.o: in function `test_forced_io_encoding':
- /mnt/Linux Files/Invoke-manual/python311/src/Python-3.11.14/./Programs/_testembed.c:237:(.text+0x548c): undefined reference to `__gcov_indirect_call'
- /usr/bin/ld: Programs/_testembed.o: in function `printf':
- /usr/include/bits/stdio2.h:118:(.text+0x55eb): undefined reference to `__gcov_time_profiler_counter'
- /usr/bin/ld: /usr/include/bits/stdio2.h:118:(.text+0x5616): undefined reference to `__gcov_indirect_call_profiler_v4'
- /usr/bin/ld: Programs/_testembed.o: in function `test_repeated_simple_init':
- /mnt/Linux Files/Invoke-manual/python311/src/Python-3.11.14/./Programs/_testembed.c:192:(.text+0x5635): undefined reference to `__gcov_indirect_call'
- /usr/bin/ld: /mnt/Linux Files/Invoke-manual/python311/src/Python-3.11.14/./Programs/_testembed.c:202:(.text+0x5716): undefined reference to `__gcov_indirect_call_profiler_v4'
- /usr/bin/ld: /mnt/Linux Files/Invoke-manual/python311/src/Python-3.11.14/./Programs/_testembed.c:202:(.text+0x5723): undefined reference to `__gcov_time_profiler_counter'
- /usr/bin/ld: Programs/_testembed.o: in function `test_repeated_init_exec':
- /mnt/Linux Files/Invoke-manual/python311/src/Python-3.11.14/./Programs/_testembed.c:166:(.text+0x5759): undefined reference to `__gcov_indirect_call'
- /usr/bin/ld: /mnt/Linux Files/Invoke-manual/python311/src/Python-3.11.14/./Programs/_testembed.c:185:(.text+0x5846): undefined reference to `__gcov_indirect_call_profiler_v4'
- /usr/bin/ld: /mnt/Linux Files/Invoke-manual/python311/src/Python-3.11.14/./Programs/_testembed.c:185:(.text+0x5863): undefined reference to `__gcov_time_profiler_counter'
- /usr/bin/ld: Programs/_testembed.o: in function `PyInit_embedded_ext':
- /mnt/Linux Files/Invoke-manual/python311/src/Python-3.11.14/./Programs/_testembed.c:154:(.text+0x58dc): undefined reference to `__gcov_indirect_call'
- /usr/bin/ld: /mnt/Linux Files/Invoke-manual/python311/src/Python-3.11.14/./Programs/_testembed.c:156:(.text+0x592e): undefined reference to `__gcov_indirect_call_profiler_v4'
- /usr/bin/ld: /mnt/Linux Files/Invoke-manual/python311/src/Python-3.11.14/./Programs/_testembed.c:156:(.text+0x593b): undefined reference to `__gcov_time_profiler_counter'
- /usr/bin/ld: Programs/_testembed.o: in function `test_repeated_init_and_subinterpreters':
- /mnt/Linux Files/Invoke-manual/python311/src/Python-3.11.14/./Programs/_testembed.c:113:(.text+0x5979): undefined reference to `__gcov_indirect_call'
- /usr/bin/ld: /mnt/Linux Files/Invoke-manual/python311/src/Python-3.11.14/./Programs/_testembed.c:142:(.text+0x5ace): undefined reference to `__gcov_indirect_call_profiler_v4'
- /usr/bin/ld: /mnt/Linux Files/Invoke-manual/python311/src/Python-3.11.14/./Programs/_testembed.c:142:(.text+0x5ae3): undefined reference to `__gcov_time_profiler_counter'
- /usr/bin/ld: Programs/_testembed.o: in function `run_audit_run_test':
- /mnt/Linux Files/Invoke-manual/python311/src/Python-3.11.14/./Programs/_testembed.c:1384:(.text+0x5c33): undefined reference to `__gcov_time_profiler_counter'
- /usr/bin/ld: Programs/_testembed.o: in function `test_audit_run_interactivehook':
- /mnt/Linux Files/Invoke-manual/python311/src/Python-3.11.14/./Programs/_testembed.c:1387:(.text+0x5caf): undefined reference to `__gcov_indirect_call'
- /usr/bin/ld: /mnt/Linux Files/Invoke-manual/python311/src/Python-3.11.14/./Programs/_testembed.c:1391:(.text+0x5d2e): undefined reference to `__gcov_indirect_call_profiler_v4'
- /usr/bin/ld: /mnt/Linux Files/Invoke-manual/python311/src/Python-3.11.14/./Programs/_testembed.c:1391:(.text+0x5d3b): undefined reference to `__gcov_time_profiler_counter'
- /usr/bin/ld: Programs/_testembed.o: in function `test_audit_run_startup':
- /mnt/Linux Files/Invoke-manual/python311/src/Python-3.11.14/./Programs/_testembed.c:1394:(.text+0x5d7f): undefined reference to `__gcov_indirect_call'
- /usr/bin/ld: /mnt/Linux Files/Invoke-manual/python311/src/Python-3.11.14/./Programs/_testembed.c:1398:(.text+0x5dfe): undefined reference to `__gcov_indirect_call_profiler_v4'
- /usr/bin/ld: /mnt/Linux Files/Invoke-manual/python311/src/Python-3.11.14/./Programs/_testembed.c:1398:(.text+0x5e0b): undefined reference to `__gcov_time_profiler_counter'
- /usr/bin/ld: Programs/_testembed.o: in function `test_audit_run_stdin':
- /mnt/Linux Files/Invoke-manual/python311/src/Python-3.11.14/./Programs/_testembed.c:1401:(.text+0x5e4f): undefined reference to `__gcov_indirect_call'
- /usr/bin/ld: /mnt/Linux Files/Invoke-manual/python311/src/Python-3.11.14/./Programs/_testembed.c:1405:(.text+0x5ece): undefined reference to `__gcov_indirect_call_profiler_v4'
- /usr/bin/ld: /mnt/Linux Files/Invoke-manual/python311/src/Python-3.11.14/./Programs/_testembed.c:1405:(.text+0x5edb): undefined reference to `__gcov_time_profiler_counter'
- /usr/bin/ld: Programs/_testembed.o: in function `test_audit':
- /mnt/Linux Files/Invoke-manual/python311/src/Python-3.11.14/./Programs/_testembed.c:1276:(.text+0x5f20): undefined reference to `__gcov_indirect_call'
- /usr/bin/ld: Programs/_testembed.o: in function `_test_audit':
- /mnt/Linux Files/Invoke-manual/python311/src/Python-3.11.14/./Programs/_testembed.c:1258:(.text+0x60f6): undefined reference to `__gcov_indirect_call_profiler_v4'
- /usr/bin/ld: /mnt/Linux Files/Invoke-manual/python311/src/Python-3.11.14/./Programs/_testembed.c:1258:(.text+0x6103): undefined reference to `__gcov_time_profiler_counter'
- /usr/bin/ld: /mnt/Linux Files/Invoke-manual/python311/src/Python-3.11.14/./Programs/_testembed.c:1258:(.text+0x6123): undefined reference to `__gcov_time_profiler_counter'
- /usr/bin/ld: Programs/_testembed.o: in function `check_init_python_config':
- /mnt/Linux Files/Invoke-manual/python311/src/Python-3.11.14/./Programs/_testembed.c:1093:(.text+0x63e3): undefined reference to `__gcov_time_profiler_counter'
- /usr/bin/ld: Programs/_testembed.o: in function `test_preinit_python_config':
- /mnt/Linux Files/Invoke-manual/python311/src/Python-3.11.14/./Programs/_testembed.c:1097:(.text+0x644c): undefined reference to `__gcov_indirect_call'
- /usr/bin/ld: /mnt/Linux Files/Invoke-manual/python311/src/Python-3.11.14/./Programs/_testembed.c:1099:(.text+0x649e): undefined reference to `__gcov_indirect_call_profiler_v4'
- /usr/bin/ld: /mnt/Linux Files/Invoke-manual/python311/src/Python-3.11.14/./Programs/_testembed.c:1099:(.text+0x64ab): undefined reference to `__gcov_time_profiler_counter'
- /usr/bin/ld: Programs/_testembed.o: in function `test_init_python_config':
- /mnt/Linux Files/Invoke-manual/python311/src/Python-3.11.14/./Programs/_testembed.c:1103:(.text+0x64dc): undefined reference to `__gcov_indirect_call'
- /usr/bin/ld: /mnt/Linux Files/Invoke-manual/python311/src/Python-3.11.14/./Programs/_testembed.c:1105:(.text+0x6526): undefined reference to `__gcov_indirect_call_profiler_v4'
- /usr/bin/ld: /mnt/Linux Files/Invoke-manual/python311/src/Python-3.11.14/./Programs/_testembed.c:1105:(.text+0x6533): undefined reference to `__gcov_time_profiler_counter'
- /usr/bin/ld: Programs/_testembed.o: in function `check_preinit_isolated_config':
- /mnt/Linux Files/Invoke-manual/python311/src/Python-3.11.14/./Programs/_testembed.c:1028:(.text+0x67a3): undefined reference to `__gcov_time_profiler_counter'
- /usr/bin/ld: Programs/_testembed.o: in function `test_preinit_isolated_config':
- /mnt/Linux Files/Invoke-manual/python311/src/Python-3.11.14/./Programs/_testembed.c:1048:(.text+0x680c): undefined reference to `__gcov_indirect_call'
- /usr/bin/ld: /mnt/Linux Files/Invoke-manual/python311/src/Python-3.11.14/./Programs/_testembed.c:1050:(.text+0x685e): undefined reference to `__gcov_indirect_call_profiler_v4'
- /usr/bin/ld: /mnt/Linux Files/Invoke-manual/python311/src/Python-3.11.14/./Programs/_testembed.c:1050:(.text+0x686b): undefined reference to `__gcov_time_profiler_counter'
- /usr/bin/ld: Programs/_testembed.o: in function `test_init_isolated_config':
- /mnt/Linux Files/Invoke-manual/python311/src/Python-3.11.14/./Programs/_testembed.c:1054:(.text+0x689c): undefined reference to `__gcov_indirect_call'
- /usr/bin/ld: /mnt/Linux Files/Invoke-manual/python311/src/Python-3.11.14/./Programs/_testembed.c:1056:(.text+0x68e6): undefined reference to `__gcov_indirect_call_profiler_v4'
- /usr/bin/ld: /mnt/Linux Files/Invoke-manual/python311/src/Python-3.11.14/./Programs/_testembed.c:1056:(.text+0x68f3): undefined reference to `__gcov_time_profiler_counter'
- /usr/bin/ld: Programs/_testembed.o: in function `check_init_parse_argv':
- /mnt/Linux Files/Invoke-manual/python311/src/Python-3.11.14/./Programs/_testembed.c:739:(.text+0x6a33): undefined reference to `__gcov_time_profiler_counter'
- /usr/bin/ld: Programs/_testembed.o: in function `test_init_parse_argv':
- /mnt/Linux Files/Invoke-manual/python311/src/Python-3.11.14/./Programs/_testembed.c:743:(.text+0x6a6c): undefined reference to `__gcov_indirect_call'
- /usr/bin/ld: /mnt/Linux Files/Invoke-manual/python311/src/Python-3.11.14/./Programs/_testembed.c:745:(.text+0x6abe): undefined reference to `__gcov_indirect_call_profiler_v4'
- /usr/bin/ld: /mnt/Linux Files/Invoke-manual/python311/src/Python-3.11.14/./Programs/_testembed.c:745:(.text+0x6acb): undefined reference to `__gcov_time_profiler_counter'
- /usr/bin/ld: Programs/_testembed.o: in function `test_init_dont_parse_argv':
- /mnt/Linux Files/Invoke-manual/python311/src/Python-3.11.14/./Programs/_testembed.c:749:(.text+0x6afc): undefined reference to `__gcov_indirect_call'
- /usr/bin/ld: /mnt/Linux Files/Invoke-manual/python311/src/Python-3.11.14/./Programs/_testembed.c:751:(.text+0x6b46): undefined reference to `__gcov_indirect_call_profiler_v4'
- /usr/bin/ld: /mnt/Linux Files/Invoke-manual/python311/src/Python-3.11.14/./Programs/_testembed.c:751:(.text+0x6b53): undefined reference to `__gcov_time_profiler_counter'
- /usr/bin/ld: Programs/_testembed.o: in function `check_init_compat_config':
- /mnt/Linux Files/Invoke-manual/python311/src/Python-3.11.14/./Programs/_testembed.c:494:(.text+0x6c9b): undefined reference to `__gcov_time_profiler_counter'
- /usr/bin/ld: Programs/_testembed.o: in function `test_preinit_compat_config':
- /mnt/Linux Files/Invoke-manual/python311/src/Python-3.11.14/./Programs/_testembed.c:498:(.text+0x6d0c): undefined reference to `__gcov_indirect_call'
- /usr/bin/ld: /mnt/Linux Files/Invoke-manual/python311/src/Python-3.11.14/./Programs/_testembed.c:500:(.text+0x6d5e): undefined reference to `__gcov_indirect_call_profiler_v4'
- /usr/bin/ld: /mnt/Linux Files/Invoke-manual/python311/src/Python-3.11.14/./Programs/_testembed.c:500:(.text+0x6d6b): undefined reference to `__gcov_time_profiler_counter'
- /usr/bin/ld: Programs/_testembed.o: in function `test_init_compat_config':
- /mnt/Linux Files/Invoke-manual/python311/src/Python-3.11.14/./Programs/_testembed.c:504:(.text+0x6d9c): undefined reference to `__gcov_indirect_call'
- /usr/bin/ld: /mnt/Linux Files/Invoke-manual/python311/src/Python-3.11.14/./Programs/_testembed.c:506:(.text+0x6de6): undefined reference to `__gcov_indirect_call_profiler_v4'
- /usr/bin/ld: /mnt/Linux Files/Invoke-manual/python311/src/Python-3.11.14/./Programs/_testembed.c:506:(.text+0x6df3): undefined reference to `__gcov_time_profiler_counter'
- /usr/bin/ld: Programs/_testembed.o: in function `test_init_run_main':
- /mnt/Linux Files/Invoke-manual/python311/src/Python-3.11.14/./Programs/_testembed.c:1738:(.text+0x6e33): undefined reference to `__gcov_indirect_call'
- /usr/bin/ld: /mnt/Linux Files/Invoke-manual/python311/src/Python-3.11.14/./Programs/_testembed.c:1746:(.text+0x6f5e): undefined reference to `__gcov_indirect_call_profiler_v4'
- /usr/bin/ld: /mnt/Linux Files/Invoke-manual/python311/src/Python-3.11.14/./Programs/_testembed.c:1746:(.text+0x6f73): undefined reference to `__gcov_time_profiler_counter'
- /usr/bin/ld: /mnt/Linux Files/Invoke-manual/python311/src/Python-3.11.14/./Programs/_testembed.c:1746:(.text+0x6f93): undefined reference to `__gcov_time_profiler_counter'
- /usr/bin/ld: Programs/_testembed.o: in function `test_init_env_dev_mode':
- /mnt/Linux Files/Invoke-manual/python311/src/Python-3.11.14/./Programs/_testembed.c:823:(.text+0x6fcc): undefined reference to `__gcov_indirect_call'
- /usr/bin/ld: /mnt/Linux Files/Invoke-manual/python311/src/Python-3.11.14/./Programs/_testembed.c:831:(.text+0x70ae): undefined reference to `__gcov_indirect_call_profiler_v4'
- /usr/bin/ld: /mnt/Linux Files/Invoke-manual/python311/src/Python-3.11.14/./Programs/_testembed.c:831:(.text+0x70c3): undefined reference to `__gcov_time_profiler_countermake: *** [Makefile:857: pybuilddir.txt] Error 1
- '
- /usr/bin/ld: /mnt/Linux Files/Invoke-manual/python311/src/Python-3.11.14/./Programs/_testembed.c:831:(.textmake: *** Waiting for unfinished jobs....
- +0x70e3): undefined reference to `__gcov_time_profiler_counter'
- /usr/bin/ld: Programs/_testembed.o: in function `test_get_incomplete_frame':
- /mnt/Linux Files/Invoke-manual/python311/src/Python-3.11.14/./Programs/_testembed.c:2032:(.text+0x7120): undefined reference to `__gcov_indirect_call'
- /usr/bin/ld: /mnt/Linux Files/Invoke-manual/python311/src/Python-3.11.14/./Programs/_testembed.c:2041:(.text+0x724e): undefined reference to `__gcov_indirect_call_profiler_v4'
- /usr/bin/ld: /mnt/Linux Files/Invoke-manual/python311/src/Python-3.11.14/./Programs/_testembed.c:2041:(.text+0x7263): undefined reference to `__gcov_time_profiler_counter'
- /usr/bin/ld: /mnt/Linux Files/Invoke-manual/python311/src/Python-3.11.14/./Programs/_testembed.c:2041:(.text+0x7283): undefined reference to `__gcov_time_profiler_counter'
- /usr/bin/ld: Programs/_testembed.o: in function `test_bpo20891':
- /mnt/Linux Files/Invoke-manual/python311/src/Python-3.11.14/./Programs/_testembed.c:366:(.text+0x72d0): undefined reference to `__gcov_indirect_call'
- /usr/bin/ld: /mnt/Linux Files/Invoke-manual/python311/src/Python-3.11.14/./Programs/_testembed.c:397:(.text+0x73fe): undefined reference to `__gcov_indirect_call_profiler_v4'
- /usr/bin/ld: /mnt/Linux Files/Invoke-manual/python311/src/Python-3.11.14/./Programs/_testembed.c:397:(.text+0x7413): undefined reference to `__gcov_time_profiler_counter'
- /usr/bin/ld: /mnt/Linux Files/Invoke-manual/python311/src/Python-3.11.14/./Programs/_testembed.c:383:(.text+0x751b): undefined reference to `__gcov_time_profiler_counter'
- /usr/bin/ld: /mnt/Linux Files/Invoke-manual/python311/src/Python-3.11.14/./Programs/_testembed.c:383:(.text+0x753b): undefined reference to `__gcov_time_profiler_counter'
- /usr/bin/ld: Programs/_testembed.o: in function `test_init_setpythonhome':
- /mnt/Linux Files/Invoke-manual/python311/src/Python-3.11.14/./Programs/_testembed.c:1558:(.text+0x7570): undefined reference to `__gcov_indirect_call'
- /usr/bin/ld: /mnt/Linux Files/Invoke-manual/python311/src/Python-3.11.14/./Programs/_testembed.c:1577:(.text+0x765e): undefined reference to `__gcov_indirect_call_profiler_v4'
- /usr/bin/ld: /mnt/Linux Files/Invoke-manual/python311/src/Python-3.11.14/./Programs/_testembed.c:1577:(.text+0x7673): undefined reference to `__gcov_time_profiler_counter'
- /usr/bin/ld: /mnt/Linux Files/Invoke-manual/python311/src/Python-3.11.14/./Programs/_testembed.c:1567:(.text+0x777b): undefined reference to `__gcov_time_profiler_counter'
- /usr/bin/ld: /mnt/Linux Files/Invoke-manual/python311/src/Python-3.11.14/./Programs/_testembed.c:1567:(.text+0x779b): undefined reference to `__gcov_time_profiler_counter'
- /usr/bin/ld: Programs/_testembed.o: in function `test_init_setpath':
- /mnt/Linux Files/Invoke-manual/python311/src/Python-3.11.14/./Programs/_testembed.c:1496:(.text+0x77d0): undefined reference to `__gcov_indirect_call'
- /usr/bin/ld: /mnt/Linux Files/Invoke-manual/python311/src/Python-3.11.14/./Programs/_testembed.c:1515:(.text+0x78be): undefined reference to `__gcov_indirect_call_profiler_v4'
- /usr/bin/ld: /mnt/Linux Files/Invoke-manual/python311/src/Python-3.11.14/./Programs/_testembed.c:1515:(.text+0x78d3): undefined reference to `__gcov_time_profiler_counter'
- /usr/bin/ld: /mnt/Linux Files/Invoke-manual/python311/src/Python-3.11.14/./Programs/_testembed.c:1505:(.text+0x79db): undefined reference to `__gcov_time_profiler_counter'
- /usr/bin/ld: /mnt/Linux Files/Invoke-manual/python311/src/Python-3.11.14/./Programs/_testembed.c:1505:(.text+0x79fb): undefined reference to `__gcov_time_profiler_counter'
- /usr/bin/ld: Programs/_testembed.o: in function `test_init_is_python_build':
- /mnt/Linux Files/Invoke-manual/python311/src/Python-3.11.14/./Programs/_testembed.c:1581:(.text+0x7a45): undefined reference to `__gcov_indirect_call'
- /usr/bin/ld: /mnt/Linux Files/Invoke-manual/python311/src/Python-3.11.14/./Programs/_testembed.c:1607:(.text+0x7c1e): undefined reference to `__gcov_indirect_call_profiler_v4'
- /usr/bin/ld: /mnt/Linux Files/Invoke-manual/python311/src/Python-3.11.14/./Programs/_testembed.c:1607:(.text+0x7c33): undefined reference to `__gcov_time_profiler_counter'
- /usr/bin/ld: /mnt/Linux Files/Invoke-manual/python311/src/Python-3.11.14/./Programs/_testembed.c:1592:(.text+0x7d2b): undefined reference to `__gcov_time_profiler_counter'
- /usr/bin/ld: /mnt/Linux Files/Invoke-manual/python311/src/Python-3.11.14/./Programs/_testembed.c:1592:(.text+0x7d4b): undefined reference to `__gcov_time_profiler_counter'
- /usr/bin/ld: Programs/_testembed.o: in function `test_init_setpath_config':
- /mnt/Linux Files/Invoke-manual/python311/src/Python-3.11.14/./Programs/_testembed.c:1519:(.text+0x7d95): undefined reference to `__gcov_indirect_call'
- /usr/bin/ld: /mnt/Linux Files/Invoke-manual/python311/src/Python-3.11.14/./Programs/_testembed.c:1554:(.text+0x7f5e): undefined reference to `__gcov_indirect_call_profiler_v4'
- /usr/bin/ld: /mnt/Linux Files/Invoke-manual/python311/src/Python-3.11.14/./Programs/_testembed.c:1554:(.text+0x7f73): undefined reference to `__gcov_time_profiler_counter'
- /usr/bin/ld: /mnt/Linux Files/Invoke-manual/python311/src/Python-3.11.14/./Programs/_testembed.c:1538:(.text+0x806b): undefined reference to `__gcov_time_profiler_counter'
- /usr/bin/ld: /mnt/Linux Files/Invoke-manual/python311/src/Python-3.11.14/./Programs/_testembed.c:1538:(.text+0x808b): undefined reference to `__gcov_time_profiler_counter'
- /usr/bin/ld: Programs/_testembed.o: in function `wcscpy':
- /usr/include/bits/wchar2.h:79:(.text+0x828b): undefined reference to `__gcov_time_profiler_counter'
- /usr/bin/ld: Programs/_testembed.o: in function `check_use_frozen_modules':
- /mnt/Linux Files/Invoke-manual/python311/src/Python-3.11.14/./Programs/_testembed.c:1858:(.text+0x8312): undefined reference to `__gcov_time_profiler_counter'
- /usr/bin/ld: Programs/_testembed.o: in function `test_init_use_frozen_modules':
- /mnt/Linux Files/Invoke-manual/python311/src/Python-3.11.14/./Programs/_testembed.c:1882:(.text+0x833c): undefined reference to `__gcov_indirect_call'
- /usr/bin/ld: /mnt/Linux Files/Invoke-manual/python311/src/Python-3.11.14/./Programs/_testembed.c:1885:(.text+0x839e): undefined reference to `__gcov_indirect_call_profiler_v4'
- /usr/bin/ld: /mnt/Linux Files/Invoke-manual/python311/src/Python-3.11.14/./Programs/_testembed.c:1885:(.text+0x83ab): undefined reference to `__gcov_time_profiler_counter'
- /usr/bin/ld: Programs/_testembed.o: in function `main':
- /mnt/Linux Files/Invoke-manual/python311/src/Python-3.11.14/./Programs/_testembed.c:2133:(.text.startup+0x1a): undefined reference to `__gcov_indirect_call'
- /usr/bin/ld: /mnt/Linux Files/Invoke-manual/python311/src/Python-3.11.14/./Programs/_testembed.c:2140:(.text.startup+0xa2): undefined reference to `__gcov_indirect_call'
- /usr/bin/ld: /mnt/Linux Files/Invoke-manual/python311/src/Python-3.11.14/./Programs/_testembed.c:2154:(.text.startup+0x168): undefined reference to `__gcov_time_profiler_counter'
- /usr/bin/ld: /mnt/Linux Files/Invoke-manual/python311/src/Python-3.11.14/./Programs/_testembed.c:2154:(.text.startup+0x190): undefined reference to `__gcov_indirect_call_profiler_v4'
- /usr/bin/ld: Programs/_testembed.o: in function `_sub_I_00100_0':
- /mnt/Linux Files/Invoke-manual/python311/src/Python-3.11.14/./Programs/_testembed.c:2155:(.text.startup+0x1ad): undefined reference to `__gcov_init'
- /usr/bin/ld: Programs/_testembed.o: in function `_sub_D_00100_1':
- /mnt/Linux Files/Invoke-manual/python311/src/Python-3.11.14/./Programs/_testembed.c:2155:(.text.exit+0x6): undefined reference to `__gcov_exit'
- /usr/bin/ld: Programs/_testembed.o:(.data.rel+0x20): undefined reference to `__gcov_merge_add'
- /usr/bin/ld: Programs/_testembed.o:(.data.rel+0x40): undefined reference to `__gcov_merge_topn'
- /usr/bin/ld: Programs/_testembed.o:(.data.rel+0x58): undefined reference to `__gcov_merge_time_profile'
- collect2: error: ld returned 1 exit status
- make: *** [Makefile:1103: Programs/_testembed] Error 1
- ==> ERROR: A failure occurred in build().
- Aborting...
Advertisement
Add Comment
Please, Sign In to add comment