Guest User

Untitled

a guest
May 30th, 2017
170
Never
Not a member of Pastebin yet? Sign Up, it unlocks many cool features!
  1. DKMS make.log for rtl8812au-r49.86fe67d for kernel 4.11.3-1-ARCH (x86_64)
  2. Tue May 30 19:34:23 EDT 2017
  3. make ARCH=x86_64 CROSS_COMPILE= -C /lib/modules/4.11.3-1-ARCH/build M=/var/lib/dkms/rtl8812au/r49.86fe67d/build modules
  4. make[1]: Entering directory '/usr/lib/modules/4.11.3-1-ARCH/build'
  5. CC [M] /var/lib/dkms/rtl8812au/r49.86fe67d/build/core/rtw_cmd.o
  6. In file included from /var/lib/dkms/rtl8812au/r49.86fe67d/build/include/drv_types.h:32:0,
  7. from /var/lib/dkms/rtl8812au/r49.86fe67d/build/core/rtw_cmd.c:22:
  8. /var/lib/dkms/rtl8812au/r49.86fe67d/build/include/osdep_service.h: In function ‘thread_enter’:
  9. /var/lib/dkms/rtl8812au/r49.86fe67d/build/include/osdep_service.h:343:2: error: implicit declaration of function ‘allow_signal’; did you mean ‘do_signal’? [-Werror=implicit-function-declaration]
  10. allow_signal(SIGTERM);
  11. ^~~~~~~~~~~~
  12. do_signal
  13. /var/lib/dkms/rtl8812au/r49.86fe67d/build/include/osdep_service.h: In function ‘flush_signals_thread’:
  14. /var/lib/dkms/rtl8812au/r49.86fe67d/build/include/osdep_service.h:353:6: error: implicit declaration of function ‘signal_pending’; did you mean ‘timer_pending’? [-Werror=implicit-function-declaration]
  15. if (signal_pending (current))
  16. ^~~~~~~~~~~~~~
  17. timer_pending
  18. /var/lib/dkms/rtl8812au/r49.86fe67d/build/include/osdep_service.h:355:3: error: implicit declaration of function ‘flush_signals’; did you mean ‘do_signal’? [-Werror=implicit-function-declaration]
  19. flush_signals(current);
  20. ^~~~~~~~~~~~~
  21. do_signal
  22. cc1: some warnings being treated as errors
  23. make[2]: *** [scripts/Makefile.build:295: /var/lib/dkms/rtl8812au/r49.86fe67d/build/core/rtw_cmd.o] Error 1
  24. make[1]: *** [Makefile:1492: _module_/var/lib/dkms/rtl8812au/r49.86fe67d/build] Error 2
  25. make[1]: Leaving directory '/usr/lib/modules/4.11.3-1-ARCH/build'
  26. make: *** [Makefile:1264: modules] Error 2
RAW Paste Data